Diagnosed failure

Parameters/TestRpc.TestCallWithChainCertAndChainCA/SSL_TCP: /data0/somelongdirectorytoavoidrpathissues/src/kudu/src/kudu/rpc/rpc-test.cc:270: Failure
Failed
Bad status: Runtime error: could not verify certificate chain (error with cert: subject=CN = localhost, ST = sadfjas, C = AS, emailAddress = sdflkdsajf, O = lskdfjlsad, OU = sldfkja, issuer=C = AS, ST = ASDfkjdhf, L = lskdjf, O = saldfja, OU = skdjf, CN = localhost, emailAddress = sadjflkadsj): : certificate has expired
Google Test trace:
/data0/somelongdirectorytoavoidrpathissues/src/kudu/src/kudu/rpc/rpc-test.cc:267: Connecting to 0.0.0.0:40157
I20260929 19:01:16.918277  1269 test_util.cc:175] -----------------------------------------------
I20260929 19:01:16.918344  1269 test_util.cc:176] Had fatal failures, leaving test files at /tmp/dist-test-taskWae4SO/test-tmp/rpc-test.5.Parameters_TestRpc.TestCallWithChainCertAndChainCA_SSL_TCP.1790708476873558-1269-0

Full log

Note: This is test shard 6 of 8.
[==========] Running 21 tests from 2 test suites.
[----------] Global test environment set-up.
[----------] 20 tests from Parameters/TestRpc
[ RUN      ] Parameters/TestRpc.TestMessengerCreateDestroy/SSL_TCP
WARNING: Logging before InitGoogleLogging() is written to STDERR
I20260929 19:01:16.886489  1269 rpc-test.cc:169] started messenger TestCreateDestroy
[       OK ] Parameters/TestRpc.TestMessengerCreateDestroy/SSL_TCP (11 ms)
[ RUN      ] Parameters/TestRpc.TestNegotiationDeadlock/SSL_TCP
I20260929 19:01:16.900429  1290 acceptor_pool.cc:254] collecting diagnostics on the listening RPC socket 0.0.0.0:40515 every 8 connection(s)
I20260929 19:01:16.900429  1289 acceptor_pool.cc:254] collecting diagnostics on the listening RPC socket 0.0.0.0:40515 every 8 connection(s)
[       OK ] Parameters/TestRpc.TestNegotiationDeadlock/SSL_TCP (20 ms)
[ RUN      ] Parameters/TestRpc.TestCallWithChainCertAndChainCA/SSL_TCP
I20260929 19:01:16.914438  1306 acceptor_pool.cc:254] collecting diagnostics on the listening RPC socket 0.0.0.0:40157 every 8 connection(s)
I20260929 19:01:16.914438  1305 acceptor_pool.cc:254] collecting diagnostics on the listening RPC socket 0.0.0.0:40157 every 8 connection(s)
/data0/somelongdirectorytoavoidrpathissues/src/kudu/src/kudu/rpc/rpc-test.cc:270: Failure
Failed
Bad status: Runtime error: could not verify certificate chain (error with cert: subject=CN = localhost, ST = sadfjas, C = AS, emailAddress = sdflkdsajf, O = lskdfjlsad, OU = sldfkja, issuer=C = AS, ST = ASDfkjdhf, L = lskdjf, O = saldfja, OU = skdjf, CN = localhost, emailAddress = sadjflkadsj): : certificate has expired
Google Test trace:
/data0/somelongdirectorytoavoidrpathissues/src/kudu/src/kudu/rpc/rpc-test.cc:267: Connecting to 0.0.0.0:40157
I20260929 19:01:16.918277  1269 test_util.cc:175] -----------------------------------------------
I20260929 19:01:16.918344  1269 test_util.cc:176] Had fatal failures, leaving test files at /tmp/dist-test-taskWae4SO/test-tmp/rpc-test.5.Parameters_TestRpc.TestCallWithChainCertAndChainCA_SSL_TCP.1790708476873558-1269-0
[  FAILED  ] Parameters/TestRpc.TestCallWithChainCertAndChainCA/SSL_TCP, where GetParam() = (true, false) (10 ms)
[ RUN      ] Parameters/TestRpc.TestCallWithPasswordProtectedKey/SSL_TCP
I20260929 19:01:16.930502  1331 acceptor_pool.cc:254] collecting diagnostics on the listening RPC socket 0.0.0.0:34393 every 8 connection(s)
I20260929 19:01:16.930502  1330 acceptor_pool.cc:254] collecting diagnostics on the listening RPC socket 0.0.0.0:34393 every 8 connection(s)
[       OK ] Parameters/TestRpc.TestCallWithPasswordProtectedKey/SSL_TCP (24 ms)
[ RUN      ] Parameters/TestRpc.TestCallToBadServer/SSL_TCP
I20260929 19:01:16.968870  1269 rpc-test.cc:394] Status: Network error: Client connection negotiation failed: client connection to 0.0.0.0:0: connect: Connection refused (error 111)
I20260929 19:01:16.969318  1269 rpc-test.cc:394] Status: Network error: Client connection negotiation failed: client connection to 0.0.0.0:0: connect: Connection refused (error 111)
I20260929 19:01:16.969633  1269 rpc-test.cc:394] Status: Network error: Client connection negotiation failed: client connection to 0.0.0.0:0: connect: Connection refused (error 111)
I20260929 19:01:16.969954  1269 rpc-test.cc:394] Status: Network error: Client connection negotiation failed: client connection to 0.0.0.0:0: connect: Connection refused (error 111)
I20260929 19:01:16.970333  1269 rpc-test.cc:394] Status: Network error: Client connection negotiation failed: client connection to 0.0.0.0:0: connect: Connection refused (error 111)
[       OK ] Parameters/TestRpc.TestCallToBadServer/SSL_TCP (27 ms)
[ RUN      ] Parameters/TestRpc.TestWrongService/SSL_TCP
I20260929 19:01:16.979251  1365 acceptor_pool.cc:254] collecting diagnostics on the listening RPC socket 0.0.0.0:39835 every 8 connection(s)
I20260929 19:01:16.979303  1366 acceptor_pool.cc:254] collecting diagnostics on the listening RPC socket 0.0.0.0:39835 every 8 connection(s)
I20260929 19:01:17.005110  1364 messenger.cc:345] service WrongServiceName not registered on TestServer
[       OK ] Parameters/TestRpc.TestWrongService/SSL_TCP (35 ms)
[ RUN      ] Parameters/TestRpc.TestConnectionKeepalive/SSL_TCP
I20260929 19:01:17.029922  1388 acceptor_pool.cc:254] collecting diagnostics on the listening RPC socket 0.0.0.0:43381 every 8 connection(s)
I20260929 19:01:17.029986  1389 acceptor_pool.cc:254] collecting diagnostics on the listening RPC socket 0.0.0.0:43381 every 8 connection(s)
I20260929 19:01:17.030151  1269 rpc-test.cc:488] Connecting to 0.0.0.0:43381
[       OK ] Parameters/TestRpc.TestConnectionKeepalive/SSL_TCP (1051 ms)
[ RUN      ] Parameters/TestRpc.TestClientConnectionMetrics/SSL_TCP
I20260929 19:01:18.064877  1413 acceptor_pool.cc:254] collecting diagnostics on the listening RPC socket 0.0.0.0:46153 every 8 connection(s)
I20260929 19:01:18.064911  1414 acceptor_pool.cc:254] collecting diagnostics on the listening RPC socket 0.0.0.0:46153 every 8 connection(s)
I20260929 19:01:18.065104  1269 rpc-test.cc:569] Connecting to 0.0.0.0:46153
[       OK ] Parameters/TestRpc.TestClientConnectionMetrics/SSL_TCP (8804 ms)
[ RUN      ] Parameters/TestRpc.TestCredentialsPolicy/SSL_TCP
I20260929 19:01:26.881621  1436 acceptor_pool.cc:254] collecting diagnostics on the listening RPC socket 0.0.0.0:36917 every 8 connection(s)
I20260929 19:01:26.881668  1437 acceptor_pool.cc:254] collecting diagnostics on the listening RPC socket 0.0.0.0:36917 every 8 connection(s)
I20260929 19:01:26.881817  1269 rpc-test.cc:700] Connecting to 0.0.0.0:36917
[       OK ] Parameters/TestRpc.TestCredentialsPolicy/SSL_TCP (49 ms)
[ RUN      ] Parameters/TestRpc.TestCallLongerThanKeepalive/SSL_TCP
I20260929 19:01:26.919256  1461 acceptor_pool.cc:254] collecting diagnostics on the listening RPC socket 0.0.0.0:45145 every 8 connection(s)
I20260929 19:01:26.919301  1462 acceptor_pool.cc:254] collecting diagnostics on the listening RPC socket 0.0.0.0:45145 every 8 connection(s)
I20260929 19:01:26.941267  1465 rpc-test-base.h:222] got call: sleep_micros: 3000000 deferred: true
I20260929 19:01:29.941941  1465 rpcz_store.cc:275] Call kudu.rpc.GenericCalculatorService.Sleep from 127.0.0.1:50016 (request call id 0) took 3000 ms. Trace:
I20260929 19:01:29.942044  1465 rpcz_store.cc:276] 0929 19:01:26.941219 (+     0us) service_pool.cc:170] Inserting onto call queue
0929 19:01:26.941252 (+    33us) service_pool.cc:227] Handling call
0929 19:01:29.941925 (+3000673us) inbound_call.cc:173] Queueing success response
Metrics: {}
[       OK ] Parameters/TestRpc.TestCallLongerThanKeepalive/SSL_TCP (3032 ms)
[ RUN      ] Parameters/TestRpc.TestRpcSidecar/SSL_TCP
I20260929 19:01:29.966116  1486 acceptor_pool.cc:254] collecting diagnostics on the listening RPC socket 0.0.0.0:38659 every 8 connection(s)
I20260929 19:01:29.966140  1487 acceptor_pool.cc:254] collecting diagnostics on the listening RPC socket 0.0.0.0:38659 every 8 connection(s)
[       OK ] Parameters/TestRpc.TestRpcSidecar/SSL_TCP (63 ms)
[ RUN      ] Parameters/TestRpc.TestRpcSidecarLimits/SSL_TCP
I20260929 19:01:31.583977  1511 acceptor_pool.cc:254] collecting diagnostics on the listening RPC socket 0.0.0.0:46415 every 8 connection(s)
I20260929 19:01:31.584009  1512 acceptor_pool.cc:254] collecting diagnostics on the listening RPC socket 0.0.0.0:46415 every 8 connection(s)
W20260929 19:01:31.630795  1269 serialization.cc:72] Serialized kudu.rpc_test.PushStringsRequestPB (2147483654 bytes) is larger than the maximum configured RPC message size (52428800 bytes). Sending anyway, but peer may reject the data.
W20260929 19:01:31.634260  1510 connection.cc:535] server connection from 127.0.0.1:45746 recv error: Network error: RPC frame had a length of 2147483714, but we only support messages up to 52428800 bytes long.
W20260929 19:01:31.634313  1510 connection.cc:158] shutting down server connection from 127.0.0.1:45746 with pending inbound data: 4/2147483714 bytes received; last active 0 ns ago: status Network error: RPC frame had a length of 2147483714, but we only support messages up to 52428800 bytes long.
W20260929 19:01:31.634543  1524 connection.cc:196] Error closing socket: Network error: TlsSocket::Close: Connection reset by peer
I20260929 19:01:31.654217  1536 acceptor_pool.cc:254] collecting diagnostics on the listening RPC socket 0.0.0.0:34051 every 8 connection(s)
I20260929 19:01:31.654258  1537 acceptor_pool.cc:254] collecting diagnostics on the listening RPC socket 0.0.0.0:34051 every 8 connection(s)
W20260929 19:01:35.178650  1534 connection.cc:577] server connection from 127.0.0.1:39106: received bad data: 'Corruption: Invalid packet: message had a length of 2147483710, but we only support messages up to 2147483647 bytes
'
[       OK ] Parameters/TestRpc.TestRpcSidecarLimits/SSL_TCP (5172 ms)
[ RUN      ] Parameters/TestRpc.TestCallTimeoutDoesntAffectNegotiation/SSL_TCP
I20260929 19:01:35.194060  1561 acceptor_pool.cc:254] collecting diagnostics on the listening RPC socket 0.0.0.0:43387 every 8 connection(s)
I20260929 19:01:35.194092  1562 acceptor_pool.cc:254] collecting diagnostics on the listening RPC socket 0.0.0.0:43387 every 8 connection(s)
W20260929 19:01:35.203126  1557 negotiation.cc:266] Injecting 500ms delay in negotiation
I20260929 19:01:35.253340  1269 rpc-test-base.h:595] status: Timed out: connection negotiation to 0.0.0.0:43387 for RPC Sleep timed out after 0.050s (ON_OUTBOUND_QUEUE), seconds elapsed: 0.0505479
[       OK ] Parameters/TestRpc.TestCallTimeoutDoesntAffectNegotiation/SSL_TCP (526 ms)
[ RUN      ] Parameters/TestRpc.TestRpcHandlerLatencyMetric/SSL_TCP
I20260929 19:01:35.724784  1587 acceptor_pool.cc:254] collecting diagnostics on the listening RPC socket 0.0.0.0:36087 every 8 connection(s)
I20260929 19:01:35.724756  1586 acceptor_pool.cc:254] collecting diagnostics on the listening RPC socket 0.0.0.0:36087 every 8 connection(s)
I20260929 19:01:35.761698  1269 rpc-test.cc:1236] Sleep() min lat: 20272
I20260929 19:01:35.761897  1269 rpc-test.cc:1237] Sleep() mean lat: 20272
I20260929 19:01:35.761936  1269 rpc-test.cc:1238] Sleep() max lat: 20272
I20260929 19:01:35.761962  1269 rpc-test.cc:1239] Sleep() #calls: 1
[       OK ] Parameters/TestRpc.TestRpcHandlerLatencyMetric/SSL_TCP (55 ms)
[ RUN      ] Parameters/TestRpc.TimedOutOnResponseMetricServiceQueue/SSL_TCP
I20260929 19:01:35.776186  1612 acceptor_pool.cc:254] collecting diagnostics on the listening RPC socket 0.0.0.0:33741 every 8 connection(s)
I20260929 19:01:35.776209  1613 acceptor_pool.cc:254] collecting diagnostics on the listening RPC socket 0.0.0.0:33741 every 8 connection(s)
W20260929 19:01:35.839505  1614 rpcz_store.cc:267] Call kudu.rpc_test.CalculatorService.Sleep from 127.0.0.1:59944 (request call id 2) took 20 ms (client timeout 20 ms). Trace:
W20260929 19:01:35.839622  1614 rpcz_store.cc:269] 0929 19:01:35.819270 (+     0us) service_pool.cc:170] Inserting onto call queue
0929 19:01:35.839485 (+ 20215us) service_pool.cc:214] Skipping call since client already timed out
0929 19:01:35.839492 (+     7us) inbound_call.cc:173] Queueing failure response
Metrics: {}
[       OK ] Parameters/TestRpc.TimedOutOnResponseMetricServiceQueue/SSL_TCP (77 ms)
[ RUN      ] Parameters/TestRpc.RpcPendingConnectionsMetric/SSL_TCP
I20260929 19:01:35.843055  1635 acceptor_pool.cc:254] collecting diagnostics on the listening RPC socket 0.0.0.0:34367 every 8 connection(s)
I20260929 19:01:35.843118  1636 acceptor_pool.cc:254] collecting diagnostics on the listening RPC socket 0.0.0.0:34367 every 8 connection(s)
W20260929 19:01:35.843700  1631 negotiation.cc:337] Failed RPC negotiation. Trace:
0929 19:01:35.843500 (+     0us) reactor.cc:625] Submitting negotiation task for server connection from 127.0.0.1:34040 (local address 127.0.0.1:34367)
0929 19:01:35.843541 (+    41us) server_negotiation.cc:206] Beginning negotiation
0929 19:01:35.843543 (+     2us) server_negotiation.cc:399] Waiting for connection header
0929 19:01:35.843613 (+    70us) negotiation.cc:327] Negotiation complete: Network error: Server connection negotiation failed: server connection from 127.0.0.1:34040: BlockingRecv error: recv got EOF from 127.0.0.1:34040 (error 108)
Metrics: {"server-negotiator.queue_time_us":13}
[       OK ] Parameters/TestRpc.RpcPendingConnectionsMetric/SSL_TCP (13 ms)
[ RUN      ] Parameters/TestRpc.TestRpcContextClientDeadline/SSL_TCP
I20260929 19:01:35.861577  1651 acceptor_pool.cc:254] collecting diagnostics on the listening RPC socket 0.0.0.0:41691 every 8 connection(s)
I20260929 19:01:35.861629  1652 acceptor_pool.cc:254] collecting diagnostics on the listening RPC socket 0.0.0.0:41691 every 8 connection(s)
[       OK ] Parameters/TestRpc.TestRpcContextClientDeadline/SSL_TCP (59 ms)
[ RUN      ] Parameters/TestRpc.TestApplicationFeatureFlagUnsupportedServer/SSL_TCP
I20260929 19:01:35.931586  1676 acceptor_pool.cc:254] collecting diagnostics on the listening RPC socket 0.0.0.0:45583 every 8 connection(s)
I20260929 19:01:35.931607  1677 acceptor_pool.cc:254] collecting diagnostics on the listening RPC socket 0.0.0.0:45583 every 8 connection(s)
[       OK ] Parameters/TestRpc.TestApplicationFeatureFlagUnsupportedServer/SSL_TCP (29 ms)
[ RUN      ] Parameters/TestRpc.TestCancellationAsync/SSL_TCP
I20260929 19:01:35.972132  1701 acceptor_pool.cc:254] collecting diagnostics on the listening RPC socket 0.0.0.0:44795 every 8 connection(s)
I20260929 19:01:35.972180  1702 acceptor_pool.cc:254] collecting diagnostics on the listening RPC socket 0.0.0.0:44795 every 8 connection(s)
I20260929 19:01:35.972391  1269 rpc-test.cc:1716] Connecting to 0.0.0.0:44795
I20260929 19:01:35.988354  1269 test_util.cc:268] Using random seed: -808667520
I20260929 19:01:36.003014  1705 rpc-test-base.h:240] got call: sleep_micros: 500 pattern: 4294967295 num_repetitions: 2097152 sidecar_idx: 0
I20260929 19:01:36.014671  1705 rpc-test-base.h:240] got call: sleep_micros: 500 pattern: 4294967295 num_repetitions: 2097152 sidecar_idx: 0
I20260929 19:01:36.025698  1705 rpc-test-base.h:240] got call: sleep_micros: 500 pattern: 4294967295 num_repetitions: 2097152 sidecar_idx: 0
I20260929 19:01:36.036347  1705 rpc-test-base.h:240] got call: sleep_micros: 500 pattern: 4294967295 num_repetitions: 2097152 sidecar_idx: 0
I20260929 19:01:36.046989  1705 rpc-test-base.h:240] got call: sleep_micros: 500 pattern: 4294967295 num_repetitions: 2097152 sidecar_idx: 0
I20260929 19:01:36.057924  1705 rpc-test-base.h:240] got call: sleep_micros: 500 pattern: 4294967295 num_repetitions: 2097152 sidecar_idx: 0
I20260929 19:01:36.069284  1705 rpc-test-base.h:240] got call: sleep_micros: 500 pattern: 4294967295 num_repetitions: 2097152 sidecar_idx: 0
I20260929 19:01:36.080646  1705 rpc-test-base.h:240] got call: sleep_micros: 500 pattern: 4294967295 num_repetitions: 2097152 sidecar_idx: 0
W20260929 19:01:36.083676  1700 connection.cc:441] server connection from 127.0.0.1:53608 torn down before Call kudu.rpc.GenericCalculatorService.SleepWithSidecar from 127.0.0.1:53608 (request call id 9) could send its response
[       OK ] Parameters/TestRpc.TestCancellationAsync/SSL_TCP (140 ms)
[ RUN      ] Parameters/TestRpc.TestPerformanceBySocketType/SSL_TCP
I20260929 19:01:36.105974  1726 acceptor_pool.cc:254] collecting diagnostics on the listening RPC socket 0.0.0.0:42343 every 8 connection(s)
I20260929 19:01:36.106026  1727 acceptor_pool.cc:254] collecting diagnostics on the listening RPC socket 0.0.0.0:42343 every 8 connection(s)
I20260929 19:01:36.106201  1269 rpc-test.cc:1846] Connecting to 0.0.0.0:42343
I20260929 19:01:37.712973  1269 rpc-test.cc:1859] Sending 1024MB via ssl-enabled tcp socket: real 1.570s	user 1.468s	sys 1.352s
I20260929 19:01:39.281054  1269 rpc-test.cc:1859] Sending 1024MB via ssl-enabled tcp socket: real 1.568s	user 1.419s	sys 1.394s
I20260929 19:01:40.848366  1269 rpc-test.cc:1859] Sending 1024MB via ssl-enabled tcp socket: real 1.567s	user 1.329s	sys 1.474s
I20260929 19:01:42.355171  1269 rpc-test.cc:1859] Sending 1024MB via ssl-enabled tcp socket: real 1.507s	user 1.358s	sys 1.345s
I20260929 19:01:43.978327  1269 rpc-test.cc:1859] Sending 1024MB via ssl-enabled tcp socket: real 1.623s	user 1.501s	sys 1.401s
[       OK ] Parameters/TestRpc.TestPerformanceBySocketType/SSL_TCP (7895 ms)
[----------] 20 tests from Parameters/TestRpc (27104 ms total)

[----------] 1 test from Parameters/TestRpcSocketTxRxQueue
[ RUN      ] Parameters/TestRpcSocketTxRxQueue.OverCapacity/0
W20260929 19:01:44.249586  1770 negotiation.cc:337] Failed RPC negotiation. Trace:
0929 19:01:43.988401 (+     0us) reactor.cc:625] Submitting negotiation task for client connection to 0.0.0.0:45525 (local address 127.0.0.1:47984)
0929 19:01:43.988460 (+    59us) negotiation.cc:107] Waiting for socket to connect
0929 19:01:43.988471 (+    11us) client_negotiation.cc:174] Beginning negotiation
0929 19:01:43.988516 (+    45us) client_negotiation.cc:252] Sending NEGOTIATE NegotiatePB request
0929 19:01:44.249410 (+260894us) negotiation.cc:327] Negotiation complete: Network error: Client connection negotiation failed: client connection to 0.0.0.0:45525: BlockingRecv error: recv error from unknown peer: Transport endpoint is not connected (error 107)
Metrics: {"client-negotiator.queue_time_us":35}
W20260929 19:01:44.249748  1788 negotiation.cc:337] Failed RPC negotiation. Trace:
0929 19:01:43.990402 (+     0us) reactor.cc:625] Submitting negotiation task for client connection to 0.0.0.0:45525 (local address 127.0.0.1:48000)
0929 19:01:43.990438 (+    36us) negotiation.cc:107] Waiting for socket to connect
0929 19:01:43.990447 (+     9us) client_negotiation.cc:174] Beginning negotiation
0929 19:01:43.990488 (+    41us) client_negotiation.cc:252] Sending NEGOTIATE NegotiatePB request
0929 19:01:44.249567 (+259079us) negotiation.cc:327] Negotiation complete: Network error: Client connection negotiation failed: client connection to 0.0.0.0:45525: BlockingRecv error: recv error from unknown peer: Transport endpoint is not connected (error 107)
Metrics: {"client-negotiator.queue_time_us":16}
W20260929 19:01:44.249591  1761 negotiation.cc:337] Failed RPC negotiation. Trace:
0929 19:01:43.987352 (+     0us) reactor.cc:625] Submitting negotiation task for client connection to 0.0.0.0:45525 (local address 127.0.0.1:47982)
0929 19:01:43.987414 (+    62us) negotiation.cc:107] Waiting for socket to connect
0929 19:01:43.987425 (+    11us) client_negotiation.cc:174] Beginning negotiation
0929 19:01:43.987467 (+    42us) client_negotiation.cc:252] Sending NEGOTIATE NegotiatePB request
0929 19:01:44.249479 (+262012us) negotiation.cc:327] Negotiation complete: Network error: Client connection negotiation failed: client connection to 0.0.0.0:45525: BlockingRecv error: recv error from unknown peer: Transport endpoint is not connected (error 107)
Metrics: {"client-negotiator.queue_time_us":38}
W20260929 19:01:44.249951  1779 negotiation.cc:337] Failed RPC negotiation. Trace:
0929 19:01:43.989377 (+     0us) reactor.cc:625] Submitting negotiation task for client connection to 0.0.0.0:45525 (local address 127.0.0.1:47986)
0929 19:01:43.989438 (+    61us) negotiation.cc:107] Waiting for socket to connect
0929 19:01:43.989448 (+    10us) client_negotiation.cc:174] Beginning negotiation
0929 19:01:43.989489 (+    41us) client_negotiation.cc:252] Sending NEGOTIATE NegotiatePB request
0929 19:01:44.249567 (+260078us) negotiation.cc:327] Negotiation complete: Network error: Client connection negotiation failed: client connection to 0.0.0.0:45525: BlockingRecv error: recv error from unknown peer: Transport endpoint is not connected (error 107)
Metrics: {"client-negotiator.queue_time_us":36}
W20260929 19:01:44.250032  1743 negotiation.cc:337] Failed RPC negotiation. Trace:
0929 19:01:43.985314 (+     0us) reactor.cc:625] Submitting negotiation task for client connection to 0.0.0.0:45525 (local address 127.0.0.1:47968)
0929 19:01:43.985379 (+    65us) negotiation.cc:107] Waiting for socket to connect
0929 19:01:43.985390 (+    11us) client_negotiation.cc:174] Beginning negotiation
0929 19:01:43.985443 (+    53us) client_negotiation.cc:252] Sending NEGOTIATE NegotiatePB request
0929 19:01:44.249392 (+263949us) negotiation.cc:327] Negotiation complete: Network error: Client connection negotiation failed: client connection to 0.0.0.0:45525: BlockingRecv error: recv error from unknown peer: Transport endpoint is not connected (error 107)
Metrics: {"client-negotiator.queue_time_us":37}
W20260929 19:01:44.250041  1752 negotiation.cc:337] Failed RPC negotiation. Trace:
0929 19:01:43.986357 (+     0us) reactor.cc:625] Submitting negotiation task for client connection to 0.0.0.0:45525 (local address 127.0.0.1:47974)
0929 19:01:43.986423 (+    66us) negotiation.cc:107] Waiting for socket to connect
0929 19:01:43.986433 (+    10us) client_negotiation.cc:174] Beginning negotiation
0929 19:01:43.986475 (+    42us) client_negotiation.cc:252] Sending NEGOTIATE NegotiatePB request
0929 19:01:44.249479 (+263004us) negotiation.cc:327] Negotiation complete: Network error: Client connection negotiation failed: client connection to 0.0.0.0:45525: BlockingRecv error: recv error from unknown peer: Transport endpoint is not connected (error 107)
Metrics: {"client-negotiator.queue_time_us":39}
[       OK ] Parameters/TestRpcSocketTxRxQueue.OverCapacity/0 (1023 ms)
[----------] 1 test from Parameters/TestRpcSocketTxRxQueue (1023 ms total)

[----------] Global test environment tear-down
[==========] 21 tests from 2 test suites ran. (28128 ms total)
[  PASSED  ] 20 tests.
[  FAILED  ] 1 test, listed below:
[  FAILED  ] Parameters/TestRpc.TestCallWithChainCertAndChainCA/SSL_TCP, where GetParam() = (true, false)

 1 FAILED TEST