Diagnosed failure
Parameters/TestRpc.TestCallWithChainCertAndChainCA/SSL_UnixSocket: /data0/somelongdirectorytoavoidrpathissues/src/kudu/src/kudu/rpc/rpc-test.cc:270: Failure
Failed
Bad status: Runtime error: could not verify certificate chain (error with cert: subject=CN = localhost, ST = sadfjas, C = AS, emailAddress = sdflkdsajf, O = lskdfjlsad, OU = sldfkja, issuer=C = AS, ST = ASDfkjdhf, L = lskdjf, O = saldfja, OU = skdjf, CN = localhost, emailAddress = sadjflkadsj): : certificate has expired
Google Test trace:
/data0/somelongdirectorytoavoidrpathissues/src/kudu/src/kudu/rpc/rpc-test.cc:267: Connecting to unix:/tmp/dist-test-taskLJmlEJ/test-tmp/rpc-test-bf5dff08f4674efab34bf69c6986f2d9.sock
I20260928 22:44:25.625306 383 test_util.cc:175] -----------------------------------------------
I20260928 22:44:25.625360 383 test_util.cc:176] Had fatal failures, leaving test files at /tmp/dist-test-taskLJmlEJ/test-tmp/rpc-test.6.Parameters_TestRpc.TestCallWithChainCertAndChainCA_SSL_UnixSocket.1790635465555090-383-0
Full log
Note: This is test shard 7 of 8.
[==========] Running 21 tests from 2 test suites.
[----------] Global test environment set-up.
[----------] 20 tests from Parameters/TestRpc
[ RUN ] Parameters/TestRpc.TestMessengerCreateDestroy/SSL_UnixSocket
WARNING: Logging before InitGoogleLogging() is written to STDERR
I20260928 22:44:25.587193 383 rpc-test.cc:169] started messenger TestCreateDestroy
[ OK ] Parameters/TestRpc.TestMessengerCreateDestroy/SSL_UnixSocket (30 ms)
[ RUN ] Parameters/TestRpc.TestNegotiationDeadlock/SSL_UnixSocket
I20260928 22:44:25.593168 403 acceptor_pool.cc:254] collecting diagnostics on the listening RPC socket unix:/tmp/dist-test-taskLJmlEJ/test-tmp/rpc-test-29314ebc811a4ed09266b166cff50cc1.sock every 8 connection(s)
I20260928 22:44:25.593209 404 acceptor_pool.cc:254] collecting diagnostics on the listening RPC socket unix:/tmp/dist-test-taskLJmlEJ/test-tmp/rpc-test-29314ebc811a4ed09266b166cff50cc1.sock every 8 connection(s)
[ OK ] Parameters/TestRpc.TestNegotiationDeadlock/SSL_UnixSocket (11 ms)
[ RUN ] Parameters/TestRpc.TestCallWithChainCertAndChainCA/SSL_UnixSocket
I20260928 22:44:25.621600 419 acceptor_pool.cc:254] collecting diagnostics on the listening RPC socket unix:/tmp/dist-test-taskLJmlEJ/test-tmp/rpc-test-bf5dff08f4674efab34bf69c6986f2d9.sock every 8 connection(s)
I20260928 22:44:25.621624 420 acceptor_pool.cc:254] collecting diagnostics on the listening RPC socket unix:/tmp/dist-test-taskLJmlEJ/test-tmp/rpc-test-bf5dff08f4674efab34bf69c6986f2d9.sock every 8 connection(s)
/data0/somelongdirectorytoavoidrpathissues/src/kudu/src/kudu/rpc/rpc-test.cc:270: Failure
Failed
Bad status: Runtime error: could not verify certificate chain (error with cert: subject=CN = localhost, ST = sadfjas, C = AS, emailAddress = sdflkdsajf, O = lskdfjlsad, OU = sldfkja, issuer=C = AS, ST = ASDfkjdhf, L = lskdjf, O = saldfja, OU = skdjf, CN = localhost, emailAddress = sadjflkadsj): : certificate has expired
Google Test trace:
/data0/somelongdirectorytoavoidrpathissues/src/kudu/src/kudu/rpc/rpc-test.cc:267: Connecting to unix:/tmp/dist-test-taskLJmlEJ/test-tmp/rpc-test-bf5dff08f4674efab34bf69c6986f2d9.sock
I20260928 22:44:25.625306 383 test_util.cc:175] -----------------------------------------------
I20260928 22:44:25.625360 383 test_util.cc:176] Had fatal failures, leaving test files at /tmp/dist-test-taskLJmlEJ/test-tmp/rpc-test.6.Parameters_TestRpc.TestCallWithChainCertAndChainCA_SSL_UnixSocket.1790635465555090-383-0
[ FAILED ] Parameters/TestRpc.TestCallWithChainCertAndChainCA/SSL_UnixSocket, where GetParam() = (true, true) (25 ms)
[ RUN ] Parameters/TestRpc.TestCallWithPasswordProtectedKey/SSL_UnixSocket
I20260928 22:44:25.645411 444 acceptor_pool.cc:254] collecting diagnostics on the listening RPC socket unix:/tmp/dist-test-taskLJmlEJ/test-tmp/rpc-test-415b09d64ec44906a82e1bb8e9e59889.sock every 8 connection(s)
I20260928 22:44:25.645434 445 acceptor_pool.cc:254] collecting diagnostics on the listening RPC socket unix:/tmp/dist-test-taskLJmlEJ/test-tmp/rpc-test-415b09d64ec44906a82e1bb8e9e59889.sock every 8 connection(s)
W20260928 22:44:25.656327 441 connection.cc:196] Error closing socket: Network error: TlsSocket::Close: Broken pipe
[ OK ] Parameters/TestRpc.TestCallWithPasswordProtectedKey/SSL_UnixSocket (32 ms)
[ RUN ] Parameters/TestRpc.TestCallToBadServer/SSL_UnixSocket
I20260928 22:44:25.667579 383 rpc-test.cc:394] Status: Network error: Client connection negotiation failed: client connection to 0.0.0.0:0: connect: Connection refused (error 111)
I20260928 22:44:25.667760 383 rpc-test.cc:394] Status: Network error: Client connection negotiation failed: client connection to 0.0.0.0:0: connect: Connection refused (error 111)
I20260928 22:44:25.667900 383 rpc-test.cc:394] Status: Network error: Client connection negotiation failed: client connection to 0.0.0.0:0: connect: Connection refused (error 111)
I20260928 22:44:25.668032 383 rpc-test.cc:394] Status: Network error: Client connection negotiation failed: client connection to 0.0.0.0:0: connect: Connection refused (error 111)
I20260928 22:44:25.668184 383 rpc-test.cc:394] Status: Network error: Client connection negotiation failed: client connection to 0.0.0.0:0: connect: Connection refused (error 111)
[ OK ] Parameters/TestRpc.TestCallToBadServer/SSL_UnixSocket (11 ms)
[ RUN ] Parameters/TestRpc.TestWrongService/SSL_UnixSocket
I20260928 22:44:25.681159 479 acceptor_pool.cc:254] collecting diagnostics on the listening RPC socket unix:/tmp/dist-test-taskLJmlEJ/test-tmp/rpc-test-ce8d46f971d540d4a86c49c787b62b97.sock every 8 connection(s)
I20260928 22:44:25.681286 480 acceptor_pool.cc:254] collecting diagnostics on the listening RPC socket unix:/tmp/dist-test-taskLJmlEJ/test-tmp/rpc-test-ce8d46f971d540d4a86c49c787b62b97.sock every 8 connection(s)
I20260928 22:44:25.691520 476 messenger.cc:345] service WrongServiceName not registered on TestServer
[ OK ] Parameters/TestRpc.TestWrongService/SSL_UnixSocket (24 ms)
[ RUN ] Parameters/TestRpc.TestConnectionKeepalive/SSL_UnixSocket
I20260928 22:44:25.699729 502 acceptor_pool.cc:254] collecting diagnostics on the listening RPC socket unix:/tmp/dist-test-taskLJmlEJ/test-tmp/rpc-test-15bbda796c574ba7823b493d86b3aeb6.sock every 8 connection(s)
I20260928 22:44:25.699791 503 acceptor_pool.cc:254] collecting diagnostics on the listening RPC socket unix:/tmp/dist-test-taskLJmlEJ/test-tmp/rpc-test-15bbda796c574ba7823b493d86b3aeb6.sock every 8 connection(s)
I20260928 22:44:25.699914 383 rpc-test.cc:488] Connecting to unix:/tmp/dist-test-taskLJmlEJ/test-tmp/rpc-test-15bbda796c574ba7823b493d86b3aeb6.sock
W20260928 22:44:26.194793 515 connection.cc:196] Error closing socket: Network error: TlsSocket::Close: Broken pipe
[ OK ] Parameters/TestRpc.TestConnectionKeepalive/SSL_UnixSocket (1033 ms)
[ RUN ] Parameters/TestRpc.TestClientConnectionMetrics/SSL_UnixSocket
I20260928 22:44:26.741500 527 acceptor_pool.cc:254] collecting diagnostics on the listening RPC socket unix:/tmp/dist-test-taskLJmlEJ/test-tmp/rpc-test-7ab26234987c41968bd34243ba001a7b.sock every 8 connection(s)
I20260928 22:44:26.741529 528 acceptor_pool.cc:254] collecting diagnostics on the listening RPC socket unix:/tmp/dist-test-taskLJmlEJ/test-tmp/rpc-test-7ab26234987c41968bd34243ba001a7b.sock every 8 connection(s)
I20260928 22:44:26.741673 383 rpc-test.cc:569] Connecting to unix:/tmp/dist-test-taskLJmlEJ/test-tmp/rpc-test-7ab26234987c41968bd34243ba001a7b.sock
W20260928 22:44:34.769979 524 connection.cc:196] Error closing socket: Network error: TlsSocket::Close: Broken pipe
[ OK ] Parameters/TestRpc.TestClientConnectionMetrics/SSL_UnixSocket (8044 ms)
[ RUN ] Parameters/TestRpc.TestCredentialsPolicy/SSL_UnixSocket
I20260928 22:44:34.781368 550 acceptor_pool.cc:254] collecting diagnostics on the listening RPC socket unix:/tmp/dist-test-taskLJmlEJ/test-tmp/rpc-test-2bf2034968ef488c8a6fc6cb5a39cf71.sock every 8 connection(s)
I20260928 22:44:34.781425 551 acceptor_pool.cc:254] collecting diagnostics on the listening RPC socket unix:/tmp/dist-test-taskLJmlEJ/test-tmp/rpc-test-2bf2034968ef488c8a6fc6cb5a39cf71.sock every 8 connection(s)
I20260928 22:44:34.781564 383 rpc-test.cc:700] Connecting to unix:/tmp/dist-test-taskLJmlEJ/test-tmp/rpc-test-2bf2034968ef488c8a6fc6cb5a39cf71.sock
W20260928 22:44:34.801707 549 connection.cc:196] Error closing socket: Network error: TlsSocket::Close: Broken pipe
[ OK ] Parameters/TestRpc.TestCredentialsPolicy/SSL_UnixSocket (34 ms)
[ RUN ] Parameters/TestRpc.TestCallLongerThanKeepalive/SSL_UnixSocket
I20260928 22:44:34.818068 575 acceptor_pool.cc:254] collecting diagnostics on the listening RPC socket unix:/tmp/dist-test-taskLJmlEJ/test-tmp/rpc-test-14556cc794e94e83b0215e2b590b77f3.sock every 8 connection(s)
I20260928 22:44:34.818113 576 acceptor_pool.cc:254] collecting diagnostics on the listening RPC socket unix:/tmp/dist-test-taskLJmlEJ/test-tmp/rpc-test-14556cc794e94e83b0215e2b590b77f3.sock every 8 connection(s)
I20260928 22:44:34.832677 579 rpc-test-base.h:222] got call: sleep_micros: 3000000 deferred: true
I20260928 22:44:37.833305 579 rpcz_store.cc:275] Call kudu.rpc.GenericCalculatorService.Sleep from unix:<unnamed> (request call id 0) took 3000 ms. Trace:
I20260928 22:44:37.833397 579 rpcz_store.cc:276] 0928 22:44:34.832625 (+ 0us) service_pool.cc:170] Inserting onto call queue
0928 22:44:34.832656 (+ 31us) service_pool.cc:227] Handling call
0928 22:44:37.833289 (+3000633us) inbound_call.cc:173] Queueing success response
Metrics: {}
[ OK ] Parameters/TestRpc.TestCallLongerThanKeepalive/SSL_UnixSocket (3029 ms)
[ RUN ] Parameters/TestRpc.TestRpcSidecar/SSL_UnixSocket
I20260928 22:44:37.851578 600 acceptor_pool.cc:254] collecting diagnostics on the listening RPC socket unix:/tmp/dist-test-taskLJmlEJ/test-tmp/rpc-test-62b4927e8830478882999ab227f821b2.sock every 8 connection(s)
I20260928 22:44:37.851627 601 acceptor_pool.cc:254] collecting diagnostics on the listening RPC socket unix:/tmp/dist-test-taskLJmlEJ/test-tmp/rpc-test-62b4927e8830478882999ab227f821b2.sock every 8 connection(s)
W20260928 22:44:37.886420 597 connection.cc:196] Error closing socket: Network error: TlsSocket::Close: Broken pipe
[ OK ] Parameters/TestRpc.TestRpcSidecar/SSL_UnixSocket (52 ms)
[ RUN ] Parameters/TestRpc.TestRpcSidecarLimits/SSL_UnixSocket
I20260928 22:44:39.508967 625 acceptor_pool.cc:254] collecting diagnostics on the listening RPC socket unix:/tmp/dist-test-taskLJmlEJ/test-tmp/rpc-test-922636129523400c8fe1cf5636218128.sock every 8 connection(s)
I20260928 22:44:39.508991 626 acceptor_pool.cc:254] collecting diagnostics on the listening RPC socket unix:/tmp/dist-test-taskLJmlEJ/test-tmp/rpc-test-922636129523400c8fe1cf5636218128.sock every 8 connection(s)
W20260928 22:44:39.534775 383 serialization.cc:72] Serialized kudu.rpc_test.PushStringsRequestPB (2147483654 bytes) is larger than the maximum configured RPC message size (52428800 bytes). Sending anyway, but peer may reject the data.
W20260928 22:44:39.537704 622 connection.cc:535] server connection from unix:<unnamed> recv error: Network error: RPC frame had a length of 2147483714, but we only support messages up to 52428800 bytes long.
W20260928 22:44:39.537755 622 connection.cc:158] shutting down server connection from unix:<unnamed> with pending inbound data: 4/2147483714 bytes received; last active 0 ns ago: status Network error: RPC frame had a length of 2147483714, but we only support messages up to 52428800 bytes long.
W20260928 22:44:39.537858 638 connection.cc:698] client connection to unix:/tmp/dist-test-taskLJmlEJ/test-tmp/rpc-test-922636129523400c8fe1cf5636218128.sock send error: Network error: failed to write to TLS socket: Broken pipe
W20260928 22:44:39.537967 638 connection.cc:196] Error closing socket: Network error: TlsSocket::Close: Success
I20260928 22:44:39.549191 650 acceptor_pool.cc:254] collecting diagnostics on the listening RPC socket unix:/tmp/dist-test-taskLJmlEJ/test-tmp/rpc-test-922636129523400c8fe1cf5636218128.sock every 8 connection(s)
I20260928 22:44:39.549191 651 acceptor_pool.cc:254] collecting diagnostics on the listening RPC socket unix:/tmp/dist-test-taskLJmlEJ/test-tmp/rpc-test-922636129523400c8fe1cf5636218128.sock every 8 connection(s)
W20260928 22:44:43.907177 647 connection.cc:577] server connection from unix:<unnamed>: received bad data: 'Corruption: Invalid packet: message had a length of 2147483710, but we only support messages up to 2147483647 bytes
'
W20260928 22:44:43.907451 663 connection.cc:196] Error closing socket: Network error: TlsSocket::Close: Broken pipe
[ OK ] Parameters/TestRpc.TestRpcSidecarLimits/SSL_UnixSocket (6021 ms)
[ RUN ] Parameters/TestRpc.TestCallTimeoutDoesntAffectNegotiation/SSL_UnixSocket
I20260928 22:44:43.918831 676 acceptor_pool.cc:254] collecting diagnostics on the listening RPC socket unix:/tmp/dist-test-taskLJmlEJ/test-tmp/rpc-test-ef6ee00da53e4b0581776b87dfaa2e24.sock every 8 connection(s)
I20260928 22:44:43.918934 675 acceptor_pool.cc:254] collecting diagnostics on the listening RPC socket unix:/tmp/dist-test-taskLJmlEJ/test-tmp/rpc-test-ef6ee00da53e4b0581776b87dfaa2e24.sock every 8 connection(s)
W20260928 22:44:43.926393 670 negotiation.cc:266] Injecting 500ms delay in negotiation
I20260928 22:44:43.976646 383 rpc-test-base.h:595] status: Timed out: connection negotiation to unix:/tmp/dist-test-taskLJmlEJ/test-tmp/rpc-test-ef6ee00da53e4b0581776b87dfaa2e24.sock for RPC Sleep timed out after 0.050s (ON_OUTBOUND_QUEUE), seconds elapsed: 0.050497
W20260928 22:44:44.429859 672 connection.cc:196] Error closing socket: Network error: TlsSocket::Close: Broken pipe
[ OK ] Parameters/TestRpc.TestCallTimeoutDoesntAffectNegotiation/SSL_UnixSocket (521 ms)
[ RUN ] Parameters/TestRpc.TestRpcHandlerLatencyMetric/SSL_UnixSocket
I20260928 22:44:44.449105 700 acceptor_pool.cc:254] collecting diagnostics on the listening RPC socket unix:/tmp/dist-test-taskLJmlEJ/test-tmp/rpc-test-156a1323a6f24ff9a67eded0e2b0c99d.sock every 8 connection(s)
I20260928 22:44:44.449146 701 acceptor_pool.cc:254] collecting diagnostics on the listening RPC socket unix:/tmp/dist-test-taskLJmlEJ/test-tmp/rpc-test-156a1323a6f24ff9a67eded0e2b0c99d.sock every 8 connection(s)
I20260928 22:44:44.490414 383 rpc-test.cc:1236] Sleep() min lat: 20243
I20260928 22:44:44.490480 383 rpc-test.cc:1237] Sleep() mean lat: 20243
I20260928 22:44:44.490504 383 rpc-test.cc:1238] Sleep() max lat: 20243
I20260928 22:44:44.490515 383 rpc-test.cc:1239] Sleep() #calls: 1
W20260928 22:44:44.491057 697 connection.cc:196] Error closing socket: Network error: TlsSocket::Close: Broken pipe
[ OK ] Parameters/TestRpc.TestRpcHandlerLatencyMetric/SSL_UnixSocket (60 ms)
[ RUN ] Parameters/TestRpc.TimedOutOnResponseMetricServiceQueue/SSL_UnixSocket
I20260928 22:44:44.513705 726 acceptor_pool.cc:254] collecting diagnostics on the listening RPC socket unix:/tmp/dist-test-taskLJmlEJ/test-tmp/rpc-test-05c3fddbeafd45039c02ef41be5d738e.sock every 8 connection(s)
I20260928 22:44:44.513753 727 acceptor_pool.cc:254] collecting diagnostics on the listening RPC socket unix:/tmp/dist-test-taskLJmlEJ/test-tmp/rpc-test-05c3fddbeafd45039c02ef41be5d738e.sock every 8 connection(s)
W20260928 22:44:44.566197 728 rpcz_store.cc:267] Call kudu.rpc_test.CalculatorService.Sleep from unix:<unnamed> (request call id 2) took 20 ms (client timeout 20 ms). Trace:
W20260928 22:44:44.566334 728 rpcz_store.cc:269] 0928 22:44:44.546000 (+ 0us) service_pool.cc:170] Inserting onto call queue
0928 22:44:44.566166 (+ 20166us) service_pool.cc:214] Skipping call since client already timed out
0928 22:44:44.566178 (+ 12us) inbound_call.cc:173] Queueing failure response
Metrics: {}
[ OK ] Parameters/TestRpc.TimedOutOnResponseMetricServiceQueue/SSL_UnixSocket (75 ms)
[ RUN ] Parameters/TestRpc.RpcPendingConnectionsMetric/SSL_UnixSocket
I20260928 22:44:44.569259 749 acceptor_pool.cc:254] collecting diagnostics on the listening RPC socket 0.0.0.0:33177 every 8 connection(s)
I20260928 22:44:44.569319 750 acceptor_pool.cc:254] collecting diagnostics on the listening RPC socket 0.0.0.0:33177 every 8 connection(s)
W20260928 22:44:44.577296 745 negotiation.cc:337] Failed RPC negotiation. Trace:
0928 22:44:44.577056 (+ 0us) reactor.cc:625] Submitting negotiation task for server connection from 127.0.0.1:34284 (local address 127.0.0.1:33177)
0928 22:44:44.577122 (+ 66us) server_negotiation.cc:206] Beginning negotiation
0928 22:44:44.577124 (+ 2us) server_negotiation.cc:399] Waiting for connection header
0928 22:44:44.577218 (+ 94us) negotiation.cc:327] Negotiation complete: Network error: Server connection negotiation failed: server connection from 127.0.0.1:34284: BlockingRecv error: recv got EOF from 127.0.0.1:34284 (error 108)
Metrics: {"server-negotiator.queue_time_us":18}
[ OK ] Parameters/TestRpc.RpcPendingConnectionsMetric/SSL_UnixSocket (20 ms)
[ RUN ] Parameters/TestRpc.TestRpcContextClientDeadline/SSL_UnixSocket
I20260928 22:44:44.602873 765 acceptor_pool.cc:254] collecting diagnostics on the listening RPC socket unix:/tmp/dist-test-taskLJmlEJ/test-tmp/rpc-test-2a4b3d44124447e797f25bbc8586dc41.sock every 8 connection(s)
I20260928 22:44:44.602911 766 acceptor_pool.cc:254] collecting diagnostics on the listening RPC socket unix:/tmp/dist-test-taskLJmlEJ/test-tmp/rpc-test-2a4b3d44124447e797f25bbc8586dc41.sock every 8 connection(s)
[ OK ] Parameters/TestRpc.TestRpcContextClientDeadline/SSL_UnixSocket (65 ms)
[ RUN ] Parameters/TestRpc.TestApplicationFeatureFlagUnsupportedServer/SSL_UnixSocket
I20260928 22:44:44.660840 790 acceptor_pool.cc:254] collecting diagnostics on the listening RPC socket unix:/tmp/dist-test-taskLJmlEJ/test-tmp/rpc-test-2cbd256b10db459998a5c0babb4cb2bb.sock every 8 connection(s)
I20260928 22:44:44.660897 791 acceptor_pool.cc:254] collecting diagnostics on the listening RPC socket unix:/tmp/dist-test-taskLJmlEJ/test-tmp/rpc-test-2cbd256b10db459998a5c0babb4cb2bb.sock every 8 connection(s)
[ OK ] Parameters/TestRpc.TestApplicationFeatureFlagUnsupportedServer/SSL_UnixSocket (17 ms)
[ RUN ] Parameters/TestRpc.TestCancellationAsync/SSL_UnixSocket
I20260928 22:44:44.679941 815 acceptor_pool.cc:254] collecting diagnostics on the listening RPC socket unix:/tmp/dist-test-taskLJmlEJ/test-tmp/rpc-test-cd67f1120d3f4566b8433050c18f10a8.sock every 8 connection(s)
I20260928 22:44:44.679993 816 acceptor_pool.cc:254] collecting diagnostics on the listening RPC socket unix:/tmp/dist-test-taskLJmlEJ/test-tmp/rpc-test-cd67f1120d3f4566b8433050c18f10a8.sock every 8 connection(s)
I20260928 22:44:44.680109 383 rpc-test.cc:1716] Connecting to unix:/tmp/dist-test-taskLJmlEJ/test-tmp/rpc-test-cd67f1120d3f4566b8433050c18f10a8.sock
I20260928 22:44:44.688639 383 test_util.cc:268] Using random seed: -805523203
I20260928 22:44:44.701110 818 rpc-test-base.h:240] got call: sleep_micros: 500 pattern: 4294967295 num_repetitions: 2097152 sidecar_idx: 0
I20260928 22:44:44.711326 818 rpc-test-base.h:240] got call: sleep_micros: 500 pattern: 4294967295 num_repetitions: 2097152 sidecar_idx: 0
I20260928 22:44:44.723227 818 rpc-test-base.h:240] got call: sleep_micros: 500 pattern: 4294967295 num_repetitions: 2097152 sidecar_idx: 0
I20260928 22:44:44.734581 818 rpc-test-base.h:240] got call: sleep_micros: 500 pattern: 4294967295 num_repetitions: 2097152 sidecar_idx: 0
I20260928 22:44:44.745879 818 rpc-test-base.h:240] got call: sleep_micros: 500 pattern: 4294967295 num_repetitions: 2097152 sidecar_idx: 0
I20260928 22:44:44.757352 818 rpc-test-base.h:240] got call: sleep_micros: 500 pattern: 4294967295 num_repetitions: 2097152 sidecar_idx: 0
I20260928 22:44:44.768276 818 rpc-test-base.h:240] got call: sleep_micros: 500 pattern: 4294967295 num_repetitions: 2097152 sidecar_idx: 0
I20260928 22:44:44.778546 818 rpc-test-base.h:240] got call: sleep_micros: 500 pattern: 4294967295 num_repetitions: 2097152 sidecar_idx: 0
W20260928 22:44:44.780448 812 connection.cc:196] Error closing socket: Network error: TlsSocket::Close: Broken pipe
W20260928 22:44:44.781795 812 connection.cc:441] server connection from unix:<unnamed> torn down before Call kudu.rpc.GenericCalculatorService.SleepWithSidecar from unix:<unnamed> (request call id 9) could send its response
[ OK ] Parameters/TestRpc.TestCancellationAsync/SSL_UnixSocket (111 ms)
[ RUN ] Parameters/TestRpc.TestPerformanceBySocketType/SSL_UnixSocket
I20260928 22:44:44.805888 840 acceptor_pool.cc:254] collecting diagnostics on the listening RPC socket unix:/tmp/dist-test-taskLJmlEJ/test-tmp/rpc-test-518e3ec2914f493697ea6d9f3d15ef97.sock every 8 connection(s)
I20260928 22:44:44.805922 841 acceptor_pool.cc:254] collecting diagnostics on the listening RPC socket unix:/tmp/dist-test-taskLJmlEJ/test-tmp/rpc-test-518e3ec2914f493697ea6d9f3d15ef97.sock every 8 connection(s)
I20260928 22:44:44.806046 383 rpc-test.cc:1846] Connecting to unix:/tmp/dist-test-taskLJmlEJ/test-tmp/rpc-test-518e3ec2914f493697ea6d9f3d15ef97.sock
I20260928 22:44:45.966928 383 rpc-test.cc:1859] Sending 1024MB via ssl-enabled unix socket: real 1.144s user 1.295s sys 0.767s
I20260928 22:44:47.137915 383 rpc-test.cc:1859] Sending 1024MB via ssl-enabled unix socket: real 1.171s user 1.335s sys 0.779s
I20260928 22:44:48.262271 383 rpc-test.cc:1859] Sending 1024MB via ssl-enabled unix socket: real 1.124s user 1.298s sys 0.736s
I20260928 22:44:49.368808 383 rpc-test.cc:1859] Sending 1024MB via ssl-enabled unix socket: real 1.106s user 1.265s sys 0.738s
I20260928 22:44:50.484959 383 rpc-test.cc:1859] Sending 1024MB via ssl-enabled unix socket: real 1.116s user 1.351s sys 0.667s
W20260928 22:44:50.485730 837 connection.cc:196] Error closing socket: Network error: TlsSocket::Close: Broken pipe
[ OK ] Parameters/TestRpc.TestPerformanceBySocketType/SSL_UnixSocket (5703 ms)
[----------] 20 tests from Parameters/TestRpc (24928 ms total)
[----------] 1 test from Parameters/TestRpcSocketTxRxQueue
[ RUN ] Parameters/TestRpcSocketTxRxQueue.AcceptorRxQueueSizeMetric/0
I20260928 22:44:50.491245 865 acceptor_pool.cc:254] collecting diagnostics on the listening RPC socket 0.0.0.0:45791 every 1 connection(s)
I20260928 22:44:50.491299 866 acceptor_pool.cc:254] collecting diagnostics on the listening RPC socket 0.0.0.0:45791 every 1 connection(s)
W20260928 22:44:50.491771 861 negotiation.cc:337] Failed RPC negotiation. Trace:
0928 22:44:50.491634 (+ 0us) reactor.cc:625] Submitting negotiation task for server connection from 127.0.0.1:60666 (local address 127.0.0.1:45791)
0928 22:44:50.491672 (+ 38us) server_negotiation.cc:206] Beginning negotiation
0928 22:44:50.491674 (+ 2us) server_negotiation.cc:399] Waiting for connection header
0928 22:44:50.491744 (+ 70us) negotiation.cc:327] Negotiation complete: Network error: Server connection negotiation failed: server connection from 127.0.0.1:60666: BlockingRecv error: recv got EOF from 127.0.0.1:60666 (error 108)
Metrics: {"server-negotiator.queue_time_us":14}
[ OK ] Parameters/TestRpcSocketTxRxQueue.AcceptorRxQueueSizeMetric/0 (6 ms)
[----------] 1 test from Parameters/TestRpcSocketTxRxQueue (6 ms total)
[----------] Global test environment tear-down
[==========] 21 tests from 2 test suites ran. (24936 ms total)
[ PASSED ] 20 tests.
[ FAILED ] 1 test, listed below:
[ FAILED ] Parameters/TestRpc.TestCallWithChainCertAndChainCA/SSL_UnixSocket, where GetParam() = (true, true)
1 FAILED TEST