Diagnosed failure
Parameters/TestRpc.TestCallWithChainCertAndChainCA/SSL_UnixSocket: /data0/somelongdirectorytoavoidrpathissues/src/kudu/src/kudu/rpc/rpc-test.cc:270: Failure
Failed
Bad status: Runtime error: could not verify certificate chain (error with cert: subject=CN = localhost, ST = sadfjas, C = AS, emailAddress = sdflkdsajf, O = lskdfjlsad, OU = sldfkja, issuer=C = AS, ST = ASDfkjdhf, L = lskdjf, O = saldfja, OU = skdjf, CN = localhost, emailAddress = sadjflkadsj): : certificate has expired
Google Test trace:
/data0/somelongdirectorytoavoidrpathissues/src/kudu/src/kudu/rpc/rpc-test.cc:267: Connecting to unix:/tmp/dist-test-tasksuxLKO/test-tmp/rpc-test-57d09578d1354bbf9497a5aaeca3eb4b.sock
I20260924 18:59:38.093281 379 test_util.cc:175] -----------------------------------------------
I20260924 18:59:38.093924 379 test_util.cc:176] Had fatal failures, leaving test files at /tmp/dist-test-tasksuxLKO/test-tmp/rpc-test.6.Parameters_TestRpc.TestCallWithChainCertAndChainCA_SSL_UnixSocket.1790276377961370-379-0
Full log
Note: This is test shard 7 of 8.
[==========] Running 21 tests from 2 test suites.
[----------] Global test environment set-up.
[----------] 20 tests from Parameters/TestRpc
[ RUN ] Parameters/TestRpc.TestMessengerCreateDestroy/SSL_UnixSocket
WARNING: Logging before InitGoogleLogging() is written to STDERR
I20260924 18:59:38.010002 379 rpc-test.cc:169] started messenger TestCreateDestroy
[ OK ] Parameters/TestRpc.TestMessengerCreateDestroy/SSL_UnixSocket (32 ms)
[ RUN ] Parameters/TestRpc.TestNegotiationDeadlock/SSL_UnixSocket
I20260924 18:59:38.041932 399 acceptor_pool.cc:254] collecting diagnostics on the listening RPC socket unix:/tmp/dist-test-tasksuxLKO/test-tmp/rpc-test-15c4b6563de04c7db233da087c9e69bb.sock every 8 connection(s)
I20260924 18:59:38.042157 400 acceptor_pool.cc:254] collecting diagnostics on the listening RPC socket unix:/tmp/dist-test-tasksuxLKO/test-tmp/rpc-test-15c4b6563de04c7db233da087c9e69bb.sock every 8 connection(s)
[ OK ] Parameters/TestRpc.TestNegotiationDeadlock/SSL_UnixSocket (47 ms)
[ RUN ] Parameters/TestRpc.TestCallWithChainCertAndChainCA/SSL_UnixSocket
I20260924 18:59:38.077411 415 acceptor_pool.cc:254] collecting diagnostics on the listening RPC socket unix:/tmp/dist-test-tasksuxLKO/test-tmp/rpc-test-57d09578d1354bbf9497a5aaeca3eb4b.sock every 8 connection(s)
I20260924 18:59:38.077716 416 acceptor_pool.cc:254] collecting diagnostics on the listening RPC socket unix:/tmp/dist-test-tasksuxLKO/test-tmp/rpc-test-57d09578d1354bbf9497a5aaeca3eb4b.sock every 8 connection(s)
/data0/somelongdirectorytoavoidrpathissues/src/kudu/src/kudu/rpc/rpc-test.cc:270: Failure
Failed
Bad status: Runtime error: could not verify certificate chain (error with cert: subject=CN = localhost, ST = sadfjas, C = AS, emailAddress = sdflkdsajf, O = lskdfjlsad, OU = sldfkja, issuer=C = AS, ST = ASDfkjdhf, L = lskdjf, O = saldfja, OU = skdjf, CN = localhost, emailAddress = sadjflkadsj): : certificate has expired
Google Test trace:
/data0/somelongdirectorytoavoidrpathissues/src/kudu/src/kudu/rpc/rpc-test.cc:267: Connecting to unix:/tmp/dist-test-tasksuxLKO/test-tmp/rpc-test-57d09578d1354bbf9497a5aaeca3eb4b.sock
I20260924 18:59:38.093281 379 test_util.cc:175] -----------------------------------------------
I20260924 18:59:38.093924 379 test_util.cc:176] Had fatal failures, leaving test files at /tmp/dist-test-tasksuxLKO/test-tmp/rpc-test.6.Parameters_TestRpc.TestCallWithChainCertAndChainCA_SSL_UnixSocket.1790276377961370-379-0
[ FAILED ] Parameters/TestRpc.TestCallWithChainCertAndChainCA/SSL_UnixSocket, where GetParam() = (true, true) (32 ms)
[ RUN ] Parameters/TestRpc.TestCallWithPasswordProtectedKey/SSL_UnixSocket
I20260924 18:59:38.112035 440 acceptor_pool.cc:254] collecting diagnostics on the listening RPC socket unix:/tmp/dist-test-tasksuxLKO/test-tmp/rpc-test-3e52f7ff9ddc41cfae8527fb035c8059.sock every 8 connection(s)
I20260924 18:59:38.112289 441 acceptor_pool.cc:254] collecting diagnostics on the listening RPC socket unix:/tmp/dist-test-tasksuxLKO/test-tmp/rpc-test-3e52f7ff9ddc41cfae8527fb035c8059.sock every 8 connection(s)
[ OK ] Parameters/TestRpc.TestCallWithPasswordProtectedKey/SSL_UnixSocket (53 ms)
[ RUN ] Parameters/TestRpc.TestCallToBadServer/SSL_UnixSocket
I20260924 18:59:38.167236 379 rpc-test.cc:394] Status: Network error: Client connection negotiation failed: client connection to 0.0.0.0:0: connect: Connection refused (error 111)
I20260924 18:59:38.168094 379 rpc-test.cc:394] Status: Network error: Client connection negotiation failed: client connection to 0.0.0.0:0: connect: Connection refused (error 111)
I20260924 18:59:38.168764 379 rpc-test.cc:394] Status: Network error: Client connection negotiation failed: client connection to 0.0.0.0:0: connect: Connection refused (error 111)
I20260924 18:59:38.169350 379 rpc-test.cc:394] Status: Network error: Client connection negotiation failed: client connection to 0.0.0.0:0: connect: Connection refused (error 111)
I20260924 18:59:38.170006 379 rpc-test.cc:394] Status: Network error: Client connection negotiation failed: client connection to 0.0.0.0:0: connect: Connection refused (error 111)
[ OK ] Parameters/TestRpc.TestCallToBadServer/SSL_UnixSocket (24 ms)
[ RUN ] Parameters/TestRpc.TestWrongService/SSL_UnixSocket
I20260924 18:59:38.189239 475 acceptor_pool.cc:254] collecting diagnostics on the listening RPC socket unix:/tmp/dist-test-tasksuxLKO/test-tmp/rpc-test-196773eee2904db1a357ccc16d588f3b.sock every 8 connection(s)
I20260924 18:59:38.189486 476 acceptor_pool.cc:254] collecting diagnostics on the listening RPC socket unix:/tmp/dist-test-tasksuxLKO/test-tmp/rpc-test-196773eee2904db1a357ccc16d588f3b.sock every 8 connection(s)
I20260924 18:59:38.211006 472 messenger.cc:345] service WrongServiceName not registered on TestServer
[ OK ] Parameters/TestRpc.TestWrongService/SSL_UnixSocket (43 ms)
[ RUN ] Parameters/TestRpc.TestConnectionKeepalive/SSL_UnixSocket
I20260924 18:59:38.227082 498 acceptor_pool.cc:254] collecting diagnostics on the listening RPC socket unix:/tmp/dist-test-tasksuxLKO/test-tmp/rpc-test-763be58607c64ca7846b6c6819e8079c.sock every 8 connection(s)
I20260924 18:59:38.227324 499 acceptor_pool.cc:254] collecting diagnostics on the listening RPC socket unix:/tmp/dist-test-tasksuxLKO/test-tmp/rpc-test-763be58607c64ca7846b6c6819e8079c.sock every 8 connection(s)
I20260924 18:59:38.228271 379 rpc-test.cc:488] Connecting to unix:/tmp/dist-test-tasksuxLKO/test-tmp/rpc-test-763be58607c64ca7846b6c6819e8079c.sock
W20260924 18:59:38.719158 511 connection.cc:196] Error closing socket: Network error: TlsSocket::Close: Broken pipe
[ OK ] Parameters/TestRpc.TestConnectionKeepalive/SSL_UnixSocket (1039 ms)
[ RUN ] Parameters/TestRpc.TestClientConnectionMetrics/SSL_UnixSocket
I20260924 18:59:39.275168 523 acceptor_pool.cc:254] collecting diagnostics on the listening RPC socket unix:/tmp/dist-test-tasksuxLKO/test-tmp/rpc-test-33afce630a52494dac7495a37679ef56.sock every 8 connection(s)
I20260924 18:59:39.275490 524 acceptor_pool.cc:254] collecting diagnostics on the listening RPC socket unix:/tmp/dist-test-tasksuxLKO/test-tmp/rpc-test-33afce630a52494dac7495a37679ef56.sock every 8 connection(s)
I20260924 18:59:39.276531 379 rpc-test.cc:569] Connecting to unix:/tmp/dist-test-tasksuxLKO/test-tmp/rpc-test-33afce630a52494dac7495a37679ef56.sock
[ OK ] Parameters/TestRpc.TestClientConnectionMetrics/SSL_UnixSocket (21729 ms)
[ RUN ] Parameters/TestRpc.TestCredentialsPolicy/SSL_UnixSocket
I20260924 19:00:01.003707 546 acceptor_pool.cc:254] collecting diagnostics on the listening RPC socket unix:/tmp/dist-test-tasksuxLKO/test-tmp/rpc-test-b4efd72610de4f23a09ef9b818acf5ee.sock every 8 connection(s)
I20260924 19:00:01.003942 547 acceptor_pool.cc:254] collecting diagnostics on the listening RPC socket unix:/tmp/dist-test-tasksuxLKO/test-tmp/rpc-test-b4efd72610de4f23a09ef9b818acf5ee.sock every 8 connection(s)
I20260924 19:00:01.004861 379 rpc-test.cc:700] Connecting to unix:/tmp/dist-test-tasksuxLKO/test-tmp/rpc-test-b4efd72610de4f23a09ef9b818acf5ee.sock
W20260924 19:00:01.025584 545 connection.cc:196] Error closing socket: Network error: TlsSocket::Close: Broken pipe
W20260924 19:00:01.032990 545 connection.cc:196] Error closing socket: Network error: TlsSocket::Close: Broken pipe
[ OK ] Parameters/TestRpc.TestCredentialsPolicy/SSL_UnixSocket (50 ms)
[ RUN ] Parameters/TestRpc.TestCallLongerThanKeepalive/SSL_UnixSocket
I20260924 19:00:01.045609 571 acceptor_pool.cc:254] collecting diagnostics on the listening RPC socket unix:/tmp/dist-test-tasksuxLKO/test-tmp/rpc-test-316205632d91457d8510563af57e71e3.sock every 8 connection(s)
I20260924 19:00:01.045854 572 acceptor_pool.cc:254] collecting diagnostics on the listening RPC socket unix:/tmp/dist-test-tasksuxLKO/test-tmp/rpc-test-316205632d91457d8510563af57e71e3.sock every 8 connection(s)
I20260924 19:00:01.071236 575 rpc-test-base.h:222] got call: sleep_micros: 3000000 deferred: true
I20260924 19:00:04.072997 575 rpcz_store.cc:275] Call kudu.rpc.GenericCalculatorService.Sleep from unix:<unnamed> (request call id 0) took 3001 ms. Trace:
I20260924 19:00:04.073179 575 rpcz_store.cc:276] 0924 19:00:01.071132 (+ 0us) service_pool.cc:170] Inserting onto call queue
0924 19:00:01.071192 (+ 60us) service_pool.cc:227] Handling call
0924 19:00:04.072954 (+3001762us) inbound_call.cc:173] Queueing success response
Metrics: {}
W20260924 19:00:04.075477 568 connection.cc:196] Error closing socket: Network error: TlsSocket::Close: Broken pipe
[ OK ] Parameters/TestRpc.TestCallLongerThanKeepalive/SSL_UnixSocket (3042 ms)
[ RUN ] Parameters/TestRpc.TestRpcSidecar/SSL_UnixSocket
I20260924 19:00:04.104503 596 acceptor_pool.cc:254] collecting diagnostics on the listening RPC socket unix:/tmp/dist-test-tasksuxLKO/test-tmp/rpc-test-61a533f9e15e402a855822adfa76f0de.sock every 8 connection(s)
I20260924 19:00:04.104723 597 acceptor_pool.cc:254] collecting diagnostics on the listening RPC socket unix:/tmp/dist-test-tasksuxLKO/test-tmp/rpc-test-61a533f9e15e402a855822adfa76f0de.sock every 8 connection(s)
W20260924 19:00:04.194684 593 connection.cc:196] Error closing socket: Network error: TlsSocket::Close: Broken pipe
[ OK ] Parameters/TestRpc.TestRpcSidecar/SSL_UnixSocket (118 ms)
[ RUN ] Parameters/TestRpc.TestRpcSidecarLimits/SSL_UnixSocket
I20260924 19:00:06.343711 621 acceptor_pool.cc:254] collecting diagnostics on the listening RPC socket unix:/tmp/dist-test-tasksuxLKO/test-tmp/rpc-test-896e1d3026694e1d97ab224b6c584387.sock every 8 connection(s)
I20260924 19:00:06.343966 622 acceptor_pool.cc:254] collecting diagnostics on the listening RPC socket unix:/tmp/dist-test-tasksuxLKO/test-tmp/rpc-test-896e1d3026694e1d97ab224b6c584387.sock every 8 connection(s)
W20260924 19:00:06.372023 379 serialization.cc:72] Serialized kudu.rpc_test.PushStringsRequestPB (2147483654 bytes) is larger than the maximum configured RPC message size (52428800 bytes). Sending anyway, but peer may reject the data.
W20260924 19:00:06.379036 618 connection.cc:535] server connection from unix:<unnamed> recv error: Network error: RPC frame had a length of 2147483714, but we only support messages up to 52428800 bytes long.
W20260924 19:00:06.379150 618 connection.cc:158] shutting down server connection from unix:<unnamed> with pending inbound data: 4/2147483714 bytes received; last active 0 ns ago: status Network error: RPC frame had a length of 2147483714, but we only support messages up to 52428800 bytes long.
W20260924 19:00:06.379606 634 connection.cc:196] Error closing socket: Network error: TlsSocket::Close: Broken pipe
I20260924 19:00:06.393203 646 acceptor_pool.cc:254] collecting diagnostics on the listening RPC socket unix:/tmp/dist-test-tasksuxLKO/test-tmp/rpc-test-896e1d3026694e1d97ab224b6c584387.sock every 8 connection(s)
I20260924 19:00:06.393384 647 acceptor_pool.cc:254] collecting diagnostics on the listening RPC socket unix:/tmp/dist-test-tasksuxLKO/test-tmp/rpc-test-896e1d3026694e1d97ab224b6c584387.sock every 8 connection(s)
W20260924 19:00:12.076807 643 connection.cc:577] server connection from unix:<unnamed>: received bad data: 'Corruption: Invalid packet: message had a length of 2147483710, but we only support messages up to 2147483647 bytes
'
W20260924 19:00:12.077452 659 connection.cc:196] Error closing socket: Network error: TlsSocket::Close: Broken pipe
[ OK ] Parameters/TestRpc.TestRpcSidecarLimits/SSL_UnixSocket (8345 ms)
[ RUN ] Parameters/TestRpc.TestCallTimeoutDoesntAffectNegotiation/SSL_UnixSocket
I20260924 19:00:12.570578 671 acceptor_pool.cc:254] collecting diagnostics on the listening RPC socket unix:/tmp/dist-test-tasksuxLKO/test-tmp/rpc-test-098cae61084c4e599891be72029b144e.sock every 8 connection(s)
I20260924 19:00:12.570851 672 acceptor_pool.cc:254] collecting diagnostics on the listening RPC socket unix:/tmp/dist-test-tasksuxLKO/test-tmp/rpc-test-098cae61084c4e599891be72029b144e.sock every 8 connection(s)
W20260924 19:00:12.611078 667 negotiation.cc:266] Injecting 500ms delay in negotiation
I20260924 19:00:12.661607 379 rpc-test-base.h:595] status: Timed out: connection negotiation to unix:/tmp/dist-test-tasksuxLKO/test-tmp/rpc-test-098cae61084c4e599891be72029b144e.sock for RPC Sleep timed out after 0.050s (ON_OUTBOUND_QUEUE), seconds elapsed: 0.051207
[ OK ] Parameters/TestRpc.TestCallTimeoutDoesntAffectNegotiation/SSL_UnixSocket (577 ms)
[ RUN ] Parameters/TestRpc.TestRpcHandlerLatencyMetric/SSL_UnixSocket
I20260924 19:00:13.131774 696 acceptor_pool.cc:254] collecting diagnostics on the listening RPC socket unix:/tmp/dist-test-tasksuxLKO/test-tmp/rpc-test-24a6fca251b54d4189cf7cd346d4c381.sock every 8 connection(s)
I20260924 19:00:13.132071 697 acceptor_pool.cc:254] collecting diagnostics on the listening RPC socket unix:/tmp/dist-test-tasksuxLKO/test-tmp/rpc-test-24a6fca251b54d4189cf7cd346d4c381.sock every 8 connection(s)
I20260924 19:00:13.173640 379 rpc-test.cc:1236] Sleep() min lat: 20601
I20260924 19:00:13.173736 379 rpc-test.cc:1237] Sleep() mean lat: 20601
I20260924 19:00:13.173777 379 rpc-test.cc:1238] Sleep() max lat: 20601
I20260924 19:00:13.173830 379 rpc-test.cc:1239] Sleep() #calls: 1
W20260924 19:00:13.174964 693 connection.cc:196] Error closing socket: Network error: TlsSocket::Close: Broken pipe
[ OK ] Parameters/TestRpc.TestRpcHandlerLatencyMetric/SSL_UnixSocket (57 ms)
[ RUN ] Parameters/TestRpc.TimedOutOnResponseMetricServiceQueue/SSL_UnixSocket
I20260924 19:00:13.193207 722 acceptor_pool.cc:254] collecting diagnostics on the listening RPC socket unix:/tmp/dist-test-tasksuxLKO/test-tmp/rpc-test-9042ae00f6fa4e848a0e93e608fc848a.sock every 8 connection(s)
I20260924 19:00:13.193400 723 acceptor_pool.cc:254] collecting diagnostics on the listening RPC socket unix:/tmp/dist-test-tasksuxLKO/test-tmp/rpc-test-9042ae00f6fa4e848a0e93e608fc848a.sock every 8 connection(s)
W20260924 19:00:13.253090 724 rpcz_store.cc:267] Call kudu.rpc_test.CalculatorService.Sleep from unix:<unnamed> (request call id 2) took 20 ms (client timeout 20 ms). Trace:
W20260924 19:00:13.253224 724 rpcz_store.cc:269] 0924 19:00:13.232555 (+ 0us) service_pool.cc:170] Inserting onto call queue
0924 19:00:13.252999 (+ 20444us) service_pool.cc:214] Skipping call since client already timed out
0924 19:00:13.253067 (+ 68us) inbound_call.cc:173] Queueing failure response
Metrics: {}
[ OK ] Parameters/TestRpc.TimedOutOnResponseMetricServiceQueue/SSL_UnixSocket (78 ms)
[ RUN ] Parameters/TestRpc.RpcPendingConnectionsMetric/SSL_UnixSocket
I20260924 19:00:13.262378 745 acceptor_pool.cc:254] collecting diagnostics on the listening RPC socket 0.0.0.0:46389 every 8 connection(s)
I20260924 19:00:13.262598 746 acceptor_pool.cc:254] collecting diagnostics on the listening RPC socket 0.0.0.0:46389 every 8 connection(s)
W20260924 19:00:13.273422 741 negotiation.cc:337] Failed RPC negotiation. Trace:
0924 19:00:13.272435 (+ 0us) reactor.cc:625] Submitting negotiation task for server connection from 127.0.0.1:43160 (local address 127.0.0.1:46389)
0924 19:00:13.272683 (+ 248us) server_negotiation.cc:206] Beginning negotiation
0924 19:00:13.272691 (+ 8us) server_negotiation.cc:399] Waiting for connection header
0924 19:00:13.272899 (+ 208us) negotiation.cc:327] Negotiation complete: Network error: Server connection negotiation failed: server connection from 127.0.0.1:43160: BlockingRecv error: recv got EOF from 127.0.0.1:43160 (error 108)
Metrics: {"server-negotiator.queue_time_us":82}
[ OK ] Parameters/TestRpc.RpcPendingConnectionsMetric/SSL_UnixSocket (28 ms)
[ RUN ] Parameters/TestRpc.TestRpcContextClientDeadline/SSL_UnixSocket
I20260924 19:00:13.300513 761 acceptor_pool.cc:254] collecting diagnostics on the listening RPC socket unix:/tmp/dist-test-tasksuxLKO/test-tmp/rpc-test-0b35c13abbf44aab9d4ee8cc219a19e4.sock every 8 connection(s)
I20260924 19:00:13.300729 762 acceptor_pool.cc:254] collecting diagnostics on the listening RPC socket unix:/tmp/dist-test-tasksuxLKO/test-tmp/rpc-test-0b35c13abbf44aab9d4ee8cc219a19e4.sock every 8 connection(s)
[ OK ] Parameters/TestRpc.TestRpcContextClientDeadline/SSL_UnixSocket (76 ms)
[ RUN ] Parameters/TestRpc.TestApplicationFeatureFlagUnsupportedServer/SSL_UnixSocket
I20260924 19:00:13.374523 786 acceptor_pool.cc:254] collecting diagnostics on the listening RPC socket unix:/tmp/dist-test-tasksuxLKO/test-tmp/rpc-test-4d89e1be90e24ee0bdf51fe7963684e9.sock every 8 connection(s)
I20260924 19:00:13.374770 787 acceptor_pool.cc:254] collecting diagnostics on the listening RPC socket unix:/tmp/dist-test-tasksuxLKO/test-tmp/rpc-test-4d89e1be90e24ee0bdf51fe7963684e9.sock every 8 connection(s)
W20260924 19:00:13.407924 783 connection.cc:196] Error closing socket: Network error: TlsSocket::Close: Broken pipe
[ OK ] Parameters/TestRpc.TestApplicationFeatureFlagUnsupportedServer/SSL_UnixSocket (48 ms)
[ RUN ] Parameters/TestRpc.TestCancellationAsync/SSL_UnixSocket
I20260924 19:00:13.420677 811 acceptor_pool.cc:254] collecting diagnostics on the listening RPC socket unix:/tmp/dist-test-tasksuxLKO/test-tmp/rpc-test-e3303b1528fc421bb26b50375a7fe378.sock every 8 connection(s)
I20260924 19:00:13.420917 812 acceptor_pool.cc:254] collecting diagnostics on the listening RPC socket unix:/tmp/dist-test-tasksuxLKO/test-tmp/rpc-test-e3303b1528fc421bb26b50375a7fe378.sock every 8 connection(s)
I20260924 19:00:13.421831 379 rpc-test.cc:1716] Connecting to unix:/tmp/dist-test-tasksuxLKO/test-tmp/rpc-test-e3303b1528fc421bb26b50375a7fe378.sock
I20260924 19:00:13.429956 379 test_util.cc:268] Using random seed: 900470963
I20260924 19:00:13.464089 815 rpc-test-base.h:240] got call: sleep_micros: 500 pattern: 4294967295 num_repetitions: 2097152 sidecar_idx: 0
I20260924 19:00:13.484875 814 rpc-test-base.h:240] got call: sleep_micros: 500 pattern: 4294967295 num_repetitions: 2097152 sidecar_idx: 0
I20260924 19:00:13.514904 815 rpc-test-base.h:240] got call: sleep_micros: 500 pattern: 4294967295 num_repetitions: 2097152 sidecar_idx: 0
I20260924 19:00:13.544305 814 rpc-test-base.h:240] got call: sleep_micros: 500 pattern: 4294967295 num_repetitions: 2097152 sidecar_idx: 0
I20260924 19:00:13.573401 813 rpc-test-base.h:240] got call: sleep_micros: 500 pattern: 4294967295 num_repetitions: 2097152 sidecar_idx: 0
I20260924 19:00:13.603163 814 rpc-test-base.h:240] got call: sleep_micros: 500 pattern: 4294967295 num_repetitions: 2097152 sidecar_idx: 0
I20260924 19:00:13.633132 815 rpc-test-base.h:240] got call: sleep_micros: 500 pattern: 4294967295 num_repetitions: 2097152 sidecar_idx: 0
W20260924 19:00:13.636062 808 connection.cc:196] Error closing socket: Network error: TlsSocket::Close: Broken pipe
W20260924 19:00:13.640722 808 connection.cc:441] server connection from unix:<unnamed> torn down before Call kudu.rpc.GenericCalculatorService.SleepWithSidecar from unix:<unnamed> (request call id 7) could send its response
W20260924 19:00:13.649082 808 connection.cc:441] server connection from unix:<unnamed> torn down before Call kudu.rpc.GenericCalculatorService.SleepWithSidecar from unix:<unnamed> (request call id 8) could send its response
W20260924 19:00:13.668263 808 connection.cc:441] server connection from unix:<unnamed> torn down before Call kudu.rpc.GenericCalculatorService.SleepWithSidecar from unix:<unnamed> (request call id 9) could send its response
[ OK ] Parameters/TestRpc.TestCancellationAsync/SSL_UnixSocket (259 ms)
[ RUN ] Parameters/TestRpc.TestPerformanceBySocketType/SSL_UnixSocket
I20260924 19:00:13.691150 836 acceptor_pool.cc:254] collecting diagnostics on the listening RPC socket unix:/tmp/dist-test-tasksuxLKO/test-tmp/rpc-test-f79d2b1dce40438ea84278764f915273.sock every 8 connection(s)
I20260924 19:00:13.691370 837 acceptor_pool.cc:254] collecting diagnostics on the listening RPC socket unix:/tmp/dist-test-tasksuxLKO/test-tmp/rpc-test-f79d2b1dce40438ea84278764f915273.sock every 8 connection(s)
I20260924 19:00:13.692224 379 rpc-test.cc:1846] Connecting to unix:/tmp/dist-test-tasksuxLKO/test-tmp/rpc-test-f79d2b1dce40438ea84278764f915273.sock
I20260924 19:00:16.875627 379 rpc-test.cc:1859] Sending 1024MB via ssl-enabled unix socket: real 3.167s user 3.182s sys 2.197s
I20260924 19:00:19.921355 379 rpc-test.cc:1859] Sending 1024MB via ssl-enabled unix socket: real 3.046s user 2.858s sys 2.285s
I20260924 19:00:23.006381 379 rpc-test.cc:1859] Sending 1024MB via ssl-enabled unix socket: real 3.085s user 3.042s sys 2.166s
I20260924 19:00:26.113250 379 rpc-test.cc:1859] Sending 1024MB via ssl-enabled unix socket: real 3.107s user 3.046s sys 2.226s
I20260924 19:00:29.267608 379 rpc-test.cc:1859] Sending 1024MB via ssl-enabled unix socket: real 3.154s user 3.070s sys 2.289s
W20260924 19:00:29.270769 833 connection.cc:196] Error closing socket: Network error: TlsSocket::Close: Broken pipe
[ OK ] Parameters/TestRpc.TestPerformanceBySocketType/SSL_UnixSocket (15604 ms)
[----------] 20 tests from Parameters/TestRpc (51294 ms total)
[----------] 1 test from Parameters/TestRpcSocketTxRxQueue
[ RUN ] Parameters/TestRpcSocketTxRxQueue.AcceptorRxQueueSizeMetric/0
I20260924 19:00:29.280566 861 acceptor_pool.cc:254] collecting diagnostics on the listening RPC socket 0.0.0.0:39435 every 1 connection(s)
I20260924 19:00:29.280941 862 acceptor_pool.cc:254] collecting diagnostics on the listening RPC socket 0.0.0.0:39435 every 1 connection(s)
W20260924 19:00:29.282640 857 negotiation.cc:337] Failed RPC negotiation. Trace:
0924 19:00:29.282278 (+ 0us) reactor.cc:625] Submitting negotiation task for server connection from 127.0.0.1:59846 (local address 127.0.0.1:39435)
0924 19:00:29.282421 (+ 143us) server_negotiation.cc:206] Beginning negotiation
0924 19:00:29.282425 (+ 4us) server_negotiation.cc:399] Waiting for connection header
0924 19:00:29.282537 (+ 112us) negotiation.cc:327] Negotiation complete: Network error: Server connection negotiation failed: server connection from 127.0.0.1:59846: BlockingRecv error: recv got EOF from 127.0.0.1:59846 (error 108)
Metrics: {"server-negotiator.queue_time_us":51}
[ OK ] Parameters/TestRpcSocketTxRxQueue.AcceptorRxQueueSizeMetric/0 (10 ms)
[----------] 1 test from Parameters/TestRpcSocketTxRxQueue (10 ms total)
[----------] Global test environment tear-down
[==========] 21 tests from 2 test suites ran. (51305 ms total)
[ PASSED ] 20 tests.
[ FAILED ] 1 test, listed below:
[ FAILED ] Parameters/TestRpc.TestCallWithChainCertAndChainCA/SSL_UnixSocket, where GetParam() = (true, true)
1 FAILED TEST