Diagnosed failure

Parameters/TestRpc.TestCallWithChainCertAndChainCA/SSL_UnixSocket: /data0/somelongdirectorytoavoidrpathissues/src/kudu/src/kudu/rpc/rpc-test.cc:270: Failure
Failed
Bad status: Runtime error: could not verify certificate chain (error with cert: subject=CN = localhost, ST = sadfjas, C = AS, emailAddress = sdflkdsajf, O = lskdfjlsad, OU = sldfkja, issuer=C = AS, ST = ASDfkjdhf, L = lskdjf, O = saldfja, OU = skdjf, CN = localhost, emailAddress = sadjflkadsj): : certificate has expired
Google Test trace:
/data0/somelongdirectorytoavoidrpathissues/src/kudu/src/kudu/rpc/rpc-test.cc:267: Connecting to unix:/tmp/dist-test-taskrMO9hW/test-tmp/rpc-test-8b0ddbee07c948a2862996c96ab03e28.sock
I20260927 15:07:18.927840 26982 test_util.cc:175] -----------------------------------------------
I20260927 15:07:18.927911 26982 test_util.cc:176] Had fatal failures, leaving test files at /tmp/dist-test-taskrMO9hW/test-tmp/rpc-test.6.Parameters_TestRpc.TestCallWithChainCertAndChainCA_SSL_UnixSocket.1790521638855905-26982-0

Full log

Note: This is test shard 7 of 8.
[==========] Running 21 tests from 2 test suites.
[----------] Global test environment set-up.
[----------] 20 tests from Parameters/TestRpc
[ RUN      ] Parameters/TestRpc.TestMessengerCreateDestroy/SSL_UnixSocket
WARNING: Logging before InitGoogleLogging() is written to STDERR
I20260927 15:07:18.884806 26982 rpc-test.cc:169] started messenger TestCreateDestroy
[       OK ] Parameters/TestRpc.TestMessengerCreateDestroy/SSL_UnixSocket (23 ms)
[ RUN      ] Parameters/TestRpc.TestNegotiationDeadlock/SSL_UnixSocket
I20260927 15:07:18.901825 27002 acceptor_pool.cc:254] collecting diagnostics on the listening RPC socket unix:/tmp/dist-test-taskrMO9hW/test-tmp/rpc-test-0a648f040ff742c09e25a2e2ef6205e0.sock every 8 connection(s)
I20260927 15:07:18.901825 27003 acceptor_pool.cc:254] collecting diagnostics on the listening RPC socket unix:/tmp/dist-test-taskrMO9hW/test-tmp/rpc-test-0a648f040ff742c09e25a2e2ef6205e0.sock every 8 connection(s)
[       OK ] Parameters/TestRpc.TestNegotiationDeadlock/SSL_UnixSocket (26 ms)
[ RUN      ] Parameters/TestRpc.TestCallWithChainCertAndChainCA/SSL_UnixSocket
I20260927 15:07:18.922225 27018 acceptor_pool.cc:254] collecting diagnostics on the listening RPC socket unix:/tmp/dist-test-taskrMO9hW/test-tmp/rpc-test-8b0ddbee07c948a2862996c96ab03e28.sock every 8 connection(s)
I20260927 15:07:18.922271 27019 acceptor_pool.cc:254] collecting diagnostics on the listening RPC socket unix:/tmp/dist-test-taskrMO9hW/test-tmp/rpc-test-8b0ddbee07c948a2862996c96ab03e28.sock every 8 connection(s)
/data0/somelongdirectorytoavoidrpathissues/src/kudu/src/kudu/rpc/rpc-test.cc:270: Failure
Failed
Bad status: Runtime error: could not verify certificate chain (error with cert: subject=CN = localhost, ST = sadfjas, C = AS, emailAddress = sdflkdsajf, O = lskdfjlsad, OU = sldfkja, issuer=C = AS, ST = ASDfkjdhf, L = lskdjf, O = saldfja, OU = skdjf, CN = localhost, emailAddress = sadjflkadsj): : certificate has expired
Google Test trace:
/data0/somelongdirectorytoavoidrpathissues/src/kudu/src/kudu/rpc/rpc-test.cc:267: Connecting to unix:/tmp/dist-test-taskrMO9hW/test-tmp/rpc-test-8b0ddbee07c948a2862996c96ab03e28.sock
I20260927 15:07:18.927840 26982 test_util.cc:175] -----------------------------------------------
I20260927 15:07:18.927911 26982 test_util.cc:176] Had fatal failures, leaving test files at /tmp/dist-test-taskrMO9hW/test-tmp/rpc-test.6.Parameters_TestRpc.TestCallWithChainCertAndChainCA_SSL_UnixSocket.1790521638855905-26982-0
[  FAILED  ] Parameters/TestRpc.TestCallWithChainCertAndChainCA/SSL_UnixSocket, where GetParam() = (true, true) (14 ms)
[ RUN      ] Parameters/TestRpc.TestCallWithPasswordProtectedKey/SSL_UnixSocket
I20260927 15:07:18.957252 27043 acceptor_pool.cc:254] collecting diagnostics on the listening RPC socket unix:/tmp/dist-test-taskrMO9hW/test-tmp/rpc-test-9dcfc1b5b6d4469a8771bb26932451ac.sock every 8 connection(s)
I20260927 15:07:18.957264 27044 acceptor_pool.cc:254] collecting diagnostics on the listening RPC socket unix:/tmp/dist-test-taskrMO9hW/test-tmp/rpc-test-9dcfc1b5b6d4469a8771bb26932451ac.sock every 8 connection(s)
W20260927 15:07:18.971424 27040 connection.cc:196] Error closing socket: Network error: TlsSocket::Close: Broken pipe
[       OK ] Parameters/TestRpc.TestCallWithPasswordProtectedKey/SSL_UnixSocket (45 ms)
[ RUN      ] Parameters/TestRpc.TestCallToBadServer/SSL_UnixSocket
I20260927 15:07:19.000366 26982 rpc-test.cc:394] Status: Network error: Client connection negotiation failed: client connection to 0.0.0.0:0: connect: Connection refused (error 111)
I20260927 15:07:19.000919 26982 rpc-test.cc:394] Status: Network error: Client connection negotiation failed: client connection to 0.0.0.0:0: connect: Connection refused (error 111)
I20260927 15:07:19.001487 26982 rpc-test.cc:394] Status: Network error: Client connection negotiation failed: client connection to 0.0.0.0:0: connect: Connection refused (error 111)
I20260927 15:07:19.001986 26982 rpc-test.cc:394] Status: Network error: Client connection negotiation failed: client connection to 0.0.0.0:0: connect: Connection refused (error 111)
I20260927 15:07:19.002514 26982 rpc-test.cc:394] Status: Network error: Client connection negotiation failed: client connection to 0.0.0.0:0: connect: Connection refused (error 111)
[       OK ] Parameters/TestRpc.TestCallToBadServer/SSL_UnixSocket (30 ms)
[ RUN      ] Parameters/TestRpc.TestWrongService/SSL_UnixSocket
I20260927 15:07:19.009970 27078 acceptor_pool.cc:254] collecting diagnostics on the listening RPC socket unix:/tmp/dist-test-taskrMO9hW/test-tmp/rpc-test-275a722277ff40cc8c8831174ca4c878.sock every 8 connection(s)
I20260927 15:07:19.010002 27079 acceptor_pool.cc:254] collecting diagnostics on the listening RPC socket unix:/tmp/dist-test-taskrMO9hW/test-tmp/rpc-test-275a722277ff40cc8c8831174ca4c878.sock every 8 connection(s)
I20260927 15:07:19.035868 27075 messenger.cc:345] service WrongServiceName not registered on TestServer
[       OK ] Parameters/TestRpc.TestWrongService/SSL_UnixSocket (34 ms)
[ RUN      ] Parameters/TestRpc.TestConnectionKeepalive/SSL_UnixSocket
I20260927 15:07:19.050421 27101 acceptor_pool.cc:254] collecting diagnostics on the listening RPC socket unix:/tmp/dist-test-taskrMO9hW/test-tmp/rpc-test-23905af45c2849bf834dc46b930562e3.sock every 8 connection(s)
I20260927 15:07:19.050433 27102 acceptor_pool.cc:254] collecting diagnostics on the listening RPC socket unix:/tmp/dist-test-taskrMO9hW/test-tmp/rpc-test-23905af45c2849bf834dc46b930562e3.sock every 8 connection(s)
I20260927 15:07:19.050758 26982 rpc-test.cc:488] Connecting to unix:/tmp/dist-test-taskrMO9hW/test-tmp/rpc-test-23905af45c2849bf834dc46b930562e3.sock
W20260927 15:07:19.540570 27114 connection.cc:196] Error closing socket: Network error: TlsSocket::Close: Broken pipe
[       OK ] Parameters/TestRpc.TestConnectionKeepalive/SSL_UnixSocket (1044 ms)
[ RUN      ] Parameters/TestRpc.TestClientConnectionMetrics/SSL_UnixSocket
I20260927 15:07:20.092547 27126 acceptor_pool.cc:254] collecting diagnostics on the listening RPC socket unix:/tmp/dist-test-taskrMO9hW/test-tmp/rpc-test-1d40b348a3604f86adb1830b6a4c125d.sock every 8 connection(s)
I20260927 15:07:20.092576 27127 acceptor_pool.cc:254] collecting diagnostics on the listening RPC socket unix:/tmp/dist-test-taskrMO9hW/test-tmp/rpc-test-1d40b348a3604f86adb1830b6a4c125d.sock every 8 connection(s)
I20260927 15:07:20.092855 26982 rpc-test.cc:569] Connecting to unix:/tmp/dist-test-taskrMO9hW/test-tmp/rpc-test-1d40b348a3604f86adb1830b6a4c125d.sock
W20260927 15:07:32.020745 27123 connection.cc:196] Error closing socket: Network error: TlsSocket::Close: Broken pipe
[       OK ] Parameters/TestRpc.TestClientConnectionMetrics/SSL_UnixSocket (11939 ms)
[ RUN      ] Parameters/TestRpc.TestCredentialsPolicy/SSL_UnixSocket
I20260927 15:07:32.037006 27149 acceptor_pool.cc:254] collecting diagnostics on the listening RPC socket unix:/tmp/dist-test-taskrMO9hW/test-tmp/rpc-test-e9cd659f33824eb9956e35ee0f730db5.sock every 8 connection(s)
I20260927 15:07:32.037137 27150 acceptor_pool.cc:254] collecting diagnostics on the listening RPC socket unix:/tmp/dist-test-taskrMO9hW/test-tmp/rpc-test-e9cd659f33824eb9956e35ee0f730db5.sock every 8 connection(s)
I20260927 15:07:32.037391 26982 rpc-test.cc:700] Connecting to unix:/tmp/dist-test-taskrMO9hW/test-tmp/rpc-test-e9cd659f33824eb9956e35ee0f730db5.sock
W20260927 15:07:32.061229 27148 connection.cc:196] Error closing socket: Network error: TlsSocket::Close: Broken pipe
[       OK ] Parameters/TestRpc.TestCredentialsPolicy/SSL_UnixSocket (46 ms)
[ RUN      ] Parameters/TestRpc.TestCallLongerThanKeepalive/SSL_UnixSocket
I20260927 15:07:32.086630 27174 acceptor_pool.cc:254] collecting diagnostics on the listening RPC socket unix:/tmp/dist-test-taskrMO9hW/test-tmp/rpc-test-e9ef7354e04c4511b8434c927472265c.sock every 8 connection(s)
I20260927 15:07:32.086647 27175 acceptor_pool.cc:254] collecting diagnostics on the listening RPC socket unix:/tmp/dist-test-taskrMO9hW/test-tmp/rpc-test-e9ef7354e04c4511b8434c927472265c.sock every 8 connection(s)
I20260927 15:07:32.100212 27178 rpc-test-base.h:222] got call: sleep_micros: 3000000 deferred: true
I20260927 15:07:35.101075 27178 rpcz_store.cc:275] Call kudu.rpc.GenericCalculatorService.Sleep from unix:<unnamed> (request call id 0) took 3001 ms. Trace:
I20260927 15:07:35.101179 27178 rpcz_store.cc:276] 0927 15:07:32.100100 (+     0us) service_pool.cc:170] Inserting onto call queue
0927 15:07:32.100185 (+    85us) service_pool.cc:227] Handling call
0927 15:07:35.101058 (+3000873us) inbound_call.cc:173] Queueing success response
Metrics: {}
[       OK ] Parameters/TestRpc.TestCallLongerThanKeepalive/SSL_UnixSocket (3035 ms)
[ RUN      ] Parameters/TestRpc.TestRpcSidecar/SSL_UnixSocket
I20260927 15:07:35.123795 27199 acceptor_pool.cc:254] collecting diagnostics on the listening RPC socket unix:/tmp/dist-test-taskrMO9hW/test-tmp/rpc-test-518394c6d3ba48f49e3fb3a508b38502.sock every 8 connection(s)
I20260927 15:07:35.123829 27200 acceptor_pool.cc:254] collecting diagnostics on the listening RPC socket unix:/tmp/dist-test-taskrMO9hW/test-tmp/rpc-test-518394c6d3ba48f49e3fb3a508b38502.sock every 8 connection(s)
W20260927 15:07:35.174394 27196 connection.cc:196] Error closing socket: Network error: TlsSocket::Close: Broken pipe
[       OK ] Parameters/TestRpc.TestRpcSidecar/SSL_UnixSocket (71 ms)
[ RUN      ] Parameters/TestRpc.TestRpcSidecarLimits/SSL_UnixSocket
I20260927 15:07:36.967764 27225 acceptor_pool.cc:254] collecting diagnostics on the listening RPC socket unix:/tmp/dist-test-taskrMO9hW/test-tmp/rpc-test-08cc2bee30264c81ad56cdddb0f84f70.sock every 8 connection(s)
I20260927 15:07:36.967759 27224 acceptor_pool.cc:254] collecting diagnostics on the listening RPC socket unix:/tmp/dist-test-taskrMO9hW/test-tmp/rpc-test-08cc2bee30264c81ad56cdddb0f84f70.sock every 8 connection(s)
W20260927 15:07:36.984753 26982 serialization.cc:72] Serialized kudu.rpc_test.PushStringsRequestPB (2147483654 bytes) is larger than the maximum configured RPC message size (52428800 bytes). Sending anyway, but peer may reject the data.
W20260927 15:07:36.988859 27221 connection.cc:535] server connection from unix:<unnamed> recv error: Network error: RPC frame had a length of 2147483714, but we only support messages up to 52428800 bytes long.
W20260927 15:07:36.988929 27221 connection.cc:158] shutting down server connection from unix:<unnamed> with pending inbound data: 4/2147483714 bytes received; last active 0 ns ago: status Network error: RPC frame had a length of 2147483714, but we only support messages up to 52428800 bytes long.
W20260927 15:07:36.989212 27237 connection.cc:196] Error closing socket: Network error: TlsSocket::Close: Broken pipe
I20260927 15:07:37.003149 27250 acceptor_pool.cc:254] collecting diagnostics on the listening RPC socket unix:/tmp/dist-test-taskrMO9hW/test-tmp/rpc-test-08cc2bee30264c81ad56cdddb0f84f70.sock every 8 connection(s)
I20260927 15:07:37.003126 27249 acceptor_pool.cc:254] collecting diagnostics on the listening RPC socket unix:/tmp/dist-test-taskrMO9hW/test-tmp/rpc-test-08cc2bee30264c81ad56cdddb0f84f70.sock every 8 connection(s)
W20260927 15:07:41.946892 27246 connection.cc:577] server connection from unix:<unnamed>: received bad data: 'Corruption: Invalid packet: message had a length of 2147483710, but we only support messages up to 2147483647 bytes
'
W20260927 15:07:41.947297 27262 connection.cc:196] Error closing socket: Network error: TlsSocket::Close: Broken pipe
[       OK ] Parameters/TestRpc.TestRpcSidecarLimits/SSL_UnixSocket (6773 ms)
[ RUN      ] Parameters/TestRpc.TestCallTimeoutDoesntAffectNegotiation/SSL_UnixSocket
I20260927 15:07:41.970865 27274 acceptor_pool.cc:254] collecting diagnostics on the listening RPC socket unix:/tmp/dist-test-taskrMO9hW/test-tmp/rpc-test-ab8cdbb3b3f244a986ae4972f81bf098.sock every 8 connection(s)
I20260927 15:07:41.971047 27275 acceptor_pool.cc:254] collecting diagnostics on the listening RPC socket unix:/tmp/dist-test-taskrMO9hW/test-tmp/rpc-test-ab8cdbb3b3f244a986ae4972f81bf098.sock every 8 connection(s)
W20260927 15:07:41.983989 27270 negotiation.cc:266] Injecting 500ms delay in negotiation
I20260927 15:07:42.034276 26982 rpc-test-base.h:595] status: Timed out: connection negotiation to unix:/tmp/dist-test-taskrMO9hW/test-tmp/rpc-test-ab8cdbb3b3f244a986ae4972f81bf098.sock for RPC Sleep timed out after 0.050s (ON_OUTBOUND_QUEUE), seconds elapsed: 0.0509228
W20260927 15:07:42.489426 27271 connection.cc:196] Error closing socket: Network error: TlsSocket::Close: Broken pipe
[       OK ] Parameters/TestRpc.TestCallTimeoutDoesntAffectNegotiation/SSL_UnixSocket (540 ms)
[ RUN      ] Parameters/TestRpc.TestRpcHandlerLatencyMetric/SSL_UnixSocket
I20260927 15:07:42.499704 27299 acceptor_pool.cc:254] collecting diagnostics on the listening RPC socket unix:/tmp/dist-test-taskrMO9hW/test-tmp/rpc-test-388ce1bd0fdb484d98f77cddc9e07a45.sock every 8 connection(s)
I20260927 15:07:42.499833 27300 acceptor_pool.cc:254] collecting diagnostics on the listening RPC socket unix:/tmp/dist-test-taskrMO9hW/test-tmp/rpc-test-388ce1bd0fdb484d98f77cddc9e07a45.sock every 8 connection(s)
I20260927 15:07:42.533178 26982 rpc-test.cc:1236] Sleep() min lat: 20454
I20260927 15:07:42.533252 26982 rpc-test.cc:1237] Sleep() mean lat: 20454
I20260927 15:07:42.533281 26982 rpc-test.cc:1238] Sleep() max lat: 20454
I20260927 15:07:42.533298 26982 rpc-test.cc:1239] Sleep() #calls: 1
W20260927 15:07:42.534063 27296 connection.cc:196] Error closing socket: Network error: TlsSocket::Close: Broken pipe
[       OK ] Parameters/TestRpc.TestRpcHandlerLatencyMetric/SSL_UnixSocket (44 ms)
[ RUN      ] Parameters/TestRpc.TimedOutOnResponseMetricServiceQueue/SSL_UnixSocket
I20260927 15:07:42.550438 27325 acceptor_pool.cc:254] collecting diagnostics on the listening RPC socket unix:/tmp/dist-test-taskrMO9hW/test-tmp/rpc-test-791253f0c2bb4fb0925bfa66fb6e5aef.sock every 8 connection(s)
I20260927 15:07:42.550475 27326 acceptor_pool.cc:254] collecting diagnostics on the listening RPC socket unix:/tmp/dist-test-taskrMO9hW/test-tmp/rpc-test-791253f0c2bb4fb0925bfa66fb6e5aef.sock every 8 connection(s)
W20260927 15:07:42.608237 27327 rpcz_store.cc:267] Call kudu.rpc_test.CalculatorService.Sleep from unix:<unnamed> (request call id 2) took 20 ms (client timeout 20 ms). Trace:
W20260927 15:07:42.608353 27327 rpcz_store.cc:269] 0927 15:07:42.587779 (+     0us) service_pool.cc:170] Inserting onto call queue
0927 15:07:42.608177 (+ 20398us) service_pool.cc:214] Skipping call since client already timed out
0927 15:07:42.608218 (+    41us) inbound_call.cc:173] Queueing failure response
Metrics: {}
W20260927 15:07:42.609230 27322 connection.cc:196] Error closing socket: Network error: TlsSocket::Close: Broken pipe
[       OK ] Parameters/TestRpc.TimedOutOnResponseMetricServiceQueue/SSL_UnixSocket (74 ms)
[ RUN      ] Parameters/TestRpc.RpcPendingConnectionsMetric/SSL_UnixSocket
I20260927 15:07:42.613234 27348 acceptor_pool.cc:254] collecting diagnostics on the listening RPC socket 0.0.0.0:42175 every 8 connection(s)
I20260927 15:07:42.613469 27349 acceptor_pool.cc:254] collecting diagnostics on the listening RPC socket 0.0.0.0:42175 every 8 connection(s)
W20260927 15:07:42.614626 27344 negotiation.cc:337] Failed RPC negotiation. Trace:
0927 15:07:42.614212 (+     0us) reactor.cc:625] Submitting negotiation task for server connection from 127.0.0.1:60358 (local address 127.0.0.1:42175)
0927 15:07:42.614318 (+   106us) server_negotiation.cc:206] Beginning negotiation
0927 15:07:42.614321 (+     3us) server_negotiation.cc:399] Waiting for connection header
0927 15:07:42.614409 (+    88us) negotiation.cc:327] Negotiation complete: Network error: Server connection negotiation failed: server connection from 127.0.0.1:60358: BlockingRecv error: recv got EOF from 127.0.0.1:60358 (error 108)
Metrics: {"server-negotiator.queue_time_us":33}
[       OK ] Parameters/TestRpc.RpcPendingConnectionsMetric/SSL_UnixSocket (15 ms)
[ RUN      ] Parameters/TestRpc.TestRpcContextClientDeadline/SSL_UnixSocket
I20260927 15:07:42.634501 27364 acceptor_pool.cc:254] collecting diagnostics on the listening RPC socket unix:/tmp/dist-test-taskrMO9hW/test-tmp/rpc-test-dce1c1b16ef94bccae9a984b6fc71117.sock every 8 connection(s)
I20260927 15:07:42.634544 27365 acceptor_pool.cc:254] collecting diagnostics on the listening RPC socket unix:/tmp/dist-test-taskrMO9hW/test-tmp/rpc-test-dce1c1b16ef94bccae9a984b6fc71117.sock every 8 connection(s)
[       OK ] Parameters/TestRpc.TestRpcContextClientDeadline/SSL_UnixSocket (53 ms)
[ RUN      ] Parameters/TestRpc.TestApplicationFeatureFlagUnsupportedServer/SSL_UnixSocket
I20260927 15:07:42.705075 27390 acceptor_pool.cc:254] collecting diagnostics on the listening RPC socket unix:/tmp/dist-test-taskrMO9hW/test-tmp/rpc-test-da8830fbe6ce462d8ac04e85528780d9.sock every 8 connection(s)
I20260927 15:07:42.705075 27389 acceptor_pool.cc:254] collecting diagnostics on the listening RPC socket unix:/tmp/dist-test-taskrMO9hW/test-tmp/rpc-test-da8830fbe6ce462d8ac04e85528780d9.sock every 8 connection(s)
[       OK ] Parameters/TestRpc.TestApplicationFeatureFlagUnsupportedServer/SSL_UnixSocket (50 ms)
[ RUN      ] Parameters/TestRpc.TestCancellationAsync/SSL_UnixSocket
I20260927 15:07:42.755149 27414 acceptor_pool.cc:254] collecting diagnostics on the listening RPC socket unix:/tmp/dist-test-taskrMO9hW/test-tmp/rpc-test-d1a7593cb9e2440fb3d50753cd75201a.sock every 8 connection(s)
I20260927 15:07:42.755188 27415 acceptor_pool.cc:254] collecting diagnostics on the listening RPC socket unix:/tmp/dist-test-taskrMO9hW/test-tmp/rpc-test-d1a7593cb9e2440fb3d50753cd75201a.sock every 8 connection(s)
I20260927 15:07:42.755515 26982 rpc-test.cc:1716] Connecting to unix:/tmp/dist-test-taskrMO9hW/test-tmp/rpc-test-d1a7593cb9e2440fb3d50753cd75201a.sock
I20260927 15:07:42.762962 26982 test_util.cc:268] Using random seed: 1336668111
I20260927 15:07:42.786315 27418 rpc-test-base.h:240] got call: sleep_micros: 500 pattern: 4294967295 num_repetitions: 2097152 sidecar_idx: 0
I20260927 15:07:42.805962 27417 rpc-test-base.h:240] got call: sleep_micros: 500 pattern: 4294967295 num_repetitions: 2097152 sidecar_idx: 0
I20260927 15:07:42.824370 27418 rpc-test-base.h:240] got call: sleep_micros: 500 pattern: 4294967295 num_repetitions: 2097152 sidecar_idx: 0
I20260927 15:07:42.841665 27417 rpc-test-base.h:240] got call: sleep_micros: 500 pattern: 4294967295 num_repetitions: 2097152 sidecar_idx: 0
I20260927 15:07:42.858750 27418 rpc-test-base.h:240] got call: sleep_micros: 500 pattern: 4294967295 num_repetitions: 2097152 sidecar_idx: 0
I20260927 15:07:42.875559 27417 rpc-test-base.h:240] got call: sleep_micros: 500 pattern: 4294967295 num_repetitions: 2097152 sidecar_idx: 0
I20260927 15:07:42.892354 27418 rpc-test-base.h:240] got call: sleep_micros: 500 pattern: 4294967295 num_repetitions: 2097152 sidecar_idx: 0
W20260927 15:07:42.894162 27411 connection.cc:196] Error closing socket: Network error: TlsSocket::Close: Broken pipe
W20260927 15:07:42.900570 27411 connection.cc:441] server connection from unix:<unnamed> torn down before Call kudu.rpc.GenericCalculatorService.SleepWithSidecar from unix:<unnamed> (request call id 8) could send its response
W20260927 15:07:42.910487 27411 connection.cc:441] server connection from unix:<unnamed> torn down before Call kudu.rpc.GenericCalculatorService.SleepWithSidecar from unix:<unnamed> (request call id 9) could send its response
[       OK ] Parameters/TestRpc.TestCancellationAsync/SSL_UnixSocket (182 ms)
[ RUN      ] Parameters/TestRpc.TestPerformanceBySocketType/SSL_UnixSocket
I20260927 15:07:42.932834 27439 acceptor_pool.cc:254] collecting diagnostics on the listening RPC socket unix:/tmp/dist-test-taskrMO9hW/test-tmp/rpc-test-63e61a6162d04df58a99198c4e793f68.sock every 8 connection(s)
I20260927 15:07:42.932844 27440 acceptor_pool.cc:254] collecting diagnostics on the listening RPC socket unix:/tmp/dist-test-taskrMO9hW/test-tmp/rpc-test-63e61a6162d04df58a99198c4e793f68.sock every 8 connection(s)
I20260927 15:07:42.933172 26982 rpc-test.cc:1846] Connecting to unix:/tmp/dist-test-taskrMO9hW/test-tmp/rpc-test-63e61a6162d04df58a99198c4e793f68.sock
I20260927 15:07:44.664692 26982 rpc-test.cc:1859] Sending 1024MB via ssl-enabled unix socket: real 1.717s	user 2.069s	sys 0.990s
I20260927 15:07:46.288903 26982 rpc-test.cc:1859] Sending 1024MB via ssl-enabled unix socket: real 1.624s	user 2.049s	sys 0.860s
I20260927 15:07:47.935520 26982 rpc-test.cc:1859] Sending 1024MB via ssl-enabled unix socket: real 1.647s	user 2.071s	sys 0.888s
I20260927 15:07:49.678017 26982 rpc-test.cc:1859] Sending 1024MB via ssl-enabled unix socket: real 1.742s	user 2.234s	sys 0.908s
I20260927 15:07:51.440233 26982 rpc-test.cc:1859] Sending 1024MB via ssl-enabled unix socket: real 1.762s	user 2.123s	sys 1.009s
W20260927 15:07:51.441154 27436 connection.cc:196] Error closing socket: Network error: TlsSocket::Close: Broken pipe
[       OK ] Parameters/TestRpc.TestPerformanceBySocketType/SSL_UnixSocket (8529 ms)
[----------] 20 tests from Parameters/TestRpc (32579 ms total)

[----------] 1 test from Parameters/TestRpcSocketTxRxQueue
[ RUN      ] Parameters/TestRpcSocketTxRxQueue.AcceptorRxQueueSizeMetric/0
I20260927 15:07:51.450062 27464 acceptor_pool.cc:254] collecting diagnostics on the listening RPC socket 0.0.0.0:43925 every 1 connection(s)
I20260927 15:07:51.450130 27465 acceptor_pool.cc:254] collecting diagnostics on the listening RPC socket 0.0.0.0:43925 every 1 connection(s)
W20260927 15:07:51.451126 27460 negotiation.cc:337] Failed RPC negotiation. Trace:
0927 15:07:51.450846 (+     0us) reactor.cc:625] Submitting negotiation task for server connection from 127.0.0.1:49876 (local address 127.0.0.1:43925)
0927 15:07:51.450959 (+   113us) server_negotiation.cc:206] Beginning negotiation
0927 15:07:51.450962 (+     3us) server_negotiation.cc:399] Waiting for connection header
0927 15:07:51.451057 (+    95us) negotiation.cc:327] Negotiation complete: Network error: Server connection negotiation failed: server connection from 127.0.0.1:49876: BlockingRecv error: recv got EOF from 127.0.0.1:49876 (error 108)
Metrics: {"server-negotiator.queue_time_us":40}
[       OK ] Parameters/TestRpcSocketTxRxQueue.AcceptorRxQueueSizeMetric/0 (10 ms)
[----------] 1 test from Parameters/TestRpcSocketTxRxQueue (10 ms total)

[----------] Global test environment tear-down
[==========] 21 tests from 2 test suites ran. (32590 ms total)
[  PASSED  ] 20 tests.
[  FAILED  ] 1 test, listed below:
[  FAILED  ] Parameters/TestRpc.TestCallWithChainCertAndChainCA/SSL_UnixSocket, where GetParam() = (true, true)

 1 FAILED TEST