Parameters/TestRpc.TestCallWithChainCertAndRootCA/SSL_TCP: /data0/somelongdirectorytoavoidrpathissues/src/kudu/src/kudu/rpc/rpc-test.cc:303: Failure
Failed
Bad status: Runtime error: could not verify certificate chain (error with cert: subject=CN = localhost, ST = sadfjas, C = AS, emailAddress = sdflkdsajf, O = lskdfjlsad, OU = sldfkja, issuer=C = AS, ST = ASDfkjdhf, L = lskdjf, O = saldfja, OU = skdjf, CN = localhost, emailAddress = sadjflkadsj): : certificate has expired
Google Test trace:
/data0/somelongdirectorytoavoidrpathissues/src/kudu/src/kudu/rpc/rpc-test.cc:300: Connecting to 0.0.0.0:36507
I20260925 16:42:40.315864 5791 test_util.cc:175] -----------------------------------------------
I20260925 16:42:40.316047 5791 test_util.cc:176] Had fatal failures, leaving test files at /tmp/dist-test-taskpWJFIP/test-tmp/rpc-test.1.Parameters_TestRpc.TestCallWithChainCertAndRootCA_SSL_TCP.1790354558767700-5791-0
Note: This is test shard 2 of 8.
[==========] Running 21 tests from 2 test suites.
[----------] Global test environment set-up.
[----------] 1 test from TestRpc
[ RUN ] TestRpc.TestMethodsByName
[ OK ] TestRpc.TestMethodsByName (7 ms)
[----------] 1 test from TestRpc (7 ms total)
[----------] 20 tests from Parameters/TestRpc
[ RUN ] Parameters/TestRpc.TestAcceptorPoolStartStop/SSL_TCP
WARNING: Logging before InitGoogleLogging() is written to STDERR
I20260925 16:42:38.878364 5806 acceptor_pool.cc:254] collecting diagnostics on the listening RPC socket 0.0.0.0:40575 every 8 connection(s)
W20260925 16:42:39.880707 5791 thread.cc:536] Waited for 1000ms trying to join with acceptor (tid 5807)
I20260925 16:42:38.879995 5807 acceptor_pool.cc:254] collecting diagnostics on the listening RPC socket 0.0.0.0:40575 every 8 connection(s)
I20260925 16:42:40.052579 5818 acceptor_pool.cc:254] collecting diagnostics on the listening RPC socket 0.0.0.0:39467 every 8 connection(s)
I20260925 16:42:40.054195 5819 acceptor_pool.cc:254] collecting diagnostics on the listening RPC socket 0.0.0.0:39467 every 8 connection(s)
I20260925 16:42:40.078202 5829 acceptor_pool.cc:254] collecting diagnostics on the listening RPC socket 0.0.0.0:42713 every 8 connection(s)
I20260925 16:42:40.079659 5830 acceptor_pool.cc:254] collecting diagnostics on the listening RPC socket 0.0.0.0:42713 every 8 connection(s)
I20260925 16:42:40.107465 5840 acceptor_pool.cc:254] collecting diagnostics on the listening RPC socket 0.0.0.0:38583 every 8 connection(s)
I20260925 16:42:40.108178 5841 acceptor_pool.cc:254] collecting diagnostics on the listening RPC socket 0.0.0.0:38583 every 8 connection(s)
I20260925 16:42:40.136273 5851 acceptor_pool.cc:254] collecting diagnostics on the listening RPC socket 0.0.0.0:42327 every 8 connection(s)
I20260925 16:42:40.137022 5852 acceptor_pool.cc:254] collecting diagnostics on the listening RPC socket 0.0.0.0:42327 every 8 connection(s)
[ OK ] Parameters/TestRpc.TestAcceptorPoolStartStop/SSL_TCP (1318 ms)
[ RUN ] Parameters/TestRpc.TestCall/SSL_TCP
I20260925 16:42:40.163141 5864 acceptor_pool.cc:254] collecting diagnostics on the listening RPC socket 0.0.0.0:36921 every 8 connection(s)
I20260925 16:42:40.164840 5865 acceptor_pool.cc:254] collecting diagnostics on the listening RPC socket 0.0.0.0:36921 every 8 connection(s)
I20260925 16:42:40.170552 5791 rpc-test.cc:234] Connecting to 0.0.0.0:36921
[ OK ] Parameters/TestRpc.TestCall/SSL_TCP (114 ms)
[ RUN ] Parameters/TestRpc.TestCallWithChainCertAndRootCA/SSL_TCP
I20260925 16:42:40.295382 5889 acceptor_pool.cc:254] collecting diagnostics on the listening RPC socket 0.0.0.0:36507 every 8 connection(s)
I20260925 16:42:40.296130 5890 acceptor_pool.cc:254] collecting diagnostics on the listening RPC socket 0.0.0.0:36507 every 8 connection(s)
/data0/somelongdirectorytoavoidrpathissues/src/kudu/src/kudu/rpc/rpc-test.cc:303: Failure
Failed
Bad status: Runtime error: could not verify certificate chain (error with cert: subject=CN = localhost, ST = sadfjas, C = AS, emailAddress = sdflkdsajf, O = lskdfjlsad, OU = sldfkja, issuer=C = AS, ST = ASDfkjdhf, L = lskdjf, O = saldfja, OU = skdjf, CN = localhost, emailAddress = sadjflkadsj): : certificate has expired
Google Test trace:
/data0/somelongdirectorytoavoidrpathissues/src/kudu/src/kudu/rpc/rpc-test.cc:300: Connecting to 0.0.0.0:36507
I20260925 16:42:40.315864 5791 test_util.cc:175] -----------------------------------------------
I20260925 16:42:40.316047 5791 test_util.cc:176] Had fatal failures, leaving test files at /tmp/dist-test-taskpWJFIP/test-tmp/rpc-test.1.Parameters_TestRpc.TestCallWithChainCertAndRootCA_SSL_TCP.1790354558767700-5791-0
[ FAILED ] Parameters/TestRpc.TestCallWithChainCertAndRootCA/SSL_TCP, where GetParam() = (true, false) (55 ms)
[ RUN ] Parameters/TestRpc.TestCallWithBadPasswordProtectedKey/SSL_TCP
[ OK ] Parameters/TestRpc.TestCallWithBadPasswordProtectedKey/SSL_TCP (30 ms)
[ RUN ] Parameters/TestRpc.TestInvalidMethodCall/SSL_TCP
I20260925 16:42:40.380517 5926 acceptor_pool.cc:254] collecting diagnostics on the listening RPC socket 0.0.0.0:42883 every 8 connection(s)
I20260925 16:42:40.381381 5927 acceptor_pool.cc:254] collecting diagnostics on the listening RPC socket 0.0.0.0:42883 every 8 connection(s)
I20260925 16:42:40.384835 5791 rpc-test.cc:406] Connecting to 0.0.0.0:42883
[ OK ] Parameters/TestRpc.TestInvalidMethodCall/SSL_TCP (78 ms)
[ RUN ] Parameters/TestRpc.TestHighFDs/SSL_TCP
I20260925 16:42:40.637343 5951 acceptor_pool.cc:254] collecting diagnostics on the listening RPC socket 0.0.0.0:39461 every 8 connection(s)
I20260925 16:42:40.638028 5952 acceptor_pool.cc:254] collecting diagnostics on the listening RPC socket 0.0.0.0:39461 every 8 connection(s)
[ OK ] Parameters/TestRpc.TestHighFDs/SSL_TCP (268 ms)
[ RUN ] Parameters/TestRpc.TestConnectionAlwaysKeepalive/SSL_TCP
I20260925 16:42:40.715102 5974 acceptor_pool.cc:254] collecting diagnostics on the listening RPC socket 0.0.0.0:33393 every 8 connection(s)
I20260925 16:42:40.715790 5975 acceptor_pool.cc:254] collecting diagnostics on the listening RPC socket 0.0.0.0:33393 every 8 connection(s)
I20260925 16:42:40.718837 5791 rpc-test.cc:532] Connecting to 0.0.0.0:33393
[ OK ] Parameters/TestRpc.TestConnectionAlwaysKeepalive/SSL_TCP (3068 ms)
[ RUN ] Parameters/TestRpc.TestReopenOutboundConnections/SSL_TCP
I20260925 16:42:43.821182 5997 acceptor_pool.cc:254] collecting diagnostics on the listening RPC socket 0.0.0.0:45423 every 8 connection(s)
I20260925 16:42:43.821892 5998 acceptor_pool.cc:254] collecting diagnostics on the listening RPC socket 0.0.0.0:45423 every 8 connection(s)
I20260925 16:42:43.825148 5791 rpc-test.cc:658] Connecting to 0.0.0.0:45423
[ OK ] Parameters/TestRpc.TestReopenOutboundConnections/SSL_TCP (415 ms)
[ RUN ] Parameters/TestRpc.TestConnectionNetworkPlane/SSL_TCP
I20260925 16:42:44.207242 6020 acceptor_pool.cc:254] collecting diagnostics on the listening RPC socket 0.0.0.0:33407 every 8 connection(s)
I20260925 16:42:44.207990 6021 acceptor_pool.cc:254] collecting diagnostics on the listening RPC socket 0.0.0.0:33407 every 8 connection(s)
I20260925 16:42:44.211122 5791 rpc-test.cc:772] Connecting to 0.0.0.0:33407
[ OK ] Parameters/TestRpc.TestConnectionNetworkPlane/SSL_TCP (79 ms)
[ RUN ] Parameters/TestRpc.TestTCPKeepalive/SSL_TCP
I20260925 16:42:44.287974 6045 acceptor_pool.cc:254] collecting diagnostics on the listening RPC socket 0.0.0.0:35313 every 8 connection(s)
I20260925 16:42:44.288731 6046 acceptor_pool.cc:254] collecting diagnostics on the listening RPC socket 0.0.0.0:35313 every 8 connection(s)
I20260925 16:42:44.315757 6049 rpc-test-base.h:222] got call: sleep_micros: 8000000 deferred: true
I20260925 16:42:52.319885 6049 rpcz_store.cc:275] Call kudu.rpc.GenericCalculatorService.Sleep from 127.0.0.1:58372 (request call id 0) took 8004 ms. Trace:
I20260925 16:42:52.320304 6049 rpcz_store.cc:276] 0925 16:42:44.315477 (+ 0us) service_pool.cc:170] Inserting onto call queue
0925 16:42:44.315597 (+ 120us) service_pool.cc:227] Handling call
0925 16:42:52.319711 (+8004114us) inbound_call.cc:173] Queueing success response
Metrics: {}
[ OK ] Parameters/TestRpc.TestTCPKeepalive/SSL_TCP (8076 ms)
[ RUN ] Parameters/TestRpc.TestMaxSmallSidecars/SSL_TCP
I20260925 16:42:52.351502 6071 acceptor_pool.cc:254] collecting diagnostics on the listening RPC socket 0.0.0.0:39449 every 8 connection(s)
I20260925 16:42:52.352339 6072 acceptor_pool.cc:254] collecting diagnostics on the listening RPC socket 0.0.0.0:39449 every 8 connection(s)
[ OK ] Parameters/TestRpc.TestMaxSmallSidecars/SSL_TCP (188 ms)
[ RUN ] Parameters/TestRpc.TestCallTimeout/SSL_TCP
I20260925 16:42:52.544303 6096 acceptor_pool.cc:254] collecting diagnostics on the listening RPC socket 0.0.0.0:34471 every 8 connection(s)
I20260925 16:42:52.545073 6097 acceptor_pool.cc:254] collecting diagnostics on the listening RPC socket 0.0.0.0:34471 every 8 connection(s)
I20260925 16:42:52.583905 5791 rpc-test-base.h:595] status: Timed out: connection negotiation to 0.0.0.0:34471 for RPC Sleep timed out after 0.000s (ON_OUTBOUND_QUEUE), seconds elapsed: 0.00303082
I20260925 16:42:52.590613 6100 rpc-test-base.h:222] got call: sleep_micros: 700000
I20260925 16:42:52.785532 5791 rpc-test-base.h:595] status: Timed out: Sleep RPC to 0.0.0.0:34471 timed out after 0.200s (SENT), seconds elapsed: 0.201169
I20260925 16:42:52.786947 6099 rpc-test-base.h:222] got call: sleep_micros: 2000000
W20260925 16:42:53.291319 6100 rpcz_store.cc:267] Call kudu.rpc.GenericCalculatorService.Sleep from 127.0.0.1:44316 (request call id 1) took 700 ms (client timeout 200 ms). Trace:
W20260925 16:42:53.291705 6100 rpcz_store.cc:269] 0925 16:42:52.590456 (+ 0us) service_pool.cc:170] Inserting onto call queue
0925 16:42:52.590557 (+ 101us) service_pool.cc:227] Handling call
0925 16:42:53.291246 (+700689us) inbound_call.cc:173] Queueing success response
Metrics: {}
I20260925 16:42:54.288100 5791 rpc-test-base.h:595] status: Timed out: Sleep RPC to 0.0.0.0:34471 timed out after 1.500s (SENT), seconds elapsed: 1.50224
W20260925 16:42:54.787467 6099 rpcz_store.cc:267] Call kudu.rpc.GenericCalculatorService.Sleep from 127.0.0.1:44316 (request call id 2) took 2000 ms (client timeout 1500 ms). Trace:
W20260925 16:42:54.787834 6099 rpcz_store.cc:269] 0925 16:42:52.786665 (+ 0us) service_pool.cc:170] Inserting onto call queue
0925 16:42:52.786788 (+ 123us) service_pool.cc:227] Handling call
0925 16:42:54.787410 (+2000622us) inbound_call.cc:173] Queueing success response
Metrics: {}
W20260925 16:42:54.788408 6095 connection.cc:441] server connection from 127.0.0.1:44316 torn down before Call kudu.rpc.GenericCalculatorService.Sleep from 127.0.0.1:44316 (request call id 2) could send its response
[ OK ] Parameters/TestRpc.TestCallTimeout/SSL_TCP (2270 ms)
[ RUN ] Parameters/TestRpc.TestServerShutsDown/SSL_TCP
I20260925 16:42:54.795279 5791 rpc-test.cc:1125] Connecting to 0.0.0.0:33961
W20260925 16:42:54.805125 6113 negotiation.cc:337] Failed RPC negotiation. Trace:
0925 16:42:54.803489 (+ 0us) reactor.cc:625] Submitting negotiation task for client connection to 0.0.0.0:33961 (local address 127.0.0.1:55498)
0925 16:42:54.803987 (+ 498us) negotiation.cc:107] Waiting for socket to connect
0925 16:42:54.804016 (+ 29us) client_negotiation.cc:174] Beginning negotiation
0925 16:42:54.804226 (+ 210us) client_negotiation.cc:252] Sending NEGOTIATE NegotiatePB request
0925 16:42:54.804429 (+ 203us) negotiation.cc:327] Negotiation complete: Network error: Client connection negotiation failed: client connection to 0.0.0.0:33961: BlockingWrite error: write error: Broken pipe (error 32)
Metrics: {"client-negotiator.queue_time_us":182}
[ OK ] Parameters/TestRpc.TestServerShutsDown/SSL_TCP (14 ms)
[ RUN ] Parameters/TestRpc.TimedOutOnResponseMetric/SSL_TCP
I20260925 16:42:54.836055 6130 acceptor_pool.cc:254] collecting diagnostics on the listening RPC socket 0.0.0.0:33069 every 8 connection(s)
I20260925 16:42:54.836802 6131 acceptor_pool.cc:254] collecting diagnostics on the listening RPC socket 0.0.0.0:33069 every 8 connection(s)
W20260925 16:42:55.073652 6134 rpcz_store.cc:267] Call kudu.rpc_test.CalculatorService.Sleep from 127.0.0.1:35562 (request call id 3) took 50 ms (client timeout 25 ms). Trace:
W20260925 16:42:55.073989 6134 rpcz_store.cc:269] 0925 16:42:55.023110 (+ 0us) service_pool.cc:170] Inserting onto call queue
0925 16:42:55.023209 (+ 99us) service_pool.cc:227] Handling call
0925 16:42:55.073575 (+ 50366us) inbound_call.cc:173] Queueing success response
Related trace 'test_child':
Metrics: {"test_sleep_us":50000,"child_traces":[["test_child",{"related_trace_metric":1}]]}
W20260925 16:42:55.133150 6134 rpcz_store.cc:267] Call kudu.rpc_test.CalculatorService.Sleep from 127.0.0.1:35562 (request call id 4) took 50 ms (client timeout 50 ms). Trace:
W20260925 16:42:55.133540 6134 rpcz_store.cc:269] 0925 16:42:55.082621 (+ 0us) service_pool.cc:170] Inserting onto call queue
0925 16:42:55.082725 (+ 104us) service_pool.cc:227] Handling call
0925 16:42:55.133086 (+ 50361us) inbound_call.cc:173] Queueing success response
Related trace 'test_child':
Metrics: {"test_sleep_us":50000,"child_traces":[["test_child",{"related_trace_metric":1}]]}
[ OK ] Parameters/TestRpc.TimedOutOnResponseMetric/SSL_TCP (334 ms)
[ RUN ] Parameters/TestRpc.AcceptorDispatchingTimesMetric/SSL_TCP
I20260925 16:42:55.152743 6155 acceptor_pool.cc:254] collecting diagnostics on the listening RPC socket 0.0.0.0:33395 every 8 connection(s)
I20260925 16:42:55.153394 6156 acceptor_pool.cc:254] collecting diagnostics on the listening RPC socket 0.0.0.0:33395 every 8 connection(s)
W20260925 16:42:55.160234 6151 negotiation.cc:337] Failed RPC negotiation. Trace:
0925 16:42:55.157857 (+ 0us) reactor.cc:625] Submitting negotiation task for server connection from 127.0.0.1:48302 (local address 127.0.0.1:33395)
0925 16:42:55.158499 (+ 642us) server_negotiation.cc:206] Beginning negotiation
0925 16:42:55.158533 (+ 34us) server_negotiation.cc:399] Waiting for connection header
0925 16:42:55.158939 (+ 406us) negotiation.cc:327] Negotiation complete: Network error: Server connection negotiation failed: server connection from 127.0.0.1:48302: BlockingRecv error: recv got EOF from 127.0.0.1:48302 (error 108)
Metrics: {"server-negotiator.queue_time_us":121}
[ OK ] Parameters/TestRpc.AcceptorDispatchingTimesMetric/SSL_TCP (20 ms)
[ RUN ] Parameters/TestRpc.TestRpcCallbackDestroysMessenger/SSL_TCP
[ OK ] Parameters/TestRpc.TestRpcCallbackDestroysMessenger/SSL_TCP (27 ms)
[ RUN ] Parameters/TestRpc.TestApplicationFeatureFlag/SSL_TCP
I20260925 16:42:55.206888 6180 acceptor_pool.cc:254] collecting diagnostics on the listening RPC socket 0.0.0.0:40621 every 8 connection(s)
I20260925 16:42:55.207599 6181 acceptor_pool.cc:254] collecting diagnostics on the listening RPC socket 0.0.0.0:40621 every 8 connection(s)
W20260925 16:42:55.250066 6179 messenger.cc:357] Unable to handle RPC call: Not implemented: call requires unsupported application feature flags: 99
[ OK ] Parameters/TestRpc.TestApplicationFeatureFlag/SSL_TCP (67 ms)
[ RUN ] Parameters/TestRpc.TestCancellation/SSL_TCP
I20260925 16:42:55.298249 6205 acceptor_pool.cc:254] collecting diagnostics on the listening RPC socket 0.0.0.0:43395 every 8 connection(s)
I20260925 16:42:55.299034 6206 acceptor_pool.cc:254] collecting diagnostics on the listening RPC socket 0.0.0.0:43395 every 8 connection(s)
I20260925 16:42:55.302119 5791 rpc-test.cc:1648] Connecting to 0.0.0.0:43395
I20260925 16:42:55.420815 5791 rpc-test-base.h:595] status: Aborted: Sleep RPC to 0.0.0.0:43395 is cancelled in state READY, seconds elapsed: 0.000484765
I20260925 16:42:55.589596 5791 rpc-test-base.h:595] status: Aborted: Sleep RPC to 0.0.0.0:43395 is cancelled in state SENT, seconds elapsed: 0.00103849
I20260925 16:42:55.617677 6208 rpc-test-base.h:222] got call: sleep_micros: 510000
I20260925 16:42:55.766949 5791 rpc-test-base.h:595] status: Aborted: Sleep RPC to 0.0.0.0:43395 is cancelled in state SENT, seconds elapsed: 0.000880037
I20260925 16:42:55.801843 6207 rpc-test-base.h:222] got call: sleep_micros: 510000
I20260925 16:42:55.922868 5791 rpc-test-base.h:595] status: Aborted: Sleep RPC to 0.0.0.0:43395 is cancelled in state SENT, seconds elapsed: 0.000779757
W20260925 16:42:55.962067 6209 rpcz_store.cc:267] Call kudu.rpc.GenericCalculatorService.Sleep from 127.0.0.1:56604 (request call id 11) took 15 ms (client timeout 10 ms). Trace:
W20260925 16:42:55.962374 6209 rpcz_store.cc:269] 0925 16:42:55.946729 (+ 0us) service_pool.cc:170] Inserting onto call queue
0925 16:42:55.961775 (+ 15046us) service_pool.cc:214] Skipping call since client already timed out
0925 16:42:55.961885 (+ 110us) inbound_call.cc:173] Queueing failure response
Metrics: {}
I20260925 16:42:55.962910 6209 rpc-test-base.h:222] got call: sleep_micros: 1500000
W20260925 16:42:56.128466 6208 rpcz_store.cc:267] Call kudu.rpc.GenericCalculatorService.Sleep from 127.0.0.1:56604 (request call id 3) took 511 ms (client timeout 10 ms). Trace:
W20260925 16:42:56.128780 6208 rpcz_store.cc:269] 0925 16:42:55.617449 (+ 0us) service_pool.cc:170] Inserting onto call queue
0925 16:42:55.617585 (+ 136us) service_pool.cc:227] Handling call
0925 16:42:56.128412 (+510827us) inbound_call.cc:173] Queueing success response
Metrics: {}
W20260925 16:42:56.312579 6207 rpcz_store.cc:267] Call kudu.rpc.GenericCalculatorService.Sleep from 127.0.0.1:56604 (request call id 7) took 511 ms (client timeout 10 ms). Trace:
W20260925 16:42:56.313006 6207 rpcz_store.cc:269] 0925 16:42:55.801556 (+ 0us) service_pool.cc:170] Inserting onto call queue
0925 16:42:55.801754 (+ 198us) service_pool.cc:227] Handling call
0925 16:42:56.312523 (+510769us) inbound_call.cc:173] Queueing success response
Metrics: {}
I20260925 16:42:56.925045 5791 rpc-test-base.h:595] status: Timed out: Sleep RPC to 0.0.0.0:43395 timed out after 1.000s (SENT), seconds elapsed: 1.00178
I20260925 16:42:56.926295 6207 rpc-test-base.h:222] got call: sleep_micros: 1500000
W20260925 16:42:57.463407 6209 rpcz_store.cc:267] Call kudu.rpc.GenericCalculatorService.Sleep from 127.0.0.1:56604 (request call id 12) took 1516 ms (client timeout 1000 ms). Trace:
W20260925 16:42:57.463732 6209 rpcz_store.cc:269] 0925 16:42:55.947073 (+ 0us) service_pool.cc:170] Inserting onto call queue
0925 16:42:55.962882 (+ 15809us) service_pool.cc:227] Handling call
0925 16:42:57.463355 (+1500473us) inbound_call.cc:173] Queueing success response
Metrics: {}
I20260925 16:42:57.927561 5791 rpc-test-base.h:595] status: Timed out: Sleep RPC to 0.0.0.0:43395 timed out after 1.000s (SENT), seconds elapsed: 1.0022
W20260925 16:42:57.928951 6204 messenger.cc:357] Unable to handle RPC call: Not implemented: call requires unsupported application feature flags: 99, 1
W20260925 16:42:57.930290 6204 messenger.cc:357] Unable to handle RPC call: Not implemented: call requires unsupported application feature flags: 99, 1
W20260925 16:42:58.426813 6207 rpcz_store.cc:267] Call kudu.rpc.GenericCalculatorService.Sleep from 127.0.0.1:56604 (request call id 13) took 1500 ms (client timeout 1000 ms). Trace:
W20260925 16:42:58.427124 6207 rpcz_store.cc:269] 0925 16:42:56.926141 (+ 0us) service_pool.cc:170] Inserting onto call queue
0925 16:42:56.926249 (+ 108us) service_pool.cc:227] Handling call
0925 16:42:58.426758 (+1500509us) inbound_call.cc:173] Queueing success response
Metrics: {}
W20260925 16:42:58.427731 6204 connection.cc:441] server connection from 127.0.0.1:56604 torn down before Call kudu.rpc.GenericCalculatorService.Sleep from 127.0.0.1:56604 (request call id 13) could send its response
[ OK ] Parameters/TestRpc.TestCancellation/SSL_TCP (3175 ms)
[ RUN ] Parameters/TestRpc.TestCancellationMultiThreads/SSL_TCP
I20260925 16:42:58.456786 6230 acceptor_pool.cc:254] collecting diagnostics on the listening RPC socket 0.0.0.0:45843 every 8 connection(s)
I20260925 16:42:58.457531 6231 acceptor_pool.cc:254] collecting diagnostics on the listening RPC socket 0.0.0.0:45843 every 8 connection(s)
I20260925 16:42:58.460606 5791 rpc-test.cc:1808] Connecting to 0.0.0.0:45843
I20260925 16:42:58.605875 6244 test_util.cc:268] Using random seed: 1756235541
I20260925 16:42:58.606978 6245 test_util.cc:268] Using random seed: 1756236650
I20260925 16:42:58.608348 6246 test_util.cc:268] Using random seed: 1756238008
I20260925 16:42:58.609685 6247 test_util.cc:268] Using random seed: 1756239340
I20260925 16:42:58.611203 6248 test_util.cc:268] Using random seed: 1756240742
I20260925 16:42:58.613054 6249 test_util.cc:268] Using random seed: 1756242566
I20260925 16:42:58.614603 6250 test_util.cc:268] Using random seed: 1756244157
I20260925 16:42:58.616155 6251 test_util.cc:268] Using random seed: 1756245684
I20260925 16:42:58.617748 6252 test_util.cc:268] Using random seed: 1756247265
I20260925 16:42:58.619220 6253 test_util.cc:268] Using random seed: 1756248768
I20260925 16:42:58.620580 6254 test_util.cc:268] Using random seed: 1756250126
I20260925 16:42:58.622156 6255 test_util.cc:268] Using random seed: 1756251682
I20260925 16:42:58.623821 6256 test_util.cc:268] Using random seed: 1756253300
I20260925 16:42:58.625422 6257 test_util.cc:268] Using random seed: 1756254939
I20260925 16:42:58.627081 6258 test_util.cc:268] Using random seed: 1756256557
I20260925 16:42:58.628661 6259 test_util.cc:268] Using random seed: 1756258172
I20260925 16:42:58.630648 6260 test_util.cc:268] Using random seed: 1756260140
I20260925 16:42:58.632221 6261 test_util.cc:268] Using random seed: 1756261751
I20260925 16:42:58.633939 6262 test_util.cc:268] Using random seed: 1756263463
I20260925 16:42:58.635597 6263 test_util.cc:268] Using random seed: 1756265070
I20260925 16:42:58.637720 6264 test_util.cc:268] Using random seed: 1756267265
I20260925 16:42:58.639348 6265 test_util.cc:268] Using random seed: 1756268841
I20260925 16:42:58.641077 6266 test_util.cc:268] Using random seed: 1756270607
I20260925 16:42:58.643203 6267 test_util.cc:268] Using random seed: 1756272699
I20260925 16:42:58.644802 6268 test_util.cc:268] Using random seed: 1756274300
I20260925 16:42:58.646468 6269 test_util.cc:268] Using random seed: 1756275956
I20260925 16:42:58.648098 6270 test_util.cc:268] Using random seed: 1756277557
I20260925 16:42:58.649816 6271 test_util.cc:268] Using random seed: 1756279255
I20260925 16:42:58.651443 6272 test_util.cc:268] Using random seed: 1756280958
I20260925 16:42:58.652822 6273 test_util.cc:268] Using random seed: 1756282315
[ OK ] Parameters/TestRpc.TestCancellationMultiThreads/SSL_TCP (17598 ms)
[ RUN ] Parameters/TestRpc.TestCallId/SSL_TCP
I20260925 16:43:16.053761 6287 acceptor_pool.cc:254] collecting diagnostics on the listening RPC socket 0.0.0.0:43043 every 8 connection(s)
I20260925 16:43:16.054575 6288 acceptor_pool.cc:254] collecting diagnostics on the listening RPC socket 0.0.0.0:43043 every 8 connection(s)
[ OK ] Parameters/TestRpc.TestCallId/SSL_TCP (79 ms)
[----------] 20 tests from Parameters/TestRpc (37285 ms total)
[----------] Global test environment tear-down
[==========] 21 tests from 2 test suites ran. (37293 ms total)
[ PASSED ] 20 tests.
[ FAILED ] 1 test, listed below:
[ FAILED ] Parameters/TestRpc.TestCallWithChainCertAndRootCA/SSL_TCP, where GetParam() = (true, false)
1 FAILED TEST