Diagnosed failure

Parameters/TestRpc.TestCallWithChainCertAndChainCA/SSL_TCP: /data0/somelongdirectorytoavoidrpathissues/src/kudu/src/kudu/rpc/rpc-test.cc:270: Failure
Failed
Bad status: Runtime error: could not verify certificate chain (error with cert: subject=CN = localhost, ST = sadfjas, C = AS, emailAddress = sdflkdsajf, O = lskdfjlsad, OU = sldfkja, issuer=C = AS, ST = ASDfkjdhf, L = lskdjf, O = saldfja, OU = skdjf, CN = localhost, emailAddress = sadjflkadsj): : certificate has expired
Google Test trace:
/data0/somelongdirectorytoavoidrpathissues/src/kudu/src/kudu/rpc/rpc-test.cc:267: Connecting to 0.0.0.0:36615
I20260925 15:09:25.171727  8560 test_util.cc:175] -----------------------------------------------
I20260925 15:09:25.171855  8560 test_util.cc:176] Had fatal failures, leaving test files at /tmp/dist-test-taskZfiTO2/test-tmp/rpc-test.5.Parameters_TestRpc.TestCallWithChainCertAndChainCA_SSL_TCP.1790348965029977-8560-0

Full log

Note: This is test shard 6 of 8.
[==========] Running 21 tests from 2 test suites.
[----------] Global test environment set-up.
[----------] 20 tests from Parameters/TestRpc
[ RUN      ] Parameters/TestRpc.TestMessengerCreateDestroy/SSL_TCP
WARNING: Logging before InitGoogleLogging() is written to STDERR
I20260925 15:09:25.094131  8560 rpc-test.cc:169] started messenger TestCreateDestroy
[       OK ] Parameters/TestRpc.TestMessengerCreateDestroy/SSL_TCP (48 ms)
[ RUN      ] Parameters/TestRpc.TestNegotiationDeadlock/SSL_TCP
I20260925 15:09:25.114586  8580 acceptor_pool.cc:254] collecting diagnostics on the listening RPC socket 0.0.0.0:44357 every 8 connection(s)
I20260925 15:09:25.114907  8581 acceptor_pool.cc:254] collecting diagnostics on the listening RPC socket 0.0.0.0:44357 every 8 connection(s)
[       OK ] Parameters/TestRpc.TestNegotiationDeadlock/SSL_TCP (39 ms)
[ RUN      ] Parameters/TestRpc.TestCallWithChainCertAndChainCA/SSL_TCP
I20260925 15:09:25.156750  8596 acceptor_pool.cc:254] collecting diagnostics on the listening RPC socket 0.0.0.0:36615 every 8 connection(s)
I20260925 15:09:25.157130  8597 acceptor_pool.cc:254] collecting diagnostics on the listening RPC socket 0.0.0.0:36615 every 8 connection(s)
/data0/somelongdirectorytoavoidrpathissues/src/kudu/src/kudu/rpc/rpc-test.cc:270: Failure
Failed
Bad status: Runtime error: could not verify certificate chain (error with cert: subject=CN = localhost, ST = sadfjas, C = AS, emailAddress = sdflkdsajf, O = lskdfjlsad, OU = sldfkja, issuer=C = AS, ST = ASDfkjdhf, L = lskdjf, O = saldfja, OU = skdjf, CN = localhost, emailAddress = sadjflkadsj): : certificate has expired
Google Test trace:
/data0/somelongdirectorytoavoidrpathissues/src/kudu/src/kudu/rpc/rpc-test.cc:267: Connecting to 0.0.0.0:36615
I20260925 15:09:25.171727  8560 test_util.cc:175] -----------------------------------------------
I20260925 15:09:25.171855  8560 test_util.cc:176] Had fatal failures, leaving test files at /tmp/dist-test-taskZfiTO2/test-tmp/rpc-test.5.Parameters_TestRpc.TestCallWithChainCertAndChainCA_SSL_TCP.1790348965029977-8560-0
[  FAILED  ] Parameters/TestRpc.TestCallWithChainCertAndChainCA/SSL_TCP, where GetParam() = (true, false) (35 ms)
[ RUN      ] Parameters/TestRpc.TestCallWithPasswordProtectedKey/SSL_TCP
I20260925 15:09:25.182948  8621 acceptor_pool.cc:254] collecting diagnostics on the listening RPC socket 0.0.0.0:45945 every 8 connection(s)
I20260925 15:09:25.183173  8622 acceptor_pool.cc:254] collecting diagnostics on the listening RPC socket 0.0.0.0:45945 every 8 connection(s)
[       OK ] Parameters/TestRpc.TestCallWithPasswordProtectedKey/SSL_TCP (46 ms)
[ RUN      ] Parameters/TestRpc.TestCallToBadServer/SSL_TCP
I20260925 15:09:25.230795  8560 rpc-test.cc:394] Status: Network error: Client connection negotiation failed: client connection to 0.0.0.0:0: connect: Connection refused (error 111)
I20260925 15:09:25.231524  8560 rpc-test.cc:394] Status: Network error: Client connection negotiation failed: client connection to 0.0.0.0:0: connect: Connection refused (error 111)
I20260925 15:09:25.232118  8560 rpc-test.cc:394] Status: Network error: Client connection negotiation failed: client connection to 0.0.0.0:0: connect: Connection refused (error 111)
I20260925 15:09:25.232635  8560 rpc-test.cc:394] Status: Network error: Client connection negotiation failed: client connection to 0.0.0.0:0: connect: Connection refused (error 111)
I20260925 15:09:25.233239  8560 rpc-test.cc:394] Status: Network error: Client connection negotiation failed: client connection to 0.0.0.0:0: connect: Connection refused (error 111)
[       OK ] Parameters/TestRpc.TestCallToBadServer/SSL_TCP (16 ms)
[ RUN      ] Parameters/TestRpc.TestWrongService/SSL_TCP
I20260925 15:09:25.249806  8656 acceptor_pool.cc:254] collecting diagnostics on the listening RPC socket 0.0.0.0:42619 every 8 connection(s)
I20260925 15:09:25.250106  8657 acceptor_pool.cc:254] collecting diagnostics on the listening RPC socket 0.0.0.0:42619 every 8 connection(s)
I20260925 15:09:25.280048  8654 messenger.cc:345] service WrongServiceName not registered on TestServer
[       OK ] Parameters/TestRpc.TestWrongService/SSL_TCP (50 ms)
[ RUN      ] Parameters/TestRpc.TestConnectionKeepalive/SSL_TCP
I20260925 15:09:25.296134  8679 acceptor_pool.cc:254] collecting diagnostics on the listening RPC socket 0.0.0.0:39383 every 8 connection(s)
I20260925 15:09:25.296383  8680 acceptor_pool.cc:254] collecting diagnostics on the listening RPC socket 0.0.0.0:39383 every 8 connection(s)
I20260925 15:09:25.297293  8560 rpc-test.cc:488] Connecting to 0.0.0.0:39383
[       OK ] Parameters/TestRpc.TestConnectionKeepalive/SSL_TCP (1047 ms)
[ RUN      ] Parameters/TestRpc.TestClientConnectionMetrics/SSL_TCP
I20260925 15:09:26.344424  8704 acceptor_pool.cc:254] collecting diagnostics on the listening RPC socket 0.0.0.0:43459 every 8 connection(s)
I20260925 15:09:26.344650  8705 acceptor_pool.cc:254] collecting diagnostics on the listening RPC socket 0.0.0.0:43459 every 8 connection(s)
I20260925 15:09:26.345532  8560 rpc-test.cc:569] Connecting to 0.0.0.0:43459
[       OK ] Parameters/TestRpc.TestClientConnectionMetrics/SSL_TCP (19605 ms)
[ RUN      ] Parameters/TestRpc.TestCredentialsPolicy/SSL_TCP
I20260925 15:09:45.964419  8727 acceptor_pool.cc:254] collecting diagnostics on the listening RPC socket 0.0.0.0:34209 every 8 connection(s)
I20260925 15:09:45.964550  8728 acceptor_pool.cc:254] collecting diagnostics on the listening RPC socket 0.0.0.0:34209 every 8 connection(s)
I20260925 15:09:45.965411  8560 rpc-test.cc:700] Connecting to 0.0.0.0:34209
[       OK ] Parameters/TestRpc.TestCredentialsPolicy/SSL_TCP (63 ms)
[ RUN      ] Parameters/TestRpc.TestCallLongerThanKeepalive/SSL_TCP
I20260925 15:09:46.020328  8752 acceptor_pool.cc:254] collecting diagnostics on the listening RPC socket 0.0.0.0:41875 every 8 connection(s)
I20260925 15:09:46.020566  8753 acceptor_pool.cc:254] collecting diagnostics on the listening RPC socket 0.0.0.0:41875 every 8 connection(s)
I20260925 15:09:46.047201  8756 rpc-test-base.h:222] got call: sleep_micros: 3000000 deferred: true
I20260925 15:09:49.048923  8756 rpcz_store.cc:275] Call kudu.rpc.GenericCalculatorService.Sleep from 127.0.0.1:58196 (request call id 0) took 3001 ms. Trace:
I20260925 15:09:49.049114  8756 rpcz_store.cc:276] 0925 15:09:46.047099 (+     0us) service_pool.cc:170] Inserting onto call queue
0925 15:09:46.047158 (+    59us) service_pool.cc:227] Handling call
0925 15:09:49.048866 (+3001708us) inbound_call.cc:173] Queueing success response
Metrics: {}
[       OK ] Parameters/TestRpc.TestCallLongerThanKeepalive/SSL_TCP (3053 ms)
[ RUN      ] Parameters/TestRpc.TestRpcSidecar/SSL_TCP
I20260925 15:09:49.076582  8777 acceptor_pool.cc:254] collecting diagnostics on the listening RPC socket 0.0.0.0:45347 every 8 connection(s)
I20260925 15:09:49.076742  8778 acceptor_pool.cc:254] collecting diagnostics on the listening RPC socket 0.0.0.0:45347 every 8 connection(s)
[       OK ] Parameters/TestRpc.TestRpcSidecar/SSL_TCP (128 ms)
[ RUN      ] Parameters/TestRpc.TestRpcSidecarLimits/SSL_TCP
I20260925 15:09:51.189375  8802 acceptor_pool.cc:254] collecting diagnostics on the listening RPC socket 0.0.0.0:45305 every 8 connection(s)
I20260925 15:09:51.189724  8803 acceptor_pool.cc:254] collecting diagnostics on the listening RPC socket 0.0.0.0:45305 every 8 connection(s)
W20260925 15:09:51.206028  8560 serialization.cc:72] Serialized kudu.rpc_test.PushStringsRequestPB (2147483654 bytes) is larger than the maximum configured RPC message size (52428800 bytes). Sending anyway, but peer may reject the data.
W20260925 15:09:51.212340  8800 connection.cc:535] server connection from 127.0.0.1:58448 recv error: Network error: RPC frame had a length of 2147483714, but we only support messages up to 52428800 bytes long.
W20260925 15:09:51.212461  8800 connection.cc:158] shutting down server connection from 127.0.0.1:58448 with pending inbound data: 4/2147483714 bytes received; last active 0 ns ago: status Network error: RPC frame had a length of 2147483714, but we only support messages up to 52428800 bytes long.
W20260925 15:09:51.212978  8815 connection.cc:196] Error closing socket: Network error: TlsSocket::Close: Connection reset by peer
I20260925 15:09:51.234695  8827 acceptor_pool.cc:254] collecting diagnostics on the listening RPC socket 0.0.0.0:36083 every 8 connection(s)
I20260925 15:09:51.234836  8828 acceptor_pool.cc:254] collecting diagnostics on the listening RPC socket 0.0.0.0:36083 every 8 connection(s)
W20260925 15:09:56.247788  8826 connection.cc:577] server connection from 127.0.0.1:37612: received bad data: 'Corruption: Invalid packet: message had a length of 2147483710, but we only support messages up to 2147483647 bytes
'
[       OK ] Parameters/TestRpc.TestRpcSidecarLimits/SSL_TCP (7535 ms)
[ RUN      ] Parameters/TestRpc.TestCallTimeoutDoesntAffectNegotiation/SSL_TCP
I20260925 15:09:56.741353  8852 acceptor_pool.cc:254] collecting diagnostics on the listening RPC socket 0.0.0.0:44379 every 8 connection(s)
I20260925 15:09:56.741617  8853 acceptor_pool.cc:254] collecting diagnostics on the listening RPC socket 0.0.0.0:44379 every 8 connection(s)
W20260925 15:09:56.752038  8848 negotiation.cc:266] Injecting 500ms delay in negotiation
I20260925 15:09:56.802476  8560 rpc-test-base.h:595] status: Timed out: connection negotiation to 0.0.0.0:44379 for RPC Sleep timed out after 0.050s (ON_OUTBOUND_QUEUE), seconds elapsed: 0.0511565
[       OK ] Parameters/TestRpc.TestCallTimeoutDoesntAffectNegotiation/SSL_TCP (542 ms)
[ RUN      ] Parameters/TestRpc.TestRpcHandlerLatencyMetric/SSL_TCP
I20260925 15:09:57.272111  8877 acceptor_pool.cc:254] collecting diagnostics on the listening RPC socket 0.0.0.0:38505 every 8 connection(s)
I20260925 15:09:57.272341  8878 acceptor_pool.cc:254] collecting diagnostics on the listening RPC socket 0.0.0.0:38505 every 8 connection(s)
I20260925 15:09:57.311283  8560 rpc-test.cc:1236] Sleep() min lat: 20723
I20260925 15:09:57.311380  8560 rpc-test.cc:1237] Sleep() mean lat: 20723
I20260925 15:09:57.311461  8560 rpc-test.cc:1238] Sleep() max lat: 20723
I20260925 15:09:57.311542  8560 rpc-test.cc:1239] Sleep() #calls: 1
[       OK ] Parameters/TestRpc.TestRpcHandlerLatencyMetric/SSL_TCP (54 ms)
[ RUN      ] Parameters/TestRpc.TimedOutOnResponseMetricServiceQueue/SSL_TCP
I20260925 15:09:57.352470  8903 acceptor_pool.cc:254] collecting diagnostics on the listening RPC socket 0.0.0.0:36839 every 8 connection(s)
I20260925 15:09:57.352690  8904 acceptor_pool.cc:254] collecting diagnostics on the listening RPC socket 0.0.0.0:36839 every 8 connection(s)
W20260925 15:09:57.408816  8905 rpcz_store.cc:267] Call kudu.rpc_test.CalculatorService.Sleep from 127.0.0.1:58484 (request call id 2) took 20 ms (client timeout 20 ms). Trace:
W20260925 15:09:57.409008  8905 rpcz_store.cc:269] 0925 15:09:57.388336 (+     0us) service_pool.cc:170] Inserting onto call queue
0925 15:09:57.408664 (+ 20328us) service_pool.cc:214] Skipping call since client already timed out
0925 15:09:57.408759 (+    95us) inbound_call.cc:173] Queueing failure response
Metrics: {}
[       OK ] Parameters/TestRpc.TimedOutOnResponseMetricServiceQueue/SSL_TCP (96 ms)
[ RUN      ] Parameters/TestRpc.RpcPendingConnectionsMetric/SSL_TCP
I20260925 15:09:57.417956  8926 acceptor_pool.cc:254] collecting diagnostics on the listening RPC socket 0.0.0.0:40815 every 8 connection(s)
I20260925 15:09:57.418177  8927 acceptor_pool.cc:254] collecting diagnostics on the listening RPC socket 0.0.0.0:40815 every 8 connection(s)
W20260925 15:09:57.420109  8922 negotiation.cc:337] Failed RPC negotiation. Trace:
0925 15:09:57.419467 (+     0us) reactor.cc:625] Submitting negotiation task for server connection from 127.0.0.1:45894 (local address 127.0.0.1:40815)
0925 15:09:57.419650 (+   183us) server_negotiation.cc:206] Beginning negotiation
0925 15:09:57.419654 (+     4us) server_negotiation.cc:399] Waiting for connection header
0925 15:09:57.419787 (+   133us) negotiation.cc:327] Negotiation complete: Network error: Server connection negotiation failed: server connection from 127.0.0.1:45894: BlockingRecv error: recv got EOF from 127.0.0.1:45894 (error 108)
Metrics: {"server-negotiator.queue_time_us":67}
[       OK ] Parameters/TestRpc.RpcPendingConnectionsMetric/SSL_TCP (19 ms)
[ RUN      ] Parameters/TestRpc.TestRpcContextClientDeadline/SSL_TCP
I20260925 15:09:57.444840  8942 acceptor_pool.cc:254] collecting diagnostics on the listening RPC socket 0.0.0.0:43725 every 8 connection(s)
I20260925 15:09:57.445076  8943 acceptor_pool.cc:254] collecting diagnostics on the listening RPC socket 0.0.0.0:43725 every 8 connection(s)
[       OK ] Parameters/TestRpc.TestRpcContextClientDeadline/SSL_TCP (53 ms)
[ RUN      ] Parameters/TestRpc.TestApplicationFeatureFlagUnsupportedServer/SSL_TCP
I20260925 15:09:57.499193  8967 acceptor_pool.cc:254] collecting diagnostics on the listening RPC socket 0.0.0.0:43197 every 8 connection(s)
I20260925 15:09:57.499428  8968 acceptor_pool.cc:254] collecting diagnostics on the listening RPC socket 0.0.0.0:43197 every 8 connection(s)
[       OK ] Parameters/TestRpc.TestApplicationFeatureFlagUnsupportedServer/SSL_TCP (36 ms)
[ RUN      ] Parameters/TestRpc.TestCancellationAsync/SSL_TCP
I20260925 15:09:57.542796  8992 acceptor_pool.cc:254] collecting diagnostics on the listening RPC socket 0.0.0.0:39837 every 8 connection(s)
I20260925 15:09:57.543035  8993 acceptor_pool.cc:254] collecting diagnostics on the listening RPC socket 0.0.0.0:39837 every 8 connection(s)
I20260925 15:09:57.543949  8560 rpc-test.cc:1716] Connecting to 0.0.0.0:39837
I20260925 15:09:57.555972  8560 test_util.cc:268] Using random seed: 470152938
I20260925 15:09:57.588351  8996 rpc-test-base.h:240] got call: sleep_micros: 500 pattern: 4294967295 num_repetitions: 2097152 sidecar_idx: 0
I20260925 15:09:57.608035  8995 rpc-test-base.h:240] got call: sleep_micros: 500 pattern: 4294967295 num_repetitions: 2097152 sidecar_idx: 0
I20260925 15:09:57.632905  8994 rpc-test-base.h:240] got call: sleep_micros: 500 pattern: 4294967295 num_repetitions: 2097152 sidecar_idx: 0
I20260925 15:09:57.667467  8996 rpc-test-base.h:240] got call: sleep_micros: 500 pattern: 4294967295 num_repetitions: 2097152 sidecar_idx: 0
I20260925 15:09:57.692080  8995 rpc-test-base.h:240] got call: sleep_micros: 500 pattern: 4294967295 num_repetitions: 2097152 sidecar_idx: 0
I20260925 15:09:57.717042  8994 rpc-test-base.h:240] got call: sleep_micros: 500 pattern: 4294967295 num_repetitions: 2097152 sidecar_idx: 0
W20260925 15:09:57.764559  8989 connection.cc:196] Error closing socket: Network error: TlsSocket::Close: Broken pipe
W20260925 15:09:57.770857  8989 connection.cc:441] server connection from 127.0.0.1:48808 torn down before Call kudu.rpc.GenericCalculatorService.SleepWithSidecar from 127.0.0.1:48808 (request call id 8) could send its response
[       OK ] Parameters/TestRpc.TestCancellationAsync/SSL_TCP (250 ms)
[ RUN      ] Parameters/TestRpc.TestPerformanceBySocketType/SSL_TCP
I20260925 15:09:57.791450  9017 acceptor_pool.cc:254] collecting diagnostics on the listening RPC socket 0.0.0.0:40235 every 8 connection(s)
I20260925 15:09:57.791707  9018 acceptor_pool.cc:254] collecting diagnostics on the listening RPC socket 0.0.0.0:40235 every 8 connection(s)
I20260925 15:09:57.792613  8560 rpc-test.cc:1846] Connecting to 0.0.0.0:40235
I20260925 15:10:00.734272  8560 rpc-test.cc:1859] Sending 1024MB via ssl-enabled tcp socket: real 2.932s	user 2.649s	sys 2.219s
I20260925 15:10:03.659934  8560 rpc-test.cc:1859] Sending 1024MB via ssl-enabled tcp socket: real 2.926s	user 2.791s	sys 2.075s
I20260925 15:10:06.575443  8560 rpc-test.cc:1859] Sending 1024MB via ssl-enabled tcp socket: real 2.915s	user 2.621s	sys 2.233s
I20260925 15:10:09.568941  8560 rpc-test.cc:1859] Sending 1024MB via ssl-enabled tcp socket: real 2.993s	user 2.720s	sys 2.245s
I20260925 15:10:12.506982  8560 rpc-test.cc:1859] Sending 1024MB via ssl-enabled tcp socket: real 2.938s	user 2.742s	sys 2.152s
[       OK ] Parameters/TestRpc.TestPerformanceBySocketType/SSL_TCP (14739 ms)
[----------] 20 tests from Parameters/TestRpc (47465 ms total)

[----------] 1 test from Parameters/TestRpcSocketTxRxQueue
[ RUN      ] Parameters/TestRpcSocketTxRxQueue.OverCapacity/0
W20260925 15:10:12.810325  9034 negotiation.cc:337] Failed RPC negotiation. Trace:
0925 15:10:12.518242 (+     0us) reactor.cc:625] Submitting negotiation task for client connection to 0.0.0.0:39347 (local address 127.0.0.1:40914)
0925 15:10:12.518467 (+   225us) negotiation.cc:107] Waiting for socket to connect
0925 15:10:12.518498 (+    31us) client_negotiation.cc:174] Beginning negotiation
0925 15:10:12.518646 (+   148us) client_negotiation.cc:252] Sending NEGOTIATE NegotiatePB request
0925 15:10:12.809953 (+291307us) negotiation.cc:327] Negotiation complete: Network error: Client connection negotiation failed: client connection to 0.0.0.0:39347: BlockingRecv error: recv error from unknown peer: Transport endpoint is not connected (error 107)
Metrics: {"client-negotiator.queue_time_us":82}
W20260925 15:10:12.810403  9052 negotiation.cc:337] Failed RPC negotiation. Trace:
0925 15:10:12.523679 (+     0us) reactor.cc:625] Submitting negotiation task for client connection to 0.0.0.0:39347 (local address 127.0.0.1:40932)
0925 15:10:12.523839 (+   160us) negotiation.cc:107] Waiting for socket to connect
0925 15:10:12.523855 (+    16us) client_negotiation.cc:174] Beginning negotiation
0925 15:10:12.523973 (+   118us) client_negotiation.cc:252] Sending NEGOTIATE NegotiatePB request
0925 15:10:12.810157 (+286184us) negotiation.cc:327] Negotiation complete: Network error: Client connection negotiation failed: client connection to 0.0.0.0:39347: BlockingRecv error: recv error from unknown peer: Transport endpoint is not connected (error 107)
Metrics: {"client-negotiator.queue_time_us":33}
W20260925 15:10:12.810361  9043 negotiation.cc:337] Failed RPC negotiation. Trace:
0925 15:10:12.521338 (+     0us) reactor.cc:625] Submitting negotiation task for client connection to 0.0.0.0:39347 (local address 127.0.0.1:40924)
0925 15:10:12.521519 (+   181us) negotiation.cc:107] Waiting for socket to connect
0925 15:10:12.521536 (+    17us) client_negotiation.cc:174] Beginning negotiation
0925 15:10:12.521635 (+    99us) client_negotiation.cc:252] Sending NEGOTIATE NegotiatePB request
0925 15:10:12.810079 (+288444us) negotiation.cc:327] Negotiation complete: Network error: Client connection negotiation failed: client connection to 0.0.0.0:39347: BlockingRecv error: recv error from unknown peer: Transport endpoint is not connected (error 107)
Metrics: {"client-negotiator.queue_time_us":60}
W20260925 15:10:12.811277  9079 negotiation.cc:337] Failed RPC negotiation. Trace:
0925 15:10:12.531956 (+     0us) reactor.cc:625] Submitting negotiation task for client connection to 0.0.0.0:39347 (local address 127.0.0.1:40950)
0925 15:10:12.532184 (+   228us) negotiation.cc:107] Waiting for socket to connect
0925 15:10:12.532200 (+    16us) client_negotiation.cc:174] Beginning negotiation
0925 15:10:12.532298 (+    98us) client_negotiation.cc:252] Sending NEGOTIATE NegotiatePB request
0925 15:10:12.810904 (+278606us) negotiation.cc:327] Negotiation complete: Network error: Client connection negotiation failed: client connection to 0.0.0.0:39347: BlockingRecv error: recv error from unknown peer: Transport endpoint is not connected (error 107)
Metrics: {"client-negotiator.queue_time_us":75}
W20260925 15:10:12.812523  9061 negotiation.cc:337] Failed RPC negotiation. Trace:
0925 15:10:12.526281 (+     0us) reactor.cc:625] Submitting negotiation task for client connection to 0.0.0.0:39347 (local address 127.0.0.1:40934)
0925 15:10:12.526420 (+   139us) negotiation.cc:107] Waiting for socket to connect
0925 15:10:12.526432 (+    12us) client_negotiation.cc:174] Beginning negotiation
0925 15:10:12.526507 (+    75us) client_negotiation.cc:252] Sending NEGOTIATE NegotiatePB request
0925 15:10:12.809953 (+283446us) negotiation.cc:327] Negotiation complete: Network error: Client connection negotiation failed: client connection to 0.0.0.0:39347: BlockingRecv error: recv error from unknown peer: Transport endpoint is not connected (error 107)
Metrics: {"client-negotiator.queue_time_us":47}
W20260925 15:10:12.815557  9070 negotiation.cc:337] Failed RPC negotiation. Trace:
0925 15:10:12.528822 (+     0us) reactor.cc:625] Submitting negotiation task for client connection to 0.0.0.0:39347 (local address 127.0.0.1:40936)
0925 15:10:12.529002 (+   180us) negotiation.cc:107] Waiting for socket to connect
0925 15:10:12.529018 (+    16us) client_negotiation.cc:174] Beginning negotiation
0925 15:10:12.529112 (+    94us) client_negotiation.cc:252] Sending NEGOTIATE NegotiatePB request
0925 15:10:12.812561 (+283449us) negotiation.cc:327] Negotiation complete: Network error: Client connection negotiation failed: client connection to 0.0.0.0:39347: BlockingRecv error: recv error from unknown peer: Transport endpoint is not connected (error 107)
Metrics: {"client-negotiator.queue_time_us":59}
[       OK ] Parameters/TestRpcSocketTxRxQueue.OverCapacity/0 (1069 ms)
[----------] 1 test from Parameters/TestRpcSocketTxRxQueue (1070 ms total)

[----------] Global test environment tear-down
[==========] 21 tests from 2 test suites ran. (48535 ms total)
[  PASSED  ] 20 tests.
[  FAILED  ] 1 test, listed below:
[  FAILED  ] Parameters/TestRpc.TestCallWithChainCertAndChainCA/SSL_TCP, where GetParam() = (true, false)

 1 FAILED TEST