Diagnosed failure

Parameters/TestRpc.TestCallWithChainCertAndChainCA/SSL_TCP: /data0/somelongdirectorytoavoidrpathissues/src/kudu/src/kudu/rpc/rpc-test.cc:270: Failure
Failed
Bad status: Runtime error: could not verify certificate chain (error with cert: subject=CN = localhost, ST = sadfjas, C = AS, emailAddress = sdflkdsajf, O = lskdfjlsad, OU = sldfkja, issuer=C = AS, ST = ASDfkjdhf, L = lskdjf, O = saldfja, OU = skdjf, CN = localhost, emailAddress = sadjflkadsj): : certificate has expired
Google Test trace:
/data0/somelongdirectorytoavoidrpathissues/src/kudu/src/kudu/rpc/rpc-test.cc:267: Connecting to 0.0.0.0:34049
I20260927 07:00:32.305665   781 test_util.cc:175] -----------------------------------------------
I20260927 07:00:32.305727   781 test_util.cc:176] Had fatal failures, leaving test files at /tmp/dist-test-taskquo3YW/test-tmp/rpc-test.5.Parameters_TestRpc.TestCallWithChainCertAndChainCA_SSL_TCP.1790492432245172-781-0

Full log

Note: This is test shard 6 of 8.
[==========] Running 21 tests from 2 test suites.
[----------] Global test environment set-up.
[----------] 20 tests from Parameters/TestRpc
[ RUN      ] Parameters/TestRpc.TestMessengerCreateDestroy/SSL_TCP
WARNING: Logging before InitGoogleLogging() is written to STDERR
I20260927 07:00:32.274314   781 rpc-test.cc:169] started messenger TestCreateDestroy
[       OK ] Parameters/TestRpc.TestMessengerCreateDestroy/SSL_TCP (27 ms)
[ RUN      ] Parameters/TestRpc.TestNegotiationDeadlock/SSL_TCP
I20260927 07:00:32.281356   801 acceptor_pool.cc:254] collecting diagnostics on the listening RPC socket 0.0.0.0:39285 every 8 connection(s)
I20260927 07:00:32.281356   802 acceptor_pool.cc:254] collecting diagnostics on the listening RPC socket 0.0.0.0:39285 every 8 connection(s)
[       OK ] Parameters/TestRpc.TestNegotiationDeadlock/SSL_TCP (13 ms)
[ RUN      ] Parameters/TestRpc.TestCallWithChainCertAndChainCA/SSL_TCP
I20260927 07:00:32.301126   818 acceptor_pool.cc:254] collecting diagnostics on the listening RPC socket 0.0.0.0:34049 every 8 connection(s)
I20260927 07:00:32.301096   817 acceptor_pool.cc:254] collecting diagnostics on the listening RPC socket 0.0.0.0:34049 every 8 connection(s)
/data0/somelongdirectorytoavoidrpathissues/src/kudu/src/kudu/rpc/rpc-test.cc:270: Failure
Failed
Bad status: Runtime error: could not verify certificate chain (error with cert: subject=CN = localhost, ST = sadfjas, C = AS, emailAddress = sdflkdsajf, O = lskdfjlsad, OU = sldfkja, issuer=C = AS, ST = ASDfkjdhf, L = lskdjf, O = saldfja, OU = skdjf, CN = localhost, emailAddress = sadjflkadsj): : certificate has expired
Google Test trace:
/data0/somelongdirectorytoavoidrpathissues/src/kudu/src/kudu/rpc/rpc-test.cc:267: Connecting to 0.0.0.0:34049
I20260927 07:00:32.305665   781 test_util.cc:175] -----------------------------------------------
I20260927 07:00:32.305727   781 test_util.cc:176] Had fatal failures, leaving test files at /tmp/dist-test-taskquo3YW/test-tmp/rpc-test.5.Parameters_TestRpc.TestCallWithChainCertAndChainCA_SSL_TCP.1790492432245172-781-0
[  FAILED  ] Parameters/TestRpc.TestCallWithChainCertAndChainCA/SSL_TCP, where GetParam() = (true, false) (16 ms)
[ RUN      ] Parameters/TestRpc.TestCallWithPasswordProtectedKey/SSL_TCP
I20260927 07:00:32.318019   842 acceptor_pool.cc:254] collecting diagnostics on the listening RPC socket 0.0.0.0:42505 every 8 connection(s)
I20260927 07:00:32.318091   843 acceptor_pool.cc:254] collecting diagnostics on the listening RPC socket 0.0.0.0:42505 every 8 connection(s)
[       OK ] Parameters/TestRpc.TestCallWithPasswordProtectedKey/SSL_TCP (26 ms)
[ RUN      ] Parameters/TestRpc.TestCallToBadServer/SSL_TCP
I20260927 07:00:32.345115   781 rpc-test.cc:394] Status: Network error: Client connection negotiation failed: client connection to 0.0.0.0:0: connect: Connection refused (error 111)
I20260927 07:00:32.345432   781 rpc-test.cc:394] Status: Network error: Client connection negotiation failed: client connection to 0.0.0.0:0: connect: Connection refused (error 111)
I20260927 07:00:32.345623   781 rpc-test.cc:394] Status: Network error: Client connection negotiation failed: client connection to 0.0.0.0:0: connect: Connection refused (error 111)
I20260927 07:00:32.345783   781 rpc-test.cc:394] Status: Network error: Client connection negotiation failed: client connection to 0.0.0.0:0: connect: Connection refused (error 111)
I20260927 07:00:32.345938   781 rpc-test.cc:394] Status: Network error: Client connection negotiation failed: client connection to 0.0.0.0:0: connect: Connection refused (error 111)
[       OK ] Parameters/TestRpc.TestCallToBadServer/SSL_TCP (14 ms)
[ RUN      ] Parameters/TestRpc.TestWrongService/SSL_TCP
I20260927 07:00:32.358083   877 acceptor_pool.cc:254] collecting diagnostics on the listening RPC socket 0.0.0.0:33541 every 8 connection(s)
I20260927 07:00:32.358124   878 acceptor_pool.cc:254] collecting diagnostics on the listening RPC socket 0.0.0.0:33541 every 8 connection(s)
I20260927 07:00:32.371085   876 messenger.cc:345] service WrongServiceName not registered on TestServer
[       OK ] Parameters/TestRpc.TestWrongService/SSL_TCP (26 ms)
[ RUN      ] Parameters/TestRpc.TestConnectionKeepalive/SSL_TCP
I20260927 07:00:32.378863   900 acceptor_pool.cc:254] collecting diagnostics on the listening RPC socket 0.0.0.0:44461 every 8 connection(s)
I20260927 07:00:32.378922   901 acceptor_pool.cc:254] collecting diagnostics on the listening RPC socket 0.0.0.0:44461 every 8 connection(s)
I20260927 07:00:32.379096   781 rpc-test.cc:488] Connecting to 0.0.0.0:44461
[       OK ] Parameters/TestRpc.TestConnectionKeepalive/SSL_TCP (1029 ms)
[ RUN      ] Parameters/TestRpc.TestClientConnectionMetrics/SSL_TCP
I20260927 07:00:33.434175   925 acceptor_pool.cc:254] collecting diagnostics on the listening RPC socket 0.0.0.0:40141 every 8 connection(s)
I20260927 07:00:33.434341   926 acceptor_pool.cc:254] collecting diagnostics on the listening RPC socket 0.0.0.0:40141 every 8 connection(s)
I20260927 07:00:33.434654   781 rpc-test.cc:569] Connecting to 0.0.0.0:40141
[       OK ] Parameters/TestRpc.TestClientConnectionMetrics/SSL_TCP (11909 ms)
[ RUN      ] Parameters/TestRpc.TestCredentialsPolicy/SSL_TCP
I20260927 07:00:45.350122   948 acceptor_pool.cc:254] collecting diagnostics on the listening RPC socket 0.0.0.0:40579 every 8 connection(s)
I20260927 07:00:45.350147   949 acceptor_pool.cc:254] collecting diagnostics on the listening RPC socket 0.0.0.0:40579 every 8 connection(s)
I20260927 07:00:45.350337   781 rpc-test.cc:700] Connecting to 0.0.0.0:40579
[       OK ] Parameters/TestRpc.TestCredentialsPolicy/SSL_TCP (62 ms)
[ RUN      ] Parameters/TestRpc.TestCallLongerThanKeepalive/SSL_TCP
I20260927 07:00:45.384804   973 acceptor_pool.cc:254] collecting diagnostics on the listening RPC socket 0.0.0.0:34265 every 8 connection(s)
I20260927 07:00:45.384840   974 acceptor_pool.cc:254] collecting diagnostics on the listening RPC socket 0.0.0.0:34265 every 8 connection(s)
I20260927 07:00:45.412072   977 rpc-test-base.h:222] got call: sleep_micros: 3000000 deferred: true
I20260927 07:00:48.412791   977 rpcz_store.cc:275] Call kudu.rpc.GenericCalculatorService.Sleep from 127.0.0.1:49650 (request call id 0) took 3000 ms. Trace:
I20260927 07:00:48.412961   977 rpcz_store.cc:276] 0927 07:00:45.412008 (+     0us) service_pool.cc:170] Inserting onto call queue
0927 07:00:45.412051 (+    43us) service_pool.cc:227] Handling call
0927 07:00:48.412766 (+3000715us) inbound_call.cc:173] Queueing success response
Metrics: {}
[       OK ] Parameters/TestRpc.TestCallLongerThanKeepalive/SSL_TCP (3040 ms)
[ RUN      ] Parameters/TestRpc.TestRpcSidecar/SSL_TCP
I20260927 07:00:48.438632   998 acceptor_pool.cc:254] collecting diagnostics on the listening RPC socket 0.0.0.0:39703 every 8 connection(s)
I20260927 07:00:48.438673   999 acceptor_pool.cc:254] collecting diagnostics on the listening RPC socket 0.0.0.0:39703 every 8 connection(s)
[       OK ] Parameters/TestRpc.TestRpcSidecar/SSL_TCP (68 ms)
[ RUN      ] Parameters/TestRpc.TestRpcSidecarLimits/SSL_TCP
I20260927 07:00:50.339599  1024 acceptor_pool.cc:254] collecting diagnostics on the listening RPC socket 0.0.0.0:38855 every 8 connection(s)
I20260927 07:00:50.339610  1023 acceptor_pool.cc:254] collecting diagnostics on the listening RPC socket 0.0.0.0:38855 every 8 connection(s)
W20260927 07:00:50.370847   781 serialization.cc:72] Serialized kudu.rpc_test.PushStringsRequestPB (2147483654 bytes) is larger than the maximum configured RPC message size (52428800 bytes). Sending anyway, but peer may reject the data.
W20260927 07:00:50.374843  1021 connection.cc:535] server connection from 127.0.0.1:46908 recv error: Network error: RPC frame had a length of 2147483714, but we only support messages up to 52428800 bytes long.
W20260927 07:00:50.374927  1021 connection.cc:158] shutting down server connection from 127.0.0.1:46908 with pending inbound data: 4/2147483714 bytes received; last active 0 ns ago: status Network error: RPC frame had a length of 2147483714, but we only support messages up to 52428800 bytes long.
W20260927 07:00:50.375147  1036 connection.cc:196] Error closing socket: Network error: TlsSocket::Close: Connection reset by peer
I20260927 07:00:50.386300  1049 acceptor_pool.cc:254] collecting diagnostics on the listening RPC socket 0.0.0.0:40021 every 8 connection(s)
I20260927 07:00:50.386416  1048 acceptor_pool.cc:254] collecting diagnostics on the listening RPC socket 0.0.0.0:40021 every 8 connection(s)
W20260927 07:00:54.316893  1046 connection.cc:577] server connection from 127.0.0.1:36984: received bad data: 'Corruption: Invalid packet: message had a length of 2147483710, but we only support messages up to 2147483647 bytes
'
[       OK ] Parameters/TestRpc.TestRpcSidecarLimits/SSL_TCP (5836 ms)
[ RUN      ] Parameters/TestRpc.TestCallTimeoutDoesntAffectNegotiation/SSL_TCP
I20260927 07:00:54.329735  1074 acceptor_pool.cc:254] collecting diagnostics on the listening RPC socket 0.0.0.0:44779 every 8 connection(s)
I20260927 07:00:54.329756  1073 acceptor_pool.cc:254] collecting diagnostics on the listening RPC socket 0.0.0.0:44779 every 8 connection(s)
W20260927 07:00:54.341439  1069 negotiation.cc:266] Injecting 500ms delay in negotiation
I20260927 07:00:54.391711   781 rpc-test-base.h:595] status: Timed out: connection negotiation to 0.0.0.0:44779 for RPC Sleep timed out after 0.050s (ON_OUTBOUND_QUEUE), seconds elapsed: 0.0507119
[       OK ] Parameters/TestRpc.TestCallTimeoutDoesntAffectNegotiation/SSL_TCP (526 ms)
[ RUN      ] Parameters/TestRpc.TestRpcHandlerLatencyMetric/SSL_TCP
I20260927 07:00:54.857335  1098 acceptor_pool.cc:254] collecting diagnostics on the listening RPC socket 0.0.0.0:33507 every 8 connection(s)
I20260927 07:00:54.857473  1099 acceptor_pool.cc:254] collecting diagnostics on the listening RPC socket 0.0.0.0:33507 every 8 connection(s)
I20260927 07:00:54.890380   781 rpc-test.cc:1236] Sleep() min lat: 20312
I20260927 07:00:54.890458   781 rpc-test.cc:1237] Sleep() mean lat: 20312
I20260927 07:00:54.890484   781 rpc-test.cc:1238] Sleep() max lat: 20312
I20260927 07:00:54.890498   781 rpc-test.cc:1239] Sleep() #calls: 1
[       OK ] Parameters/TestRpc.TestRpcHandlerLatencyMetric/SSL_TCP (45 ms)
[ RUN      ] Parameters/TestRpc.TimedOutOnResponseMetricServiceQueue/SSL_TCP
I20260927 07:00:54.906222  1124 acceptor_pool.cc:254] collecting diagnostics on the listening RPC socket 0.0.0.0:46681 every 8 connection(s)
I20260927 07:00:54.906250  1125 acceptor_pool.cc:254] collecting diagnostics on the listening RPC socket 0.0.0.0:46681 every 8 connection(s)
W20260927 07:00:54.964062  1126 rpcz_store.cc:267] Call kudu.rpc_test.CalculatorService.Sleep from 127.0.0.1:46584 (request call id 2) took 20 ms (client timeout 20 ms). Trace:
W20260927 07:00:54.964188  1126 rpcz_store.cc:269] 0927 07:00:54.943745 (+     0us) service_pool.cc:170] Inserting onto call queue
0927 07:00:54.964036 (+ 20291us) service_pool.cc:214] Skipping call since client already timed out
0927 07:00:54.964047 (+    11us) inbound_call.cc:173] Queueing failure response
Metrics: {}
[       OK ] Parameters/TestRpc.TimedOutOnResponseMetricServiceQueue/SSL_TCP (73 ms)
[ RUN      ] Parameters/TestRpc.RpcPendingConnectionsMetric/SSL_TCP
I20260927 07:00:54.967517  1147 acceptor_pool.cc:254] collecting diagnostics on the listening RPC socket 0.0.0.0:37215 every 8 connection(s)
I20260927 07:00:54.967638  1148 acceptor_pool.cc:254] collecting diagnostics on the listening RPC socket 0.0.0.0:37215 every 8 connection(s)
W20260927 07:00:54.979030  1143 negotiation.cc:337] Failed RPC negotiation. Trace:
0927 07:00:54.977600 (+     0us) reactor.cc:625] Submitting negotiation task for server connection from 127.0.0.1:56354 (local address 127.0.0.1:37215)
0927 07:00:54.978845 (+  1245us) server_negotiation.cc:206] Beginning negotiation
0927 07:00:54.978847 (+     2us) server_negotiation.cc:399] Waiting for connection header
0927 07:00:54.978950 (+   103us) negotiation.cc:327] Negotiation complete: Network error: Server connection negotiation failed: server connection from 127.0.0.1:56354: BlockingRecv error: recv got EOF from 127.0.0.1:56354 (error 108)
Metrics: {"server-negotiator.queue_time_us":1189}
[       OK ] Parameters/TestRpc.RpcPendingConnectionsMetric/SSL_TCP (23 ms)
[ RUN      ] Parameters/TestRpc.TestRpcContextClientDeadline/SSL_TCP
I20260927 07:00:55.020067  1163 acceptor_pool.cc:254] collecting diagnostics on the listening RPC socket 0.0.0.0:43237 every 8 connection(s)
I20260927 07:00:55.020095  1164 acceptor_pool.cc:254] collecting diagnostics on the listening RPC socket 0.0.0.0:43237 every 8 connection(s)
[       OK ] Parameters/TestRpc.TestRpcContextClientDeadline/SSL_TCP (61 ms)
[ RUN      ] Parameters/TestRpc.TestApplicationFeatureFlagUnsupportedServer/SSL_TCP
I20260927 07:00:55.056325  1188 acceptor_pool.cc:254] collecting diagnostics on the listening RPC socket 0.0.0.0:43395 every 8 connection(s)
I20260927 07:00:55.056336  1189 acceptor_pool.cc:254] collecting diagnostics on the listening RPC socket 0.0.0.0:43395 every 8 connection(s)
[       OK ] Parameters/TestRpc.TestApplicationFeatureFlagUnsupportedServer/SSL_TCP (21 ms)
[ RUN      ] Parameters/TestRpc.TestCancellationAsync/SSL_TCP
I20260927 07:00:55.104491  1213 acceptor_pool.cc:254] collecting diagnostics on the listening RPC socket 0.0.0.0:40609 every 8 connection(s)
I20260927 07:00:55.104523  1214 acceptor_pool.cc:254] collecting diagnostics on the listening RPC socket 0.0.0.0:40609 every 8 connection(s)
I20260927 07:00:55.104686   781 rpc-test.cc:1716] Connecting to 0.0.0.0:40609
I20260927 07:00:55.117340   781 test_util.cc:268] Using random seed: -2101173735
I20260927 07:00:55.134057  1217 rpc-test-base.h:240] got call: sleep_micros: 500 pattern: 4294967295 num_repetitions: 2097152 sidecar_idx: 0
I20260927 07:00:55.146134  1217 rpc-test-base.h:240] got call: sleep_micros: 500 pattern: 4294967295 num_repetitions: 2097152 sidecar_idx: 0
I20260927 07:00:55.158149  1217 rpc-test-base.h:240] got call: sleep_micros: 500 pattern: 4294967295 num_repetitions: 2097152 sidecar_idx: 0
I20260927 07:00:55.171154  1217 rpc-test-base.h:240] got call: sleep_micros: 500 pattern: 4294967295 num_repetitions: 2097152 sidecar_idx: 0
I20260927 07:00:55.183596  1217 rpc-test-base.h:240] got call: sleep_micros: 500 pattern: 4294967295 num_repetitions: 2097152 sidecar_idx: 0
I20260927 07:00:55.196929  1217 rpc-test-base.h:240] got call: sleep_micros: 500 pattern: 4294967295 num_repetitions: 2097152 sidecar_idx: 0
I20260927 07:00:55.209612  1217 rpc-test-base.h:240] got call: sleep_micros: 500 pattern: 4294967295 num_repetitions: 2097152 sidecar_idx: 0
I20260927 07:00:55.224689  1217 rpc-test-base.h:240] got call: sleep_micros: 500 pattern: 4294967295 num_repetitions: 2097152 sidecar_idx: 0
W20260927 07:00:55.227698  1210 connection.cc:441] server connection from 127.0.0.1:39654 torn down before Call kudu.rpc.GenericCalculatorService.SleepWithSidecar from 127.0.0.1:39654 (request call id 9) could send its response
[       OK ] Parameters/TestRpc.TestCancellationAsync/SSL_TCP (156 ms)
[ RUN      ] Parameters/TestRpc.TestPerformanceBySocketType/SSL_TCP
I20260927 07:00:55.241973  1238 acceptor_pool.cc:254] collecting diagnostics on the listening RPC socket 0.0.0.0:40117 every 8 connection(s)
I20260927 07:00:55.242004  1239 acceptor_pool.cc:254] collecting diagnostics on the listening RPC socket 0.0.0.0:40117 every 8 connection(s)
I20260927 07:00:55.242172   781 rpc-test.cc:1846] Connecting to 0.0.0.0:40117
I20260927 07:00:57.014540   781 rpc-test.cc:1859] Sending 1024MB via ssl-enabled tcp socket: real 1.765s	user 1.586s	sys 1.525s
I20260927 07:00:58.844421   781 rpc-test.cc:1859] Sending 1024MB via ssl-enabled tcp socket: real 1.830s	user 1.767s	sys 1.442s
I20260927 07:01:00.579098   781 rpc-test.cc:1859] Sending 1024MB via ssl-enabled tcp socket: real 1.735s	user 1.599s	sys 1.456s
I20260927 07:01:02.336699   781 rpc-test.cc:1859] Sending 1024MB via ssl-enabled tcp socket: real 1.757s	user 1.564s	sys 1.537s
I20260927 07:01:04.153281   781 rpc-test.cc:1859] Sending 1024MB via ssl-enabled tcp socket: real 1.816s	user 1.629s	sys 1.548s
[       OK ] Parameters/TestRpc.TestPerformanceBySocketType/SSL_TCP (8926 ms)
[----------] 20 tests from Parameters/TestRpc (31907 ms total)

[----------] 1 test from Parameters/TestRpcSocketTxRxQueue
[ RUN      ] Parameters/TestRpcSocketTxRxQueue.OverCapacity/0
W20260927 07:01:04.421586  1291 negotiation.cc:337] Failed RPC negotiation. Trace:
0927 07:01:04.160389 (+     0us) reactor.cc:625] Submitting negotiation task for client connection to 0.0.0.0:35921 (local address 127.0.0.1:43838)
0927 07:01:04.160423 (+    34us) negotiation.cc:107] Waiting for socket to connect
0927 07:01:04.160430 (+     7us) client_negotiation.cc:174] Beginning negotiation
0927 07:01:04.160465 (+    35us) client_negotiation.cc:252] Sending NEGOTIATE NegotiatePB request
0927 07:01:04.421430 (+260965us) negotiation.cc:327] Negotiation complete: Network error: Client connection negotiation failed: client connection to 0.0.0.0:35921: BlockingRecv error: recv error from unknown peer: Transport endpoint is not connected (error 107)
Metrics: {"client-negotiator.queue_time_us":18}
W20260927 07:01:04.421686  1255 negotiation.cc:337] Failed RPC negotiation. Trace:
0927 07:01:04.156783 (+     0us) reactor.cc:625] Submitting negotiation task for client connection to 0.0.0.0:35921 (local address 127.0.0.1:43796)
0927 07:01:04.156851 (+    68us) negotiation.cc:107] Waiting for socket to connect
0927 07:01:04.156861 (+    10us) client_negotiation.cc:174] Beginning negotiation
0927 07:01:04.156936 (+    75us) client_negotiation.cc:252] Sending NEGOTIATE NegotiatePB request
0927 07:01:04.421391 (+264455us) negotiation.cc:327] Negotiation complete: Network error: Client connection negotiation failed: client connection to 0.0.0.0:35921: BlockingRecv error: recv error from unknown peer: Transport endpoint is not connected (error 107)
Metrics: {"client-negotiator.queue_time_us":41}
W20260927 07:01:04.421898  1300 negotiation.cc:337] Failed RPC negotiation. Trace:
0927 07:01:04.161319 (+     0us) reactor.cc:625] Submitting negotiation task for client connection to 0.0.0.0:35921 (local address 127.0.0.1:43842)
0927 07:01:04.161398 (+    79us) negotiation.cc:107] Waiting for socket to connect
0927 07:01:04.161409 (+    11us) client_negotiation.cc:174] Beginning negotiation
0927 07:01:04.161475 (+    66us) client_negotiation.cc:252] Sending NEGOTIATE NegotiatePB request
0927 07:01:04.421849 (+260374us) negotiation.cc:327] Negotiation complete: Network error: Client connection negotiation failed: client connection to 0.0.0.0:35921: BlockingRecv error: recv error from unknown peer: Transport endpoint is not connected (error 107)
Metrics: {"client-negotiator.queue_time_us":38}
W20260927 07:01:04.421686  1264 negotiation.cc:337] Failed RPC negotiation. Trace:
0927 07:01:04.157759 (+     0us) reactor.cc:625] Submitting negotiation task for client connection to 0.0.0.0:35921 (local address 127.0.0.1:43806)
0927 07:01:04.157801 (+    42us) negotiation.cc:107] Waiting for socket to connect
0927 07:01:04.157810 (+     9us) client_negotiation.cc:174] Beginning negotiation
0927 07:01:04.157852 (+    42us) client_negotiation.cc:252] Sending NEGOTIATE NegotiatePB request
0927 07:01:04.421484 (+263632us) negotiation.cc:327] Negotiation complete: Network error: Client connection negotiation failed: client connection to 0.0.0.0:35921: BlockingRecv error: recv error from unknown peer: Transport endpoint is not connected (error 107)
Metrics: {"client-negotiator.queue_time_us":17}
W20260927 07:01:04.421612  1273 negotiation.cc:337] Failed RPC negotiation. Trace:
0927 07:01:04.158610 (+     0us) reactor.cc:625] Submitting negotiation task for client connection to 0.0.0.0:35921 (local address 127.0.0.1:43818)
0927 07:01:04.158645 (+    35us) negotiation.cc:107] Waiting for socket to connect
0927 07:01:04.158653 (+     8us) client_negotiation.cc:174] Beginning negotiation
0927 07:01:04.158688 (+    35us) client_negotiation.cc:252] Sending NEGOTIATE NegotiatePB request
0927 07:01:04.421484 (+262796us) negotiation.cc:327] Negotiation complete: Network error: Client connection negotiation failed: client connection to 0.0.0.0:35921: BlockingRecv error: recv error from unknown peer: Transport endpoint is not connected (error 107)
Metrics: {"client-negotiator.queue_time_us":17}
W20260927 07:01:04.422106  1282 negotiation.cc:337] Failed RPC negotiation. Trace:
0927 07:01:04.159483 (+     0us) reactor.cc:625] Submitting negotiation task for client connection to 0.0.0.0:35921 (local address 127.0.0.1:43822)
0927 07:01:04.159519 (+    36us) negotiation.cc:107] Waiting for socket to connect
0927 07:01:04.159526 (+     7us) client_negotiation.cc:174] Beginning negotiation
0927 07:01:04.159611 (+    85us) client_negotiation.cc:252] Sending NEGOTIATE NegotiatePB request
0927 07:01:04.421543 (+261932us) negotiation.cc:327] Negotiation complete: Network error: Client connection negotiation failed: client connection to 0.0.0.0:35921: BlockingRecv error: recv error from unknown peer: Transport endpoint is not connected (error 107)
Metrics: {"client-negotiator.queue_time_us":18}
[       OK ] Parameters/TestRpcSocketTxRxQueue.OverCapacity/0 (1046 ms)
[----------] 1 test from Parameters/TestRpcSocketTxRxQueue (1046 ms total)

[----------] Global test environment tear-down
[==========] 21 tests from 2 test suites ran. (32953 ms total)
[  PASSED  ] 20 tests.
[  FAILED  ] 1 test, listed below:
[  FAILED  ] Parameters/TestRpc.TestCallWithChainCertAndChainCA/SSL_TCP, where GetParam() = (true, false)

 1 FAILED TEST