Parameters/TestRpc.TestCallWithChainCertAndRootCA/SSL_TCP: /data0/somelongdirectorytoavoidrpathissues/src/kudu/src/kudu/rpc/rpc-test.cc:303: Failure
Failed
Bad status: Runtime error: could not verify certificate chain (error with cert: subject=CN = localhost, ST = sadfjas, C = AS, emailAddress = sdflkdsajf, O = lskdfjlsad, OU = sldfkja, issuer=C = AS, ST = ASDfkjdhf, L = lskdjf, O = saldfja, OU = skdjf, CN = localhost, emailAddress = sadjflkadsj): : certificate has expired
Google Test trace:
/data0/somelongdirectorytoavoidrpathissues/src/kudu/src/kudu/rpc/rpc-test.cc:300: Connecting to 0.0.0.0:42977
I20260926 16:12:50.975088 6142 test_util.cc:175] -----------------------------------------------
I20260926 16:12:50.975262 6142 test_util.cc:176] Had fatal failures, leaving test files at /tmp/dist-test-task7X1U8K/test-tmp/rpc-test.1.Parameters_TestRpc.TestCallWithChainCertAndRootCA_SSL_TCP.1790439169541435-6142-0
Note: This is test shard 2 of 8.
[==========] Running 21 tests from 2 test suites.
[----------] Global test environment set-up.
[----------] 1 test from TestRpc
[ RUN ] TestRpc.TestMethodsByName
[ OK ] TestRpc.TestMethodsByName (6 ms)
[----------] 1 test from TestRpc (6 ms total)
[----------] 20 tests from Parameters/TestRpc
[ RUN ] Parameters/TestRpc.TestAcceptorPoolStartStop/SSL_TCP
WARNING: Logging before InitGoogleLogging() is written to STDERR
I20260926 16:12:49.654582 6157 acceptor_pool.cc:254] collecting diagnostics on the listening RPC socket 0.0.0.0:38771 every 8 connection(s)
I20260926 16:12:49.656052 6158 acceptor_pool.cc:254] collecting diagnostics on the listening RPC socket 0.0.0.0:38771 every 8 connection(s)
W20260926 16:12:50.656646 6142 thread.cc:536] Waited for 1000ms trying to join with acceptor (tid 6158)
I20260926 16:12:50.727056 6169 acceptor_pool.cc:254] collecting diagnostics on the listening RPC socket 0.0.0.0:43719 every 8 connection(s)
I20260926 16:12:50.728390 6170 acceptor_pool.cc:254] collecting diagnostics on the listening RPC socket 0.0.0.0:43719 every 8 connection(s)
I20260926 16:12:50.748587 6180 acceptor_pool.cc:254] collecting diagnostics on the listening RPC socket 0.0.0.0:44867 every 8 connection(s)
I20260926 16:12:50.749833 6181 acceptor_pool.cc:254] collecting diagnostics on the listening RPC socket 0.0.0.0:44867 every 8 connection(s)
I20260926 16:12:50.769322 6191 acceptor_pool.cc:254] collecting diagnostics on the listening RPC socket 0.0.0.0:33293 every 8 connection(s)
I20260926 16:12:50.769989 6192 acceptor_pool.cc:254] collecting diagnostics on the listening RPC socket 0.0.0.0:33293 every 8 connection(s)
I20260926 16:12:50.787715 6202 acceptor_pool.cc:254] collecting diagnostics on the listening RPC socket 0.0.0.0:33687 every 8 connection(s)
I20260926 16:12:50.788383 6203 acceptor_pool.cc:254] collecting diagnostics on the listening RPC socket 0.0.0.0:33687 every 8 connection(s)
[ OK ] Parameters/TestRpc.TestAcceptorPoolStartStop/SSL_TCP (1193 ms)
[ RUN ] Parameters/TestRpc.TestCall/SSL_TCP
I20260926 16:12:50.806373 6215 acceptor_pool.cc:254] collecting diagnostics on the listening RPC socket 0.0.0.0:40419 every 8 connection(s)
I20260926 16:12:50.808274 6216 acceptor_pool.cc:254] collecting diagnostics on the listening RPC socket 0.0.0.0:40419 every 8 connection(s)
I20260926 16:12:50.812964 6142 rpc-test.cc:234] Connecting to 0.0.0.0:40419
[ OK ] Parameters/TestRpc.TestCall/SSL_TCP (146 ms)
[ RUN ] Parameters/TestRpc.TestCallWithChainCertAndRootCA/SSL_TCP
I20260926 16:12:50.955453 6240 acceptor_pool.cc:254] collecting diagnostics on the listening RPC socket 0.0.0.0:42977 every 8 connection(s)
I20260926 16:12:50.956167 6241 acceptor_pool.cc:254] collecting diagnostics on the listening RPC socket 0.0.0.0:42977 every 8 connection(s)
/data0/somelongdirectorytoavoidrpathissues/src/kudu/src/kudu/rpc/rpc-test.cc:303: Failure
Failed
Bad status: Runtime error: could not verify certificate chain (error with cert: subject=CN = localhost, ST = sadfjas, C = AS, emailAddress = sdflkdsajf, O = lskdfjlsad, OU = sldfkja, issuer=C = AS, ST = ASDfkjdhf, L = lskdjf, O = saldfja, OU = skdjf, CN = localhost, emailAddress = sadjflkadsj): : certificate has expired
Google Test trace:
/data0/somelongdirectorytoavoidrpathissues/src/kudu/src/kudu/rpc/rpc-test.cc:300: Connecting to 0.0.0.0:42977
I20260926 16:12:50.975088 6142 test_util.cc:175] -----------------------------------------------
I20260926 16:12:50.975262 6142 test_util.cc:176] Had fatal failures, leaving test files at /tmp/dist-test-task7X1U8K/test-tmp/rpc-test.1.Parameters_TestRpc.TestCallWithChainCertAndRootCA_SSL_TCP.1790439169541435-6142-0
[ FAILED ] Parameters/TestRpc.TestCallWithChainCertAndRootCA/SSL_TCP, where GetParam() = (true, false) (36 ms)
[ RUN ] Parameters/TestRpc.TestCallWithBadPasswordProtectedKey/SSL_TCP
[ OK ] Parameters/TestRpc.TestCallWithBadPasswordProtectedKey/SSL_TCP (28 ms)
[ RUN ] Parameters/TestRpc.TestInvalidMethodCall/SSL_TCP
I20260926 16:12:51.035104 6277 acceptor_pool.cc:254] collecting diagnostics on the listening RPC socket 0.0.0.0:44883 every 8 connection(s)
I20260926 16:12:51.035885 6278 acceptor_pool.cc:254] collecting diagnostics on the listening RPC socket 0.0.0.0:44883 every 8 connection(s)
I20260926 16:12:51.039263 6142 rpc-test.cc:406] Connecting to 0.0.0.0:44883
[ OK ] Parameters/TestRpc.TestInvalidMethodCall/SSL_TCP (68 ms)
[ RUN ] Parameters/TestRpc.TestHighFDs/SSL_TCP
I20260926 16:12:51.297981 6302 acceptor_pool.cc:254] collecting diagnostics on the listening RPC socket 0.0.0.0:37105 every 8 connection(s)
I20260926 16:12:51.298707 6303 acceptor_pool.cc:254] collecting diagnostics on the listening RPC socket 0.0.0.0:37105 every 8 connection(s)
[ OK ] Parameters/TestRpc.TestHighFDs/SSL_TCP (271 ms)
[ RUN ] Parameters/TestRpc.TestConnectionAlwaysKeepalive/SSL_TCP
I20260926 16:12:51.369952 6325 acceptor_pool.cc:254] collecting diagnostics on the listening RPC socket 0.0.0.0:34137 every 8 connection(s)
I20260926 16:12:51.370627 6326 acceptor_pool.cc:254] collecting diagnostics on the listening RPC socket 0.0.0.0:34137 every 8 connection(s)
I20260926 16:12:51.373522 6142 rpc-test.cc:532] Connecting to 0.0.0.0:34137
[ OK ] Parameters/TestRpc.TestConnectionAlwaysKeepalive/SSL_TCP (3063 ms)
[ RUN ] Parameters/TestRpc.TestReopenOutboundConnections/SSL_TCP
I20260926 16:12:54.457436 6348 acceptor_pool.cc:254] collecting diagnostics on the listening RPC socket 0.0.0.0:34467 every 8 connection(s)
I20260926 16:12:54.458195 6349 acceptor_pool.cc:254] collecting diagnostics on the listening RPC socket 0.0.0.0:34467 every 8 connection(s)
I20260926 16:12:54.461279 6142 rpc-test.cc:658] Connecting to 0.0.0.0:34467
[ OK ] Parameters/TestRpc.TestReopenOutboundConnections/SSL_TCP (376 ms)
[ RUN ] Parameters/TestRpc.TestConnectionNetworkPlane/SSL_TCP
I20260926 16:12:54.827688 6371 acceptor_pool.cc:254] collecting diagnostics on the listening RPC socket 0.0.0.0:41041 every 8 connection(s)
I20260926 16:12:54.828282 6372 acceptor_pool.cc:254] collecting diagnostics on the listening RPC socket 0.0.0.0:41041 every 8 connection(s)
I20260926 16:12:54.831213 6142 rpc-test.cc:772] Connecting to 0.0.0.0:41041
[ OK ] Parameters/TestRpc.TestConnectionNetworkPlane/SSL_TCP (92 ms)
[ RUN ] Parameters/TestRpc.TestTCPKeepalive/SSL_TCP
I20260926 16:12:54.892866 6396 acceptor_pool.cc:254] collecting diagnostics on the listening RPC socket 0.0.0.0:34015 every 8 connection(s)
I20260926 16:12:54.893568 6397 acceptor_pool.cc:254] collecting diagnostics on the listening RPC socket 0.0.0.0:34015 every 8 connection(s)
I20260926 16:12:54.935865 6400 rpc-test-base.h:222] got call: sleep_micros: 8000000 deferred: true
I20260926 16:13:02.940146 6400 rpcz_store.cc:275] Call kudu.rpc.GenericCalculatorService.Sleep from 127.0.0.1:41550 (request call id 0) took 8004 ms. Trace:
I20260926 16:13:02.940549 6400 rpcz_store.cc:276] 0926 16:12:54.935624 (+ 0us) service_pool.cc:170] Inserting onto call queue
0926 16:12:54.935721 (+ 97us) service_pool.cc:227] Handling call
0926 16:13:02.939992 (+8004271us) inbound_call.cc:173] Queueing success response
Metrics: {}
[ OK ] Parameters/TestRpc.TestTCPKeepalive/SSL_TCP (8074 ms)
[ RUN ] Parameters/TestRpc.TestMaxSmallSidecars/SSL_TCP
I20260926 16:13:02.979197 6422 acceptor_pool.cc:254] collecting diagnostics on the listening RPC socket 0.0.0.0:42437 every 8 connection(s)
I20260926 16:13:02.979923 6423 acceptor_pool.cc:254] collecting diagnostics on the listening RPC socket 0.0.0.0:42437 every 8 connection(s)
[ OK ] Parameters/TestRpc.TestMaxSmallSidecars/SSL_TCP (198 ms)
[ RUN ] Parameters/TestRpc.TestCallTimeout/SSL_TCP
I20260926 16:13:03.179441 6447 acceptor_pool.cc:254] collecting diagnostics on the listening RPC socket 0.0.0.0:34003 every 8 connection(s)
I20260926 16:13:03.180101 6448 acceptor_pool.cc:254] collecting diagnostics on the listening RPC socket 0.0.0.0:34003 every 8 connection(s)
I20260926 16:13:03.211198 6142 rpc-test-base.h:595] status: Timed out: connection negotiation to 0.0.0.0:34003 for RPC Sleep timed out after 0.000s (ON_OUTBOUND_QUEUE), seconds elapsed: 0.00235497
I20260926 16:13:03.217860 6451 rpc-test-base.h:222] got call: sleep_micros: 700000
I20260926 16:13:03.412298 6142 rpc-test-base.h:595] status: Timed out: Sleep RPC to 0.0.0.0:34003 timed out after 0.200s (SENT), seconds elapsed: 0.200742
I20260926 16:13:03.413674 6450 rpc-test-base.h:222] got call: sleep_micros: 2000000
W20260926 16:13:03.918429 6451 rpcz_store.cc:267] Call kudu.rpc.GenericCalculatorService.Sleep from 127.0.0.1:57810 (request call id 1) took 700 ms (client timeout 200 ms). Trace:
W20260926 16:13:03.918753 6451 rpcz_store.cc:269] 0926 16:13:03.217720 (+ 0us) service_pool.cc:170] Inserting onto call queue
0926 16:13:03.217808 (+ 88us) service_pool.cc:227] Handling call
0926 16:13:03.918370 (+700562us) inbound_call.cc:173] Queueing success response
Metrics: {}
I20260926 16:13:04.914106 6142 rpc-test-base.h:595] status: Timed out: Sleep RPC to 0.0.0.0:34003 timed out after 1.500s (SENT), seconds elapsed: 1.50148
W20260926 16:13:05.414124 6450 rpcz_store.cc:267] Call kudu.rpc.GenericCalculatorService.Sleep from 127.0.0.1:57810 (request call id 2) took 2000 ms (client timeout 1500 ms). Trace:
W20260926 16:13:05.414419 6450 rpcz_store.cc:269] 0926 16:13:03.413385 (+ 0us) service_pool.cc:170] Inserting onto call queue
0926 16:13:03.413521 (+ 136us) service_pool.cc:227] Handling call
0926 16:13:05.414072 (+2000551us) inbound_call.cc:173] Queueing success response
Metrics: {}
W20260926 16:13:05.414934 6445 connection.cc:441] server connection from 127.0.0.1:57810 torn down before Call kudu.rpc.GenericCalculatorService.Sleep from 127.0.0.1:57810 (request call id 2) could send its response
[ OK ] Parameters/TestRpc.TestCallTimeout/SSL_TCP (2268 ms)
[ RUN ] Parameters/TestRpc.TestServerShutsDown/SSL_TCP
I20260926 16:13:05.421341 6142 rpc-test.cc:1125] Connecting to 0.0.0.0:44803
W20260926 16:13:05.430012 6464 negotiation.cc:337] Failed RPC negotiation. Trace:
0926 16:13:05.428537 (+ 0us) reactor.cc:625] Submitting negotiation task for client connection to 0.0.0.0:44803 (local address 127.0.0.1:36042)
0926 16:13:05.428950 (+ 413us) negotiation.cc:107] Waiting for socket to connect
0926 16:13:05.428982 (+ 32us) client_negotiation.cc:174] Beginning negotiation
0926 16:13:05.429198 (+ 216us) client_negotiation.cc:252] Sending NEGOTIATE NegotiatePB request
0926 16:13:05.429403 (+ 205us) negotiation.cc:327] Negotiation complete: Network error: Client connection negotiation failed: client connection to 0.0.0.0:44803: BlockingWrite error: write error: Broken pipe (error 32)
Metrics: {"client-negotiator.queue_time_us":108}
[ OK ] Parameters/TestRpc.TestServerShutsDown/SSL_TCP (12 ms)
[ RUN ] Parameters/TestRpc.TimedOutOnResponseMetric/SSL_TCP
I20260926 16:13:05.466372 6481 acceptor_pool.cc:254] collecting diagnostics on the listening RPC socket 0.0.0.0:45753 every 8 connection(s)
I20260926 16:13:05.466988 6482 acceptor_pool.cc:254] collecting diagnostics on the listening RPC socket 0.0.0.0:45753 every 8 connection(s)
W20260926 16:13:05.710260 6485 rpcz_store.cc:267] Call kudu.rpc_test.CalculatorService.Sleep from 127.0.0.1:45724 (request call id 3) took 50 ms (client timeout 25 ms). Trace:
W20260926 16:13:05.710523 6485 rpcz_store.cc:269] 0926 16:13:05.659696 (+ 0us) service_pool.cc:170] Inserting onto call queue
0926 16:13:05.659805 (+ 109us) service_pool.cc:227] Handling call
0926 16:13:05.710156 (+ 50351us) inbound_call.cc:173] Queueing success response
Related trace 'test_child':
Metrics: {"test_sleep_us":50000,"child_traces":[["test_child",{"related_trace_metric":1}]]}
W20260926 16:13:05.768842 6485 rpcz_store.cc:267] Call kudu.rpc_test.CalculatorService.Sleep from 127.0.0.1:45724 (request call id 4) took 50 ms (client timeout 50 ms). Trace:
W20260926 16:13:05.769104 6485 rpcz_store.cc:269] 0926 16:13:05.718421 (+ 0us) service_pool.cc:170] Inserting onto call queue
0926 16:13:05.718501 (+ 80us) service_pool.cc:227] Handling call
0926 16:13:05.768790 (+ 50289us) inbound_call.cc:173] Queueing success response
Related trace 'test_child':
Metrics: {"test_sleep_us":50000,"child_traces":[["test_child",{"related_trace_metric":1}]]}
[ OK ] Parameters/TestRpc.TimedOutOnResponseMetric/SSL_TCP (344 ms)
[ RUN ] Parameters/TestRpc.AcceptorDispatchingTimesMetric/SSL_TCP
I20260926 16:13:05.787075 6506 acceptor_pool.cc:254] collecting diagnostics on the listening RPC socket 0.0.0.0:41713 every 8 connection(s)
I20260926 16:13:05.787670 6507 acceptor_pool.cc:254] collecting diagnostics on the listening RPC socket 0.0.0.0:41713 every 8 connection(s)
W20260926 16:13:05.792582 6502 negotiation.cc:337] Failed RPC negotiation. Trace:
0926 16:13:05.791020 (+ 0us) reactor.cc:625] Submitting negotiation task for server connection from 127.0.0.1:35182 (local address 127.0.0.1:41713)
0926 16:13:05.791494 (+ 474us) server_negotiation.cc:206] Beginning negotiation
0926 16:13:05.791531 (+ 37us) server_negotiation.cc:399] Waiting for connection header
0926 16:13:05.791842 (+ 311us) negotiation.cc:327] Negotiation complete: Network error: Server connection negotiation failed: server connection from 127.0.0.1:35182: BlockingRecv error: recv got EOF from 127.0.0.1:35182 (error 108)
Metrics: {"server-negotiator.queue_time_us":119}
[ OK ] Parameters/TestRpc.AcceptorDispatchingTimesMetric/SSL_TCP (18 ms)
[ RUN ] Parameters/TestRpc.TestRpcCallbackDestroysMessenger/SSL_TCP
[ OK ] Parameters/TestRpc.TestRpcCallbackDestroysMessenger/SSL_TCP (21 ms)
[ RUN ] Parameters/TestRpc.TestApplicationFeatureFlag/SSL_TCP
I20260926 16:13:05.840094 6531 acceptor_pool.cc:254] collecting diagnostics on the listening RPC socket 0.0.0.0:35847 every 8 connection(s)
I20260926 16:13:05.840768 6532 acceptor_pool.cc:254] collecting diagnostics on the listening RPC socket 0.0.0.0:35847 every 8 connection(s)
W20260926 16:13:05.871411 6530 messenger.cc:357] Unable to handle RPC call: Not implemented: call requires unsupported application feature flags: 99
[ OK ] Parameters/TestRpc.TestApplicationFeatureFlag/SSL_TCP (61 ms)
[ RUN ] Parameters/TestRpc.TestCancellation/SSL_TCP
I20260926 16:13:05.898480 6556 acceptor_pool.cc:254] collecting diagnostics on the listening RPC socket 0.0.0.0:40757 every 8 connection(s)
I20260926 16:13:05.899181 6557 acceptor_pool.cc:254] collecting diagnostics on the listening RPC socket 0.0.0.0:40757 every 8 connection(s)
I20260926 16:13:05.902056 6142 rpc-test.cc:1648] Connecting to 0.0.0.0:40757
I20260926 16:13:06.000978 6142 rpc-test-base.h:595] status: Aborted: Sleep RPC to 0.0.0.0:40757 is cancelled in state READY, seconds elapsed: 0.000309037
I20260926 16:13:06.128996 6142 rpc-test-base.h:595] status: Aborted: Sleep RPC to 0.0.0.0:40757 is cancelled in state SENT, seconds elapsed: 0.000753599
I20260926 16:13:06.180521 6559 rpc-test-base.h:222] got call: sleep_micros: 510000
I20260926 16:13:06.301914 6142 rpc-test-base.h:595] status: Aborted: Sleep RPC to 0.0.0.0:40757 is cancelled in state SENT, seconds elapsed: 0.000786763
I20260926 16:13:06.337646 6558 rpc-test-base.h:222] got call: sleep_micros: 510000
I20260926 16:13:06.458271 6142 rpc-test-base.h:595] status: Aborted: Sleep RPC to 0.0.0.0:40757 is cancelled in state SENT, seconds elapsed: 0.00069387
W20260926 16:13:06.499035 6560 rpcz_store.cc:267] Call kudu.rpc.GenericCalculatorService.Sleep from 127.0.0.1:35276 (request call id 11) took 14 ms (client timeout 10 ms). Trace:
W20260926 16:13:06.499303 6560 rpcz_store.cc:269] 0926 16:13:06.484376 (+ 0us) service_pool.cc:170] Inserting onto call queue
0926 16:13:06.498768 (+ 14392us) service_pool.cc:214] Skipping call since client already timed out
0926 16:13:06.498865 (+ 97us) inbound_call.cc:173] Queueing failure response
Metrics: {}
I20260926 16:13:06.499744 6560 rpc-test-base.h:222] got call: sleep_micros: 1500000
W20260926 16:13:06.691170 6559 rpcz_store.cc:267] Call kudu.rpc.GenericCalculatorService.Sleep from 127.0.0.1:35276 (request call id 3) took 510 ms (client timeout 10 ms). Trace:
W20260926 16:13:06.691463 6559 rpcz_store.cc:269] 0926 16:13:06.180302 (+ 0us) service_pool.cc:170] Inserting onto call queue
0926 16:13:06.180436 (+ 134us) service_pool.cc:227] Handling call
0926 16:13:06.691125 (+510689us) inbound_call.cc:173] Queueing success response
Metrics: {}
W20260926 16:13:06.848227 6558 rpcz_store.cc:267] Call kudu.rpc.GenericCalculatorService.Sleep from 127.0.0.1:35276 (request call id 7) took 514 ms (client timeout 10 ms). Trace:
W20260926 16:13:06.848522 6558 rpcz_store.cc:269] 0926 16:13:06.334189 (+ 0us) service_pool.cc:170] Inserting onto call queue
0926 16:13:06.337589 (+ 3400us) service_pool.cc:227] Handling call
0926 16:13:06.848174 (+510585us) inbound_call.cc:173] Queueing success response
Metrics: {}
I20260926 16:13:07.459517 6142 rpc-test-base.h:595] status: Timed out: Sleep RPC to 0.0.0.0:40757 timed out after 1.000s (SENT), seconds elapsed: 1.0009
I20260926 16:13:07.460723 6558 rpc-test-base.h:222] got call: sleep_micros: 1500000
W20260926 16:13:08.000229 6560 rpcz_store.cc:267] Call kudu.rpc.GenericCalculatorService.Sleep from 127.0.0.1:35276 (request call id 12) took 1515 ms (client timeout 1000 ms). Trace:
W20260926 16:13:08.000526 6560 rpcz_store.cc:269] 0926 16:13:06.484719 (+ 0us) service_pool.cc:170] Inserting onto call queue
0926 16:13:06.499707 (+ 14988us) service_pool.cc:227] Handling call
0926 16:13:08.000180 (+1500473us) inbound_call.cc:173] Queueing success response
Metrics: {}
I20260926 16:13:08.461325 6142 rpc-test-base.h:595] status: Timed out: Sleep RPC to 0.0.0.0:40757 timed out after 1.000s (SENT), seconds elapsed: 1.00151
W20260926 16:13:08.462659 6554 messenger.cc:357] Unable to handle RPC call: Not implemented: call requires unsupported application feature flags: 99, 1
W20260926 16:13:08.463965 6554 messenger.cc:357] Unable to handle RPC call: Not implemented: call requires unsupported application feature flags: 99, 1
W20260926 16:13:08.961236 6558 rpcz_store.cc:267] Call kudu.rpc.GenericCalculatorService.Sleep from 127.0.0.1:35276 (request call id 13) took 1500 ms (client timeout 1000 ms). Trace:
W20260926 16:13:08.961561 6558 rpcz_store.cc:269] 0926 16:13:07.460524 (+ 0us) service_pool.cc:170] Inserting onto call queue
0926 16:13:07.460675 (+ 151us) service_pool.cc:227] Handling call
0926 16:13:08.961186 (+1500511us) inbound_call.cc:173] Queueing success response
Metrics: {}
W20260926 16:13:08.962050 6554 connection.cc:441] server connection from 127.0.0.1:35276 torn down before Call kudu.rpc.GenericCalculatorService.Sleep from 127.0.0.1:35276 (request call id 13) could send its response
[ OK ] Parameters/TestRpc.TestCancellation/SSL_TCP (3089 ms)
[ RUN ] Parameters/TestRpc.TestCancellationMultiThreads/SSL_TCP
I20260926 16:13:08.996546 6581 acceptor_pool.cc:254] collecting diagnostics on the listening RPC socket 0.0.0.0:33045 every 8 connection(s)
I20260926 16:13:08.997248 6582 acceptor_pool.cc:254] collecting diagnostics on the listening RPC socket 0.0.0.0:33045 every 8 connection(s)
I20260926 16:13:09.000319 6142 rpc-test.cc:1808] Connecting to 0.0.0.0:33045
I20260926 16:13:09.148974 6595 test_util.cc:268] Using random seed: 467432723
I20260926 16:13:09.149974 6596 test_util.cc:268] Using random seed: 467433727
I20260926 16:13:09.151261 6597 test_util.cc:268] Using random seed: 467435015
I20260926 16:13:09.152558 6598 test_util.cc:268] Using random seed: 467436293
I20260926 16:13:09.154098 6599 test_util.cc:268] Using random seed: 467437696
I20260926 16:13:09.155380 6600 test_util.cc:268] Using random seed: 467438998
I20260926 16:13:09.156724 6601 test_util.cc:268] Using random seed: 467440347
I20260926 16:13:09.158298 6602 test_util.cc:268] Using random seed: 467441920
I20260926 16:13:09.159670 6603 test_util.cc:268] Using random seed: 467443259
I20260926 16:13:09.160938 6604 test_util.cc:268] Using random seed: 467444577
I20260926 16:13:09.162133 6605 test_util.cc:268] Using random seed: 467445785
I20260926 16:13:09.163244 6606 test_util.cc:268] Using random seed: 467446910
I20260926 16:13:09.164528 6607 test_util.cc:268] Using random seed: 467448166
I20260926 16:13:09.165980 6608 test_util.cc:268] Using random seed: 467449564
I20260926 16:13:09.167440 6609 test_util.cc:268] Using random seed: 467451075
I20260926 16:13:09.170238 6610 test_util.cc:268] Using random seed: 467453822
I20260926 16:13:09.171917 6611 test_util.cc:268] Using random seed: 467455479
I20260926 16:13:09.178803 6612 test_util.cc:268] Using random seed: 467462404
I20260926 16:13:09.181161 6613 test_util.cc:268] Using random seed: 467464722
I20260926 16:13:09.183137 6614 test_util.cc:268] Using random seed: 467466671
I20260926 16:13:09.185715 6615 test_util.cc:268] Using random seed: 467469303
I20260926 16:13:09.187242 6616 test_util.cc:268] Using random seed: 467470843
I20260926 16:13:09.188781 6617 test_util.cc:268] Using random seed: 467472352
I20260926 16:13:09.190662 6618 test_util.cc:268] Using random seed: 467474266
I20260926 16:13:09.192212 6619 test_util.cc:268] Using random seed: 467475803
I20260926 16:13:09.193795 6620 test_util.cc:268] Using random seed: 467477378
I20260926 16:13:09.195286 6621 test_util.cc:268] Using random seed: 467478870
I20260926 16:13:09.196969 6622 test_util.cc:268] Using random seed: 467480585
I20260926 16:13:09.198248 6623 test_util.cc:268] Using random seed: 467481908
I20260926 16:13:09.199402 6624 test_util.cc:268] Using random seed: 467483073
[ OK ] Parameters/TestRpc.TestCancellationMultiThreads/SSL_TCP (16733 ms)
[ RUN ] Parameters/TestRpc.TestCallId/SSL_TCP
I20260926 16:13:25.720372 6638 acceptor_pool.cc:254] collecting diagnostics on the listening RPC socket 0.0.0.0:45367 every 8 connection(s)
I20260926 16:13:25.721081 6639 acceptor_pool.cc:254] collecting diagnostics on the listening RPC socket 0.0.0.0:45367 every 8 connection(s)
[ OK ] Parameters/TestRpc.TestCallId/SSL_TCP (72 ms)
[----------] 20 tests from Parameters/TestRpc (36175 ms total)
[----------] Global test environment tear-down
[==========] 21 tests from 2 test suites ran. (36182 ms total)
[ PASSED ] 20 tests.
[ FAILED ] 1 test, listed below:
[ FAILED ] Parameters/TestRpc.TestCallWithChainCertAndRootCA/SSL_TCP, where GetParam() = (true, false)
1 FAILED TEST