Diagnosed failure

Parameters/TestRpc.TestCallWithChainCertAndChainCA/SSL_UnixSocket: /data0/somelongdirectorytoavoidrpathissues/src/kudu/src/kudu/rpc/rpc-test.cc:270: Failure
Failed
Bad status: Runtime error: could not verify certificate chain (error with cert: subject=CN = localhost, ST = sadfjas, C = AS, emailAddress = sdflkdsajf, O = lskdfjlsad, OU = sldfkja, issuer=C = AS, ST = ASDfkjdhf, L = lskdjf, O = saldfja, OU = skdjf, CN = localhost, emailAddress = sadjflkadsj): : certificate has expired
Google Test trace:
/data0/somelongdirectorytoavoidrpathissues/src/kudu/src/kudu/rpc/rpc-test.cc:267: Connecting to unix:/tmp/dist-test-taskpLMOZx/test-tmp/rpc-test-d9980e71d2b6485e92d63f286c89a752.sock
I20260927 22:52:15.302328  7072 test_util.cc:175] -----------------------------------------------
I20260927 22:52:15.302443  7072 test_util.cc:176] Had fatal failures, leaving test files at /tmp/dist-test-taskpLMOZx/test-tmp/rpc-test.6.Parameters_TestRpc.TestCallWithChainCertAndChainCA_SSL_UnixSocket.1790549535181137-7072-0

Full log

Note: This is test shard 7 of 8.
[==========] Running 21 tests from 2 test suites.
[----------] Global test environment set-up.
[----------] 20 tests from Parameters/TestRpc
[ RUN      ] Parameters/TestRpc.TestMessengerCreateDestroy/SSL_UnixSocket
WARNING: Logging before InitGoogleLogging() is written to STDERR
I20260927 22:52:15.231956  7072 rpc-test.cc:169] started messenger TestCreateDestroy
[       OK ] Parameters/TestRpc.TestMessengerCreateDestroy/SSL_UnixSocket (34 ms)
[ RUN      ] Parameters/TestRpc.TestNegotiationDeadlock/SSL_UnixSocket
I20260927 22:52:15.256083  7092 acceptor_pool.cc:254] collecting diagnostics on the listening RPC socket unix:/tmp/dist-test-taskpLMOZx/test-tmp/rpc-test-2390a2fb4344443eaa54caa9b878bb4e.sock every 8 connection(s)
I20260927 22:52:15.256317  7093 acceptor_pool.cc:254] collecting diagnostics on the listening RPC socket unix:/tmp/dist-test-taskpLMOZx/test-tmp/rpc-test-2390a2fb4344443eaa54caa9b878bb4e.sock every 8 connection(s)
[       OK ] Parameters/TestRpc.TestNegotiationDeadlock/SSL_UnixSocket (40 ms)
[ RUN      ] Parameters/TestRpc.TestCallWithChainCertAndChainCA/SSL_UnixSocket
I20260927 22:52:15.290614  7108 acceptor_pool.cc:254] collecting diagnostics on the listening RPC socket unix:/tmp/dist-test-taskpLMOZx/test-tmp/rpc-test-d9980e71d2b6485e92d63f286c89a752.sock every 8 connection(s)
I20260927 22:52:15.290992  7109 acceptor_pool.cc:254] collecting diagnostics on the listening RPC socket unix:/tmp/dist-test-taskpLMOZx/test-tmp/rpc-test-d9980e71d2b6485e92d63f286c89a752.sock every 8 connection(s)
/data0/somelongdirectorytoavoidrpathissues/src/kudu/src/kudu/rpc/rpc-test.cc:270: Failure
Failed
Bad status: Runtime error: could not verify certificate chain (error with cert: subject=CN = localhost, ST = sadfjas, C = AS, emailAddress = sdflkdsajf, O = lskdfjlsad, OU = sldfkja, issuer=C = AS, ST = ASDfkjdhf, L = lskdjf, O = saldfja, OU = skdjf, CN = localhost, emailAddress = sadjflkadsj): : certificate has expired
Google Test trace:
/data0/somelongdirectorytoavoidrpathissues/src/kudu/src/kudu/rpc/rpc-test.cc:267: Connecting to unix:/tmp/dist-test-taskpLMOZx/test-tmp/rpc-test-d9980e71d2b6485e92d63f286c89a752.sock
I20260927 22:52:15.302328  7072 test_util.cc:175] -----------------------------------------------
I20260927 22:52:15.302443  7072 test_util.cc:176] Had fatal failures, leaving test files at /tmp/dist-test-taskpLMOZx/test-tmp/rpc-test.6.Parameters_TestRpc.TestCallWithChainCertAndChainCA_SSL_UnixSocket.1790549535181137-7072-0
[  FAILED  ] Parameters/TestRpc.TestCallWithChainCertAndChainCA/SSL_UnixSocket, where GetParam() = (true, true) (27 ms)
[ RUN      ] Parameters/TestRpc.TestCallWithPasswordProtectedKey/SSL_UnixSocket
I20260927 22:52:15.321089  7133 acceptor_pool.cc:254] collecting diagnostics on the listening RPC socket unix:/tmp/dist-test-taskpLMOZx/test-tmp/rpc-test-6d7741581fb142909f64f17589e1113f.sock every 8 connection(s)
I20260927 22:52:15.321336  7134 acceptor_pool.cc:254] collecting diagnostics on the listening RPC socket unix:/tmp/dist-test-taskpLMOZx/test-tmp/rpc-test-6d7741581fb142909f64f17589e1113f.sock every 8 connection(s)
W20260927 22:52:15.350778  7130 connection.cc:196] Error closing socket: Network error: TlsSocket::Close: Broken pipe
[       OK ] Parameters/TestRpc.TestCallWithPasswordProtectedKey/SSL_UnixSocket (52 ms)
[ RUN      ] Parameters/TestRpc.TestCallToBadServer/SSL_UnixSocket
I20260927 22:52:15.366043  7072 rpc-test.cc:394] Status: Network error: Client connection negotiation failed: client connection to 0.0.0.0:0: connect: Connection refused (error 111)
I20260927 22:52:15.366667  7072 rpc-test.cc:394] Status: Network error: Client connection negotiation failed: client connection to 0.0.0.0:0: connect: Connection refused (error 111)
I20260927 22:52:15.367247  7072 rpc-test.cc:394] Status: Network error: Client connection negotiation failed: client connection to 0.0.0.0:0: connect: Connection refused (error 111)
I20260927 22:52:15.367771  7072 rpc-test.cc:394] Status: Network error: Client connection negotiation failed: client connection to 0.0.0.0:0: connect: Connection refused (error 111)
I20260927 22:52:15.368257  7072 rpc-test.cc:394] Status: Network error: Client connection negotiation failed: client connection to 0.0.0.0:0: connect: Connection refused (error 111)
[       OK ] Parameters/TestRpc.TestCallToBadServer/SSL_UnixSocket (15 ms)
[ RUN      ] Parameters/TestRpc.TestWrongService/SSL_UnixSocket
I20260927 22:52:15.390182  7168 acceptor_pool.cc:254] collecting diagnostics on the listening RPC socket unix:/tmp/dist-test-taskpLMOZx/test-tmp/rpc-test-3ceab3116d074dcd923b32ef9296a5fa.sock every 8 connection(s)
I20260927 22:52:15.390460  7169 acceptor_pool.cc:254] collecting diagnostics on the listening RPC socket unix:/tmp/dist-test-taskpLMOZx/test-tmp/rpc-test-3ceab3116d074dcd923b32ef9296a5fa.sock every 8 connection(s)
I20260927 22:52:15.418186  7165 messenger.cc:345] service WrongServiceName not registered on TestServer
W20260927 22:52:15.419489  7165 connection.cc:196] Error closing socket: Network error: TlsSocket::Close: Broken pipe
[       OK ] Parameters/TestRpc.TestWrongService/SSL_UnixSocket (52 ms)
[ RUN      ] Parameters/TestRpc.TestConnectionKeepalive/SSL_UnixSocket
I20260927 22:52:15.443173  7191 acceptor_pool.cc:254] collecting diagnostics on the listening RPC socket unix:/tmp/dist-test-taskpLMOZx/test-tmp/rpc-test-c3880cc73747415ba4b8fcf5590fccde.sock every 8 connection(s)
I20260927 22:52:15.443391  7192 acceptor_pool.cc:254] collecting diagnostics on the listening RPC socket unix:/tmp/dist-test-taskpLMOZx/test-tmp/rpc-test-c3880cc73747415ba4b8fcf5590fccde.sock every 8 connection(s)
I20260927 22:52:15.444368  7072 rpc-test.cc:488] Connecting to unix:/tmp/dist-test-taskpLMOZx/test-tmp/rpc-test-c3880cc73747415ba4b8fcf5590fccde.sock
W20260927 22:52:15.925565  7204 connection.cc:196] Error closing socket: Network error: TlsSocket::Close: Broken pipe
[       OK ] Parameters/TestRpc.TestConnectionKeepalive/SSL_UnixSocket (1064 ms)
[ RUN      ] Parameters/TestRpc.TestClientConnectionMetrics/SSL_UnixSocket
I20260927 22:52:16.503050  7216 acceptor_pool.cc:254] collecting diagnostics on the listening RPC socket unix:/tmp/dist-test-taskpLMOZx/test-tmp/rpc-test-f011329bee7345e1b79b5fc10d06673d.sock every 8 connection(s)
I20260927 22:52:16.503288  7217 acceptor_pool.cc:254] collecting diagnostics on the listening RPC socket unix:/tmp/dist-test-taskpLMOZx/test-tmp/rpc-test-f011329bee7345e1b79b5fc10d06673d.sock every 8 connection(s)
I20260927 22:52:16.504216  7072 rpc-test.cc:569] Connecting to unix:/tmp/dist-test-taskpLMOZx/test-tmp/rpc-test-f011329bee7345e1b79b5fc10d06673d.sock
W20260927 22:52:38.016747  7213 connection.cc:196] Error closing socket: Network error: TlsSocket::Close: Broken pipe
[       OK ] Parameters/TestRpc.TestClientConnectionMetrics/SSL_UnixSocket (21534 ms)
[ RUN      ] Parameters/TestRpc.TestCredentialsPolicy/SSL_UnixSocket
I20260927 22:52:38.052423  7239 acceptor_pool.cc:254] collecting diagnostics on the listening RPC socket unix:/tmp/dist-test-taskpLMOZx/test-tmp/rpc-test-5f54c94441de4a858e5c55861c685051.sock every 8 connection(s)
I20260927 22:52:38.052644  7240 acceptor_pool.cc:254] collecting diagnostics on the listening RPC socket unix:/tmp/dist-test-taskpLMOZx/test-tmp/rpc-test-5f54c94441de4a858e5c55861c685051.sock every 8 connection(s)
I20260927 22:52:38.053584  7072 rpc-test.cc:700] Connecting to unix:/tmp/dist-test-taskpLMOZx/test-tmp/rpc-test-5f54c94441de4a858e5c55861c685051.sock
W20260927 22:52:38.075948  7238 connection.cc:196] Error closing socket: Network error: TlsSocket::Close: Broken pipe
[       OK ] Parameters/TestRpc.TestCredentialsPolicy/SSL_UnixSocket (62 ms)
[ RUN      ] Parameters/TestRpc.TestCallLongerThanKeepalive/SSL_UnixSocket
I20260927 22:52:38.094659  7264 acceptor_pool.cc:254] collecting diagnostics on the listening RPC socket unix:/tmp/dist-test-taskpLMOZx/test-tmp/rpc-test-a47c185a3d004a86850f57daa9aebb2f.sock every 8 connection(s)
I20260927 22:52:38.094928  7265 acceptor_pool.cc:254] collecting diagnostics on the listening RPC socket unix:/tmp/dist-test-taskpLMOZx/test-tmp/rpc-test-a47c185a3d004a86850f57daa9aebb2f.sock every 8 connection(s)
I20260927 22:52:38.115391  7268 rpc-test-base.h:222] got call: sleep_micros: 3000000 deferred: true
I20260927 22:52:41.117036  7268 rpcz_store.cc:275] Call kudu.rpc.GenericCalculatorService.Sleep from unix:<unnamed> (request call id 0) took 3001 ms. Trace:
I20260927 22:52:41.117229  7268 rpcz_store.cc:276] 0927 22:52:38.115265 (+     0us) service_pool.cc:170] Inserting onto call queue
0927 22:52:38.115338 (+    73us) service_pool.cc:227] Handling call
0927 22:52:41.116991 (+3001653us) inbound_call.cc:173] Queueing success response
Metrics: {}
[       OK ] Parameters/TestRpc.TestCallLongerThanKeepalive/SSL_UnixSocket (3037 ms)
[ RUN      ] Parameters/TestRpc.TestRpcSidecar/SSL_UnixSocket
I20260927 22:52:41.145339  7289 acceptor_pool.cc:254] collecting diagnostics on the listening RPC socket unix:/tmp/dist-test-taskpLMOZx/test-tmp/rpc-test-b178fcc219c84f709b933c7bd11575e1.sock every 8 connection(s)
I20260927 22:52:41.145541  7290 acceptor_pool.cc:254] collecting diagnostics on the listening RPC socket unix:/tmp/dist-test-taskpLMOZx/test-tmp/rpc-test-b178fcc219c84f709b933c7bd11575e1.sock every 8 connection(s)
W20260927 22:52:41.252962  7286 connection.cc:196] Error closing socket: Network error: TlsSocket::Close: Broken pipe
[       OK ] Parameters/TestRpc.TestRpcSidecar/SSL_UnixSocket (132 ms)
[ RUN      ] Parameters/TestRpc.TestRpcSidecarLimits/SSL_UnixSocket
I20260927 22:52:43.380227  7314 acceptor_pool.cc:254] collecting diagnostics on the listening RPC socket unix:/tmp/dist-test-taskpLMOZx/test-tmp/rpc-test-2fa5dbba38544cdcb48e8ff828aabfbe.sock every 8 connection(s)
I20260927 22:52:43.380499  7315 acceptor_pool.cc:254] collecting diagnostics on the listening RPC socket unix:/tmp/dist-test-taskpLMOZx/test-tmp/rpc-test-2fa5dbba38544cdcb48e8ff828aabfbe.sock every 8 connection(s)
W20260927 22:52:43.394281  7072 serialization.cc:72] Serialized kudu.rpc_test.PushStringsRequestPB (2147483654 bytes) is larger than the maximum configured RPC message size (52428800 bytes). Sending anyway, but peer may reject the data.
W20260927 22:52:43.400178  7311 connection.cc:535] server connection from unix:<unnamed> recv error: Network error: RPC frame had a length of 2147483714, but we only support messages up to 52428800 bytes long.
W20260927 22:52:43.400290  7311 connection.cc:158] shutting down server connection from unix:<unnamed> with pending inbound data: 4/2147483714 bytes received; last active 0 ns ago: status Network error: RPC frame had a length of 2147483714, but we only support messages up to 52428800 bytes long.
W20260927 22:52:43.400808  7327 connection.cc:196] Error closing socket: Network error: TlsSocket::Close: Broken pipe
I20260927 22:52:43.415928  7339 acceptor_pool.cc:254] collecting diagnostics on the listening RPC socket unix:/tmp/dist-test-taskpLMOZx/test-tmp/rpc-test-2fa5dbba38544cdcb48e8ff828aabfbe.sock every 8 connection(s)
I20260927 22:52:43.416086  7340 acceptor_pool.cc:254] collecting diagnostics on the listening RPC socket unix:/tmp/dist-test-taskpLMOZx/test-tmp/rpc-test-2fa5dbba38544cdcb48e8ff828aabfbe.sock every 8 connection(s)
W20260927 22:52:49.291311  7336 connection.cc:577] server connection from unix:<unnamed>: received bad data: 'Corruption: Invalid packet: message had a length of 2147483710, but we only support messages up to 2147483647 bytes
'
W20260927 22:52:49.291882  7352 connection.cc:196] Error closing socket: Network error: TlsSocket::Close: Broken pipe
[       OK ] Parameters/TestRpc.TestRpcSidecarLimits/SSL_UnixSocket (8557 ms)
[ RUN      ] Parameters/TestRpc.TestCallTimeoutDoesntAffectNegotiation/SSL_UnixSocket
I20260927 22:52:49.848690  7364 acceptor_pool.cc:254] collecting diagnostics on the listening RPC socket unix:/tmp/dist-test-taskpLMOZx/test-tmp/rpc-test-5a890e5642df41b9a9f29d70340d2501.sock every 8 connection(s)
I20260927 22:52:49.848922  7365 acceptor_pool.cc:254] collecting diagnostics on the listening RPC socket unix:/tmp/dist-test-taskpLMOZx/test-tmp/rpc-test-5a890e5642df41b9a9f29d70340d2501.sock every 8 connection(s)
W20260927 22:52:49.857103  7360 negotiation.cc:266] Injecting 500ms delay in negotiation
I20260927 22:52:49.907589  7072 rpc-test-base.h:595] status: Timed out: connection negotiation to unix:/tmp/dist-test-taskpLMOZx/test-tmp/rpc-test-5a890e5642df41b9a9f29d70340d2501.sock for RPC Sleep timed out after 0.050s (ON_OUTBOUND_QUEUE), seconds elapsed: 0.0510032
[       OK ] Parameters/TestRpc.TestCallTimeoutDoesntAffectNegotiation/SSL_UnixSocket (552 ms)
[ RUN      ] Parameters/TestRpc.TestRpcHandlerLatencyMetric/SSL_UnixSocket
I20260927 22:52:50.389024  7389 acceptor_pool.cc:254] collecting diagnostics on the listening RPC socket unix:/tmp/dist-test-taskpLMOZx/test-tmp/rpc-test-ebbdd3fbaaf24a62a0076935f681f6ad.sock every 8 connection(s)
I20260927 22:52:50.389250  7390 acceptor_pool.cc:254] collecting diagnostics on the listening RPC socket unix:/tmp/dist-test-taskpLMOZx/test-tmp/rpc-test-ebbdd3fbaaf24a62a0076935f681f6ad.sock every 8 connection(s)
I20260927 22:52:50.441926  7072 rpc-test.cc:1236] Sleep() min lat: 20610
I20260927 22:52:50.442039  7072 rpc-test.cc:1237] Sleep() mean lat: 20610
I20260927 22:52:50.442122  7072 rpc-test.cc:1238] Sleep() max lat: 20610
I20260927 22:52:50.442168  7072 rpc-test.cc:1239] Sleep() #calls: 1
W20260927 22:52:50.443571  7386 connection.cc:196] Error closing socket: Network error: TlsSocket::Close: Broken pipe
[       OK ] Parameters/TestRpc.TestRpcHandlerLatencyMetric/SSL_UnixSocket (80 ms)
[ RUN      ] Parameters/TestRpc.TimedOutOnResponseMetricServiceQueue/SSL_UnixSocket
I20260927 22:52:50.470455  7415 acceptor_pool.cc:254] collecting diagnostics on the listening RPC socket unix:/tmp/dist-test-taskpLMOZx/test-tmp/rpc-test-535d8dc3251f43b8bc7aeb791498fd4a.sock every 8 connection(s)
I20260927 22:52:50.470659  7416 acceptor_pool.cc:254] collecting diagnostics on the listening RPC socket unix:/tmp/dist-test-taskpLMOZx/test-tmp/rpc-test-535d8dc3251f43b8bc7aeb791498fd4a.sock every 8 connection(s)
W20260927 22:52:50.535007  7417 rpcz_store.cc:267] Call kudu.rpc_test.CalculatorService.Sleep from unix:<unnamed> (request call id 2) took 20 ms (client timeout 20 ms). Trace:
W20260927 22:52:50.535210  7417 rpcz_store.cc:269] 0927 22:52:50.514627 (+     0us) service_pool.cc:170] Inserting onto call queue
0927 22:52:50.534950 (+ 20323us) service_pool.cc:214] Skipping call since client already timed out
0927 22:52:50.534989 (+    39us) inbound_call.cc:173] Queueing failure response
Metrics: {}
[       OK ] Parameters/TestRpc.TimedOutOnResponseMetricServiceQueue/SSL_UnixSocket (92 ms)
[ RUN      ] Parameters/TestRpc.RpcPendingConnectionsMetric/SSL_UnixSocket
I20260927 22:52:50.543840  7438 acceptor_pool.cc:254] collecting diagnostics on the listening RPC socket 0.0.0.0:46327 every 8 connection(s)
I20260927 22:52:50.544049  7439 acceptor_pool.cc:254] collecting diagnostics on the listening RPC socket 0.0.0.0:46327 every 8 connection(s)
W20260927 22:52:50.545939  7434 negotiation.cc:337] Failed RPC negotiation. Trace:
0927 22:52:50.545373 (+     0us) reactor.cc:625] Submitting negotiation task for server connection from 127.0.0.1:52860 (local address 127.0.0.1:46327)
0927 22:52:50.545503 (+   130us) server_negotiation.cc:206] Beginning negotiation
0927 22:52:50.545507 (+     4us) server_negotiation.cc:399] Waiting for connection header
0927 22:52:50.545644 (+   137us) negotiation.cc:327] Negotiation complete: Network error: Server connection negotiation failed: server connection from 127.0.0.1:52860: BlockingRecv error: recv got EOF from 127.0.0.1:52860 (error 108)
Metrics: {"server-negotiator.queue_time_us":40}
[       OK ] Parameters/TestRpc.RpcPendingConnectionsMetric/SSL_UnixSocket (18 ms)
[ RUN      ] Parameters/TestRpc.TestRpcContextClientDeadline/SSL_UnixSocket
I20260927 22:52:50.583431  7454 acceptor_pool.cc:254] collecting diagnostics on the listening RPC socket unix:/tmp/dist-test-taskpLMOZx/test-tmp/rpc-test-99ec1737a68549cb8ffa1ab85fec5d22.sock every 8 connection(s)
I20260927 22:52:50.583640  7455 acceptor_pool.cc:254] collecting diagnostics on the listening RPC socket unix:/tmp/dist-test-taskpLMOZx/test-tmp/rpc-test-99ec1737a68549cb8ffa1ab85fec5d22.sock every 8 connection(s)
[       OK ] Parameters/TestRpc.TestRpcContextClientDeadline/SSL_UnixSocket (64 ms)
[ RUN      ] Parameters/TestRpc.TestApplicationFeatureFlagUnsupportedServer/SSL_UnixSocket
I20260927 22:52:50.659320  7479 acceptor_pool.cc:254] collecting diagnostics on the listening RPC socket unix:/tmp/dist-test-taskpLMOZx/test-tmp/rpc-test-a7bad282395c4d148404c37cd88109f8.sock every 8 connection(s)
I20260927 22:52:50.659598  7480 acceptor_pool.cc:254] collecting diagnostics on the listening RPC socket unix:/tmp/dist-test-taskpLMOZx/test-tmp/rpc-test-a7bad282395c4d148404c37cd88109f8.sock every 8 connection(s)
[       OK ] Parameters/TestRpc.TestApplicationFeatureFlagUnsupportedServer/SSL_UnixSocket (64 ms)
[ RUN      ] Parameters/TestRpc.TestCancellationAsync/SSL_UnixSocket
I20260927 22:52:50.711263  7504 acceptor_pool.cc:254] collecting diagnostics on the listening RPC socket unix:/tmp/dist-test-taskpLMOZx/test-tmp/rpc-test-1f73128531574ab581d62481fbf90501.sock every 8 connection(s)
I20260927 22:52:50.711472  7505 acceptor_pool.cc:254] collecting diagnostics on the listening RPC socket unix:/tmp/dist-test-taskpLMOZx/test-tmp/rpc-test-1f73128531574ab581d62481fbf90501.sock every 8 connection(s)
I20260927 22:52:50.712385  7072 rpc-test.cc:1716] Connecting to unix:/tmp/dist-test-taskpLMOZx/test-tmp/rpc-test-1f73128531574ab581d62481fbf90501.sock
I20260927 22:52:50.730696  7072 test_util.cc:268] Using random seed: -820135242
I20260927 22:52:50.764187  7508 rpc-test-base.h:240] got call: sleep_micros: 500 pattern: 4294967295 num_repetitions: 2097152 sidecar_idx: 0
I20260927 22:52:50.791700  7507 rpc-test-base.h:240] got call: sleep_micros: 500 pattern: 4294967295 num_repetitions: 2097152 sidecar_idx: 0
I20260927 22:52:50.820531  7508 rpc-test-base.h:240] got call: sleep_micros: 500 pattern: 4294967295 num_repetitions: 2097152 sidecar_idx: 0
I20260927 22:52:50.849295  7506 rpc-test-base.h:240] got call: sleep_micros: 500 pattern: 4294967295 num_repetitions: 2097152 sidecar_idx: 0
I20260927 22:52:50.878072  7508 rpc-test-base.h:240] got call: sleep_micros: 500 pattern: 4294967295 num_repetitions: 2097152 sidecar_idx: 0
I20260927 22:52:50.907312  7506 rpc-test-base.h:240] got call: sleep_micros: 500 pattern: 4294967295 num_repetitions: 2097152 sidecar_idx: 0
I20260927 22:52:50.941082  7508 rpc-test-base.h:240] got call: sleep_micros: 500 pattern: 4294967295 num_repetitions: 2097152 sidecar_idx: 0
W20260927 22:52:50.943531  7501 connection.cc:196] Error closing socket: Network error: TlsSocket::Close: Broken pipe
W20260927 22:52:50.969563  7501 connection.cc:441] server connection from unix:<unnamed> torn down before Call kudu.rpc.GenericCalculatorService.SleepWithSidecar from unix:<unnamed> (request call id 8) could send its response
W20260927 22:52:50.987368  7501 connection.cc:441] server connection from unix:<unnamed> torn down before Call kudu.rpc.GenericCalculatorService.SleepWithSidecar from unix:<unnamed> (request call id 9) could send its response
[       OK ] Parameters/TestRpc.TestCancellationAsync/SSL_UnixSocket (302 ms)
[ RUN      ] Parameters/TestRpc.TestPerformanceBySocketType/SSL_UnixSocket
I20260927 22:52:51.019507  7529 acceptor_pool.cc:254] collecting diagnostics on the listening RPC socket unix:/tmp/dist-test-taskpLMOZx/test-tmp/rpc-test-9d5f3ced5bf847278e4c81ac98bf46c2.sock every 8 connection(s)
I20260927 22:52:51.019966  7530 acceptor_pool.cc:254] collecting diagnostics on the listening RPC socket unix:/tmp/dist-test-taskpLMOZx/test-tmp/rpc-test-9d5f3ced5bf847278e4c81ac98bf46c2.sock every 8 connection(s)
I20260927 22:52:51.020989  7072 rpc-test.cc:1846] Connecting to unix:/tmp/dist-test-taskpLMOZx/test-tmp/rpc-test-9d5f3ced5bf847278e4c81ac98bf46c2.sock
I20260927 22:52:54.162171  7072 rpc-test.cc:1859] Sending 1024MB via ssl-enabled unix socket: real 3.123s	user 2.954s	sys 2.343s
I20260927 22:52:57.306785  7072 rpc-test.cc:1859] Sending 1024MB via ssl-enabled unix socket: real 3.144s	user 3.087s	sys 2.257s
I20260927 22:53:00.517246  7072 rpc-test.cc:1859] Sending 1024MB via ssl-enabled unix socket: real 3.210s	user 3.152s	sys 2.315s
I20260927 22:53:03.665297  7072 rpc-test.cc:1859] Sending 1024MB via ssl-enabled unix socket: real 3.148s	user 3.022s	sys 2.317s
I20260927 22:53:06.815711  7072 rpc-test.cc:1859] Sending 1024MB via ssl-enabled unix socket: real 3.150s	user 2.978s	sys 2.355s
W20260927 22:53:06.816650  7526 connection.cc:196] Error closing socket: Network error: TlsSocket::Close: Broken pipe
[       OK ] Parameters/TestRpc.TestPerformanceBySocketType/SSL_UnixSocket (15833 ms)
[----------] 20 tests from Parameters/TestRpc (51623 ms total)

[----------] 1 test from Parameters/TestRpcSocketTxRxQueue
[ RUN      ] Parameters/TestRpcSocketTxRxQueue.AcceptorRxQueueSizeMetric/0
I20260927 22:53:06.832327  7554 acceptor_pool.cc:254] collecting diagnostics on the listening RPC socket 0.0.0.0:38211 every 1 connection(s)
I20260927 22:53:06.832571  7555 acceptor_pool.cc:254] collecting diagnostics on the listening RPC socket 0.0.0.0:38211 every 1 connection(s)
W20260927 22:53:06.834297  7550 negotiation.cc:337] Failed RPC negotiation. Trace:
0927 22:53:06.833915 (+     0us) reactor.cc:625] Submitting negotiation task for server connection from 127.0.0.1:36116 (local address 127.0.0.1:38211)
0927 22:53:06.834066 (+   151us) server_negotiation.cc:206] Beginning negotiation
0927 22:53:06.834070 (+     4us) server_negotiation.cc:399] Waiting for connection header
0927 22:53:06.834187 (+   117us) negotiation.cc:327] Negotiation complete: Network error: Server connection negotiation failed: server connection from 127.0.0.1:36116: BlockingRecv error: recv got EOF from 127.0.0.1:36116 (error 108)
Metrics: {"server-negotiator.queue_time_us":46}
[       OK ] Parameters/TestRpcSocketTxRxQueue.AcceptorRxQueueSizeMetric/0 (13 ms)
[----------] 1 test from Parameters/TestRpcSocketTxRxQueue (13 ms total)

[----------] Global test environment tear-down
[==========] 21 tests from 2 test suites ran. (51637 ms total)
[  PASSED  ] 20 tests.
[  FAILED  ] 1 test, listed below:
[  FAILED  ] Parameters/TestRpc.TestCallWithChainCertAndChainCA/SSL_UnixSocket, where GetParam() = (true, true)

 1 FAILED TEST