Diagnosed failure
Parameters/TestRpc.TestCallWithChainCertAndChainCA/SSL_UnixSocket: /data0/somelongdirectorytoavoidrpathissues/src/kudu/src/kudu/rpc/rpc-test.cc:270: Failure
Failed
Bad status: Runtime error: could not verify certificate chain (error with cert: subject=CN = localhost, ST = sadfjas, C = AS, emailAddress = sdflkdsajf, O = lskdfjlsad, OU = sldfkja, issuer=C = AS, ST = ASDfkjdhf, L = lskdjf, O = saldfja, OU = skdjf, CN = localhost, emailAddress = sadjflkadsj): : certificate has expired
Google Test trace:
/data0/somelongdirectorytoavoidrpathissues/src/kudu/src/kudu/rpc/rpc-test.cc:267: Connecting to unix:/tmp/dist-test-taskbUq2ts/test-tmp/rpc-test-8cdf9ed6c37c43778b35edab37964b83.sock
I20260924 12:47:21.248744 9051 test_util.cc:175] -----------------------------------------------
I20260924 12:47:21.248857 9051 test_util.cc:176] Had fatal failures, leaving test files at /tmp/dist-test-taskbUq2ts/test-tmp/rpc-test.6.Parameters_TestRpc.TestCallWithChainCertAndChainCA_SSL_UnixSocket.1790254041112030-9051-0
Full log
Note: This is test shard 7 of 8.
[==========] Running 21 tests from 2 test suites.
[----------] Global test environment set-up.
[----------] 20 tests from Parameters/TestRpc
[ RUN ] Parameters/TestRpc.TestMessengerCreateDestroy/SSL_UnixSocket
WARNING: Logging before InitGoogleLogging() is written to STDERR
I20260924 12:47:21.164762 9051 rpc-test.cc:169] started messenger TestCreateDestroy
[ OK ] Parameters/TestRpc.TestMessengerCreateDestroy/SSL_UnixSocket (35 ms)
[ RUN ] Parameters/TestRpc.TestNegotiationDeadlock/SSL_UnixSocket
I20260924 12:47:21.199357 9071 acceptor_pool.cc:254] collecting diagnostics on the listening RPC socket unix:/tmp/dist-test-taskbUq2ts/test-tmp/rpc-test-4fe50eafaa504445b874956992545b29.sock every 8 connection(s)
I20260924 12:47:21.199728 9072 acceptor_pool.cc:254] collecting diagnostics on the listening RPC socket unix:/tmp/dist-test-taskbUq2ts/test-tmp/rpc-test-4fe50eafaa504445b874956992545b29.sock every 8 connection(s)
[ OK ] Parameters/TestRpc.TestNegotiationDeadlock/SSL_UnixSocket (49 ms)
[ RUN ] Parameters/TestRpc.TestCallWithChainCertAndChainCA/SSL_UnixSocket
I20260924 12:47:21.237136 9087 acceptor_pool.cc:254] collecting diagnostics on the listening RPC socket unix:/tmp/dist-test-taskbUq2ts/test-tmp/rpc-test-8cdf9ed6c37c43778b35edab37964b83.sock every 8 connection(s)
I20260924 12:47:21.237430 9088 acceptor_pool.cc:254] collecting diagnostics on the listening RPC socket unix:/tmp/dist-test-taskbUq2ts/test-tmp/rpc-test-8cdf9ed6c37c43778b35edab37964b83.sock every 8 connection(s)
/data0/somelongdirectorytoavoidrpathissues/src/kudu/src/kudu/rpc/rpc-test.cc:270: Failure
Failed
Bad status: Runtime error: could not verify certificate chain (error with cert: subject=CN = localhost, ST = sadfjas, C = AS, emailAddress = sdflkdsajf, O = lskdfjlsad, OU = sldfkja, issuer=C = AS, ST = ASDfkjdhf, L = lskdjf, O = saldfja, OU = skdjf, CN = localhost, emailAddress = sadjflkadsj): : certificate has expired
Google Test trace:
/data0/somelongdirectorytoavoidrpathissues/src/kudu/src/kudu/rpc/rpc-test.cc:267: Connecting to unix:/tmp/dist-test-taskbUq2ts/test-tmp/rpc-test-8cdf9ed6c37c43778b35edab37964b83.sock
I20260924 12:47:21.248744 9051 test_util.cc:175] -----------------------------------------------
I20260924 12:47:21.248857 9051 test_util.cc:176] Had fatal failures, leaving test files at /tmp/dist-test-taskbUq2ts/test-tmp/rpc-test.6.Parameters_TestRpc.TestCallWithChainCertAndChainCA_SSL_UnixSocket.1790254041112030-9051-0
[ FAILED ] Parameters/TestRpc.TestCallWithChainCertAndChainCA/SSL_UnixSocket, where GetParam() = (true, true) (29 ms)
[ RUN ] Parameters/TestRpc.TestCallWithPasswordProtectedKey/SSL_UnixSocket
I20260924 12:47:21.272913 9112 acceptor_pool.cc:254] collecting diagnostics on the listening RPC socket unix:/tmp/dist-test-taskbUq2ts/test-tmp/rpc-test-67a10f210ee84897bdd038a5b17bd6cd.sock every 8 connection(s)
I20260924 12:47:21.273186 9113 acceptor_pool.cc:254] collecting diagnostics on the listening RPC socket unix:/tmp/dist-test-taskbUq2ts/test-tmp/rpc-test-67a10f210ee84897bdd038a5b17bd6cd.sock every 8 connection(s)
W20260924 12:47:21.306550 9109 connection.cc:196] Error closing socket: Network error: TlsSocket::Close: Broken pipe
[ OK ] Parameters/TestRpc.TestCallWithPasswordProtectedKey/SSL_UnixSocket (61 ms)
[ RUN ] Parameters/TestRpc.TestCallToBadServer/SSL_UnixSocket
I20260924 12:47:21.324203 9051 rpc-test.cc:394] Status: Network error: Client connection negotiation failed: client connection to 0.0.0.0:0: connect: Connection refused (error 111)
I20260924 12:47:21.325062 9051 rpc-test.cc:394] Status: Network error: Client connection negotiation failed: client connection to 0.0.0.0:0: connect: Connection refused (error 111)
I20260924 12:47:21.325649 9051 rpc-test.cc:394] Status: Network error: Client connection negotiation failed: client connection to 0.0.0.0:0: connect: Connection refused (error 111)
I20260924 12:47:21.326251 9051 rpc-test.cc:394] Status: Network error: Client connection negotiation failed: client connection to 0.0.0.0:0: connect: Connection refused (error 111)
I20260924 12:47:21.326793 9051 rpc-test.cc:394] Status: Network error: Client connection negotiation failed: client connection to 0.0.0.0:0: connect: Connection refused (error 111)
[ OK ] Parameters/TestRpc.TestCallToBadServer/SSL_UnixSocket (18 ms)
[ RUN ] Parameters/TestRpc.TestWrongService/SSL_UnixSocket
I20260924 12:47:21.348500 9147 acceptor_pool.cc:254] collecting diagnostics on the listening RPC socket unix:/tmp/dist-test-taskbUq2ts/test-tmp/rpc-test-9a7d71a9ba254a9d93d55e70aac1e90f.sock every 8 connection(s)
I20260924 12:47:21.348760 9148 acceptor_pool.cc:254] collecting diagnostics on the listening RPC socket unix:/tmp/dist-test-taskbUq2ts/test-tmp/rpc-test-9a7d71a9ba254a9d93d55e70aac1e90f.sock every 8 connection(s)
I20260924 12:47:21.364337 9144 messenger.cc:345] service WrongServiceName not registered on TestServer
W20260924 12:47:21.366087 9144 connection.cc:196] Error closing socket: Network error: TlsSocket::Close: Broken pipe
[ OK ] Parameters/TestRpc.TestWrongService/SSL_UnixSocket (40 ms)
[ RUN ] Parameters/TestRpc.TestConnectionKeepalive/SSL_UnixSocket
I20260924 12:47:21.395525 9170 acceptor_pool.cc:254] collecting diagnostics on the listening RPC socket unix:/tmp/dist-test-taskbUq2ts/test-tmp/rpc-test-4070b78cebb24db49032f89c7aaf21e5.sock every 8 connection(s)
I20260924 12:47:21.395771 9171 acceptor_pool.cc:254] collecting diagnostics on the listening RPC socket unix:/tmp/dist-test-taskbUq2ts/test-tmp/rpc-test-4070b78cebb24db49032f89c7aaf21e5.sock every 8 connection(s)
I20260924 12:47:21.396669 9051 rpc-test.cc:488] Connecting to unix:/tmp/dist-test-taskbUq2ts/test-tmp/rpc-test-4070b78cebb24db49032f89c7aaf21e5.sock
W20260924 12:47:21.871766 9183 connection.cc:196] Error closing socket: Network error: TlsSocket::Close: Broken pipe
[ OK ] Parameters/TestRpc.TestConnectionKeepalive/SSL_UnixSocket (1073 ms)
[ RUN ] Parameters/TestRpc.TestClientConnectionMetrics/SSL_UnixSocket
I20260924 12:47:22.464267 9195 acceptor_pool.cc:254] collecting diagnostics on the listening RPC socket unix:/tmp/dist-test-taskbUq2ts/test-tmp/rpc-test-e5468e1644a34a84a60854a4f54c7e00.sock every 8 connection(s)
I20260924 12:47:22.464543 9196 acceptor_pool.cc:254] collecting diagnostics on the listening RPC socket unix:/tmp/dist-test-taskbUq2ts/test-tmp/rpc-test-e5468e1644a34a84a60854a4f54c7e00.sock every 8 connection(s)
I20260924 12:47:22.465708 9051 rpc-test.cc:569] Connecting to unix:/tmp/dist-test-taskbUq2ts/test-tmp/rpc-test-e5468e1644a34a84a60854a4f54c7e00.sock
W20260924 12:47:43.982210 9192 connection.cc:196] Error closing socket: Network error: TlsSocket::Close: Broken pipe
[ OK ] Parameters/TestRpc.TestClientConnectionMetrics/SSL_UnixSocket (21545 ms)
[ RUN ] Parameters/TestRpc.TestCredentialsPolicy/SSL_UnixSocket
I20260924 12:47:44.009137 9218 acceptor_pool.cc:254] collecting diagnostics on the listening RPC socket unix:/tmp/dist-test-taskbUq2ts/test-tmp/rpc-test-50c155f675d5447a8448bcd5909d51f8.sock every 8 connection(s)
I20260924 12:47:44.009405 9219 acceptor_pool.cc:254] collecting diagnostics on the listening RPC socket unix:/tmp/dist-test-taskbUq2ts/test-tmp/rpc-test-50c155f675d5447a8448bcd5909d51f8.sock every 8 connection(s)
I20260924 12:47:44.010535 9051 rpc-test.cc:700] Connecting to unix:/tmp/dist-test-taskbUq2ts/test-tmp/rpc-test-50c155f675d5447a8448bcd5909d51f8.sock
W20260924 12:47:44.037002 9217 connection.cc:196] Error closing socket: Network error: TlsSocket::Close: Broken pipe
[ OK ] Parameters/TestRpc.TestCredentialsPolicy/SSL_UnixSocket (59 ms)
[ RUN ] Parameters/TestRpc.TestCallLongerThanKeepalive/SSL_UnixSocket
I20260924 12:47:44.060657 9243 acceptor_pool.cc:254] collecting diagnostics on the listening RPC socket unix:/tmp/dist-test-taskbUq2ts/test-tmp/rpc-test-81cd8139a39d4c8b9cbdee49d4682622.sock every 8 connection(s)
I20260924 12:47:44.060853 9244 acceptor_pool.cc:254] collecting diagnostics on the listening RPC socket unix:/tmp/dist-test-taskbUq2ts/test-tmp/rpc-test-81cd8139a39d4c8b9cbdee49d4682622.sock every 8 connection(s)
I20260924 12:47:44.080036 9247 rpc-test-base.h:222] got call: sleep_micros: 3000000 deferred: true
I20260924 12:47:47.081736 9247 rpcz_store.cc:275] Call kudu.rpc.GenericCalculatorService.Sleep from unix:<unnamed> (request call id 0) took 3001 ms. Trace:
I20260924 12:47:47.081909 9247 rpcz_store.cc:276] 0924 12:47:44.079927 (+ 0us) service_pool.cc:170] Inserting onto call queue
0924 12:47:44.079991 (+ 64us) service_pool.cc:227] Handling call
0924 12:47:47.081690 (+3001699us) inbound_call.cc:173] Queueing success response
Metrics: {}
W20260924 12:47:47.083885 9240 connection.cc:196] Error closing socket: Network error: TlsSocket::Close: Broken pipe
[ OK ] Parameters/TestRpc.TestCallLongerThanKeepalive/SSL_UnixSocket (3039 ms)
[ RUN ] Parameters/TestRpc.TestRpcSidecar/SSL_UnixSocket
I20260924 12:47:47.117305 9268 acceptor_pool.cc:254] collecting diagnostics on the listening RPC socket unix:/tmp/dist-test-taskbUq2ts/test-tmp/rpc-test-71ecd0090a7d4bffab053f3ba43b557b.sock every 8 connection(s)
I20260924 12:47:47.117537 9269 acceptor_pool.cc:254] collecting diagnostics on the listening RPC socket unix:/tmp/dist-test-taskbUq2ts/test-tmp/rpc-test-71ecd0090a7d4bffab053f3ba43b557b.sock every 8 connection(s)
W20260924 12:47:47.231065 9265 connection.cc:196] Error closing socket: Network error: TlsSocket::Close: Broken pipe
[ OK ] Parameters/TestRpc.TestRpcSidecar/SSL_UnixSocket (146 ms)
[ RUN ] Parameters/TestRpc.TestRpcSidecarLimits/SSL_UnixSocket
I20260924 12:47:49.236075 9293 acceptor_pool.cc:254] collecting diagnostics on the listening RPC socket unix:/tmp/dist-test-taskbUq2ts/test-tmp/rpc-test-4ecbca5124e148c798a953e99f52c138.sock every 8 connection(s)
I20260924 12:47:49.236419 9294 acceptor_pool.cc:254] collecting diagnostics on the listening RPC socket unix:/tmp/dist-test-taskbUq2ts/test-tmp/rpc-test-4ecbca5124e148c798a953e99f52c138.sock every 8 connection(s)
W20260924 12:47:49.257977 9051 serialization.cc:72] Serialized kudu.rpc_test.PushStringsRequestPB (2147483654 bytes) is larger than the maximum configured RPC message size (52428800 bytes). Sending anyway, but peer may reject the data.
W20260924 12:47:49.264498 9290 connection.cc:535] server connection from unix:<unnamed> recv error: Network error: RPC frame had a length of 2147483714, but we only support messages up to 52428800 bytes long.
W20260924 12:47:49.264667 9290 connection.cc:158] shutting down server connection from unix:<unnamed> with pending inbound data: 4/2147483714 bytes received; last active 0 ns ago: status Network error: RPC frame had a length of 2147483714, but we only support messages up to 52428800 bytes long.
W20260924 12:47:49.265213 9306 connection.cc:196] Error closing socket: Network error: TlsSocket::Close: Broken pipe
I20260924 12:47:49.297221 9318 acceptor_pool.cc:254] collecting diagnostics on the listening RPC socket unix:/tmp/dist-test-taskbUq2ts/test-tmp/rpc-test-4ecbca5124e148c798a953e99f52c138.sock every 8 connection(s)
I20260924 12:47:49.297454 9319 acceptor_pool.cc:254] collecting diagnostics on the listening RPC socket unix:/tmp/dist-test-taskbUq2ts/test-tmp/rpc-test-4ecbca5124e148c798a953e99f52c138.sock every 8 connection(s)
W20260924 12:47:54.812104 9315 connection.cc:577] server connection from unix:<unnamed>: received bad data: 'Corruption: Invalid packet: message had a length of 2147483710, but we only support messages up to 2147483647 bytes
'
W20260924 12:47:54.812763 9331 connection.cc:196] Error closing socket: Network error: TlsSocket::Close: Broken pipe
[ OK ] Parameters/TestRpc.TestRpcSidecarLimits/SSL_UnixSocket (8060 ms)
[ RUN ] Parameters/TestRpc.TestCallTimeoutDoesntAffectNegotiation/SSL_UnixSocket
I20260924 12:47:55.316488 9343 acceptor_pool.cc:254] collecting diagnostics on the listening RPC socket unix:/tmp/dist-test-taskbUq2ts/test-tmp/rpc-test-8e13aa32b74a4c2cb061235f89822720.sock every 8 connection(s)
I20260924 12:47:55.316792 9344 acceptor_pool.cc:254] collecting diagnostics on the listening RPC socket unix:/tmp/dist-test-taskbUq2ts/test-tmp/rpc-test-8e13aa32b74a4c2cb061235f89822720.sock every 8 connection(s)
W20260924 12:47:55.330698 9339 negotiation.cc:266] Injecting 500ms delay in negotiation
I20260924 12:47:55.381198 9051 rpc-test-base.h:595] status: Timed out: connection negotiation to unix:/tmp/dist-test-taskbUq2ts/test-tmp/rpc-test-8e13aa32b74a4c2cb061235f89822720.sock for RPC Sleep timed out after 0.050s (ON_OUTBOUND_QUEUE), seconds elapsed: 0.0511807
[ OK ] Parameters/TestRpc.TestCallTimeoutDoesntAffectNegotiation/SSL_UnixSocket (547 ms)
[ RUN ] Parameters/TestRpc.TestRpcHandlerLatencyMetric/SSL_UnixSocket
I20260924 12:47:55.858232 9368 acceptor_pool.cc:254] collecting diagnostics on the listening RPC socket unix:/tmp/dist-test-taskbUq2ts/test-tmp/rpc-test-bc377bb5a87a4892ac38863db0a791e0.sock every 8 connection(s)
I20260924 12:47:55.858541 9369 acceptor_pool.cc:254] collecting diagnostics on the listening RPC socket unix:/tmp/dist-test-taskbUq2ts/test-tmp/rpc-test-bc377bb5a87a4892ac38863db0a791e0.sock every 8 connection(s)
I20260924 12:47:55.907622 9051 rpc-test.cc:1236] Sleep() min lat: 20680
I20260924 12:47:55.907729 9051 rpc-test.cc:1237] Sleep() mean lat: 20680
I20260924 12:47:55.907771 9051 rpc-test.cc:1238] Sleep() max lat: 20680
I20260924 12:47:55.907790 9051 rpc-test.cc:1239] Sleep() #calls: 1
[ OK ] Parameters/TestRpc.TestRpcHandlerLatencyMetric/SSL_UnixSocket (71 ms)
[ RUN ] Parameters/TestRpc.TimedOutOnResponseMetricServiceQueue/SSL_UnixSocket
I20260924 12:47:55.926162 9394 acceptor_pool.cc:254] collecting diagnostics on the listening RPC socket unix:/tmp/dist-test-taskbUq2ts/test-tmp/rpc-test-af92184bc0fd4873a7af9010cd5e7d2f.sock every 8 connection(s)
I20260924 12:47:55.926414 9395 acceptor_pool.cc:254] collecting diagnostics on the listening RPC socket unix:/tmp/dist-test-taskbUq2ts/test-tmp/rpc-test-af92184bc0fd4873a7af9010cd5e7d2f.sock every 8 connection(s)
W20260924 12:47:55.986418 9396 rpcz_store.cc:267] Call kudu.rpc_test.CalculatorService.Sleep from unix:<unnamed> (request call id 2) took 20 ms (client timeout 20 ms). Trace:
W20260924 12:47:55.986574 9396 rpcz_store.cc:269] 0924 12:47:55.965977 (+ 0us) service_pool.cc:170] Inserting onto call queue
0924 12:47:55.986357 (+ 20380us) service_pool.cc:214] Skipping call since client already timed out
0924 12:47:55.986398 (+ 41us) inbound_call.cc:173] Queueing failure response
Metrics: {}
[ OK ] Parameters/TestRpc.TimedOutOnResponseMetricServiceQueue/SSL_UnixSocket (77 ms)
[ RUN ] Parameters/TestRpc.RpcPendingConnectionsMetric/SSL_UnixSocket
I20260924 12:47:55.996588 9417 acceptor_pool.cc:254] collecting diagnostics on the listening RPC socket 0.0.0.0:37401 every 8 connection(s)
I20260924 12:47:55.996809 9418 acceptor_pool.cc:254] collecting diagnostics on the listening RPC socket 0.0.0.0:37401 every 8 connection(s)
W20260924 12:47:55.999018 9413 negotiation.cc:337] Failed RPC negotiation. Trace:
0924 12:47:55.998375 (+ 0us) reactor.cc:625] Submitting negotiation task for server connection from 127.0.0.1:34404 (local address 127.0.0.1:37401)
0924 12:47:55.998560 (+ 185us) server_negotiation.cc:206] Beginning negotiation
0924 12:47:55.998564 (+ 4us) server_negotiation.cc:399] Waiting for connection header
0924 12:47:55.998703 (+ 139us) negotiation.cc:327] Negotiation complete: Network error: Server connection negotiation failed: server connection from 127.0.0.1:34404: BlockingRecv error: recv got EOF from 127.0.0.1:34404 (error 108)
Metrics: {"server-negotiator.queue_time_us":60}
[ OK ] Parameters/TestRpc.RpcPendingConnectionsMetric/SSL_UnixSocket (20 ms)
[ RUN ] Parameters/TestRpc.TestRpcContextClientDeadline/SSL_UnixSocket
I20260924 12:47:56.022498 9433 acceptor_pool.cc:254] collecting diagnostics on the listening RPC socket unix:/tmp/dist-test-taskbUq2ts/test-tmp/rpc-test-efedccea6af94df495d17f4f642f83ea.sock every 8 connection(s)
I20260924 12:47:56.022722 9434 acceptor_pool.cc:254] collecting diagnostics on the listening RPC socket unix:/tmp/dist-test-taskbUq2ts/test-tmp/rpc-test-efedccea6af94df495d17f4f642f83ea.sock every 8 connection(s)
[ OK ] Parameters/TestRpc.TestRpcContextClientDeadline/SSL_UnixSocket (57 ms)
[ RUN ] Parameters/TestRpc.TestApplicationFeatureFlagUnsupportedServer/SSL_UnixSocket
I20260924 12:47:56.098330 9458 acceptor_pool.cc:254] collecting diagnostics on the listening RPC socket unix:/tmp/dist-test-taskbUq2ts/test-tmp/rpc-test-499218317e844244802ba23bb4535578.sock every 8 connection(s)
I20260924 12:47:56.098574 9459 acceptor_pool.cc:254] collecting diagnostics on the listening RPC socket unix:/tmp/dist-test-taskbUq2ts/test-tmp/rpc-test-499218317e844244802ba23bb4535578.sock every 8 connection(s)
W20260924 12:47:56.119529 9455 connection.cc:196] Error closing socket: Network error: TlsSocket::Close: Broken pipe
[ OK ] Parameters/TestRpc.TestApplicationFeatureFlagUnsupportedServer/SSL_UnixSocket (53 ms)
[ RUN ] Parameters/TestRpc.TestCancellationAsync/SSL_UnixSocket
I20260924 12:47:56.151587 9483 acceptor_pool.cc:254] collecting diagnostics on the listening RPC socket unix:/tmp/dist-test-taskbUq2ts/test-tmp/rpc-test-57829cae357f4b7090ac44e745154ee5.sock every 8 connection(s)
I20260924 12:47:56.151839 9484 acceptor_pool.cc:254] collecting diagnostics on the listening RPC socket unix:/tmp/dist-test-taskbUq2ts/test-tmp/rpc-test-57829cae357f4b7090ac44e745154ee5.sock every 8 connection(s)
I20260924 12:47:56.152832 9051 rpc-test.cc:1716] Connecting to unix:/tmp/dist-test-taskbUq2ts/test-tmp/rpc-test-57829cae357f4b7090ac44e745154ee5.sock
I20260924 12:47:56.174983 9051 test_util.cc:268] Using random seed: 38052466
I20260924 12:47:56.212452 9487 rpc-test-base.h:240] got call: sleep_micros: 500 pattern: 4294967295 num_repetitions: 2097152 sidecar_idx: 0
I20260924 12:47:56.233719 9486 rpc-test-base.h:240] got call: sleep_micros: 500 pattern: 4294967295 num_repetitions: 2097152 sidecar_idx: 0
I20260924 12:47:56.264122 9485 rpc-test-base.h:240] got call: sleep_micros: 500 pattern: 4294967295 num_repetitions: 2097152 sidecar_idx: 0
I20260924 12:47:56.296226 9487 rpc-test-base.h:240] got call: sleep_micros: 500 pattern: 4294967295 num_repetitions: 2097152 sidecar_idx: 0
I20260924 12:47:56.329216 9485 rpc-test-base.h:240] got call: sleep_micros: 500 pattern: 4294967295 num_repetitions: 2097152 sidecar_idx: 0
I20260924 12:47:56.358044 9487 rpc-test-base.h:240] got call: sleep_micros: 500 pattern: 4294967295 num_repetitions: 2097152 sidecar_idx: 0
I20260924 12:47:56.387773 9485 rpc-test-base.h:240] got call: sleep_micros: 500 pattern: 4294967295 num_repetitions: 2097152 sidecar_idx: 0
W20260924 12:47:56.390372 9480 connection.cc:196] Error closing socket: Network error: TlsSocket::Close: Broken pipe
W20260924 12:47:56.405997 9480 connection.cc:441] server connection from unix:<unnamed> torn down before Call kudu.rpc.GenericCalculatorService.SleepWithSidecar from unix:<unnamed> (request call id 8) could send its response
W20260924 12:47:56.425379 9480 connection.cc:441] server connection from unix:<unnamed> torn down before Call kudu.rpc.GenericCalculatorService.SleepWithSidecar from unix:<unnamed> (request call id 9) could send its response
[ OK ] Parameters/TestRpc.TestCancellationAsync/SSL_UnixSocket (305 ms)
[ RUN ] Parameters/TestRpc.TestPerformanceBySocketType/SSL_UnixSocket
I20260924 12:47:56.450495 9508 acceptor_pool.cc:254] collecting diagnostics on the listening RPC socket unix:/tmp/dist-test-taskbUq2ts/test-tmp/rpc-test-3d2c91032f6a455791ded0ed7e9421f4.sock every 8 connection(s)
I20260924 12:47:56.450733 9509 acceptor_pool.cc:254] collecting diagnostics on the listening RPC socket unix:/tmp/dist-test-taskbUq2ts/test-tmp/rpc-test-3d2c91032f6a455791ded0ed7e9421f4.sock every 8 connection(s)
I20260924 12:47:56.451666 9051 rpc-test.cc:1846] Connecting to unix:/tmp/dist-test-taskbUq2ts/test-tmp/rpc-test-3d2c91032f6a455791ded0ed7e9421f4.sock
I20260924 12:47:59.791901 9051 rpc-test.cc:1859] Sending 1024MB via ssl-enabled unix socket: real 3.317s user 3.363s sys 2.242s
I20260924 12:48:03.045323 9051 rpc-test.cc:1859] Sending 1024MB via ssl-enabled unix socket: real 3.253s user 3.193s sys 2.285s
I20260924 12:48:06.252759 9051 rpc-test.cc:1859] Sending 1024MB via ssl-enabled unix socket: real 3.207s user 3.202s sys 2.225s
I20260924 12:48:09.262102 9051 rpc-test.cc:1859] Sending 1024MB via ssl-enabled unix socket: real 3.009s user 2.833s sys 2.243s
I20260924 12:48:12.294298 9051 rpc-test.cc:1859] Sending 1024MB via ssl-enabled unix socket: real 3.032s user 2.947s sys 2.172s
[ OK ] Parameters/TestRpc.TestPerformanceBySocketType/SSL_UnixSocket (15873 ms)
[----------] 20 tests from Parameters/TestRpc (51170 ms total)
[----------] 1 test from Parameters/TestRpcSocketTxRxQueue
[ RUN ] Parameters/TestRpcSocketTxRxQueue.AcceptorRxQueueSizeMetric/0
I20260924 12:48:12.307708 9533 acceptor_pool.cc:254] collecting diagnostics on the listening RPC socket 0.0.0.0:37281 every 1 connection(s)
I20260924 12:48:12.307905 9534 acceptor_pool.cc:254] collecting diagnostics on the listening RPC socket 0.0.0.0:37281 every 1 connection(s)
W20260924 12:48:12.309552 9529 negotiation.cc:337] Failed RPC negotiation. Trace:
0924 12:48:12.309171 (+ 0us) reactor.cc:625] Submitting negotiation task for server connection from 127.0.0.1:45190 (local address 127.0.0.1:37281)
0924 12:48:12.309314 (+ 143us) server_negotiation.cc:206] Beginning negotiation
0924 12:48:12.309319 (+ 5us) server_negotiation.cc:399] Waiting for connection header
0924 12:48:12.309445 (+ 126us) negotiation.cc:327] Negotiation complete: Network error: Server connection negotiation failed: server connection from 127.0.0.1:45190: BlockingRecv error: recv got EOF from 127.0.0.1:45190 (error 108)
Metrics: {"server-negotiator.queue_time_us":45}
[ OK ] Parameters/TestRpcSocketTxRxQueue.AcceptorRxQueueSizeMetric/0 (9 ms)
[----------] 1 test from Parameters/TestRpcSocketTxRxQueue (9 ms total)
[----------] Global test environment tear-down
[==========] 21 tests from 2 test suites ran. (51180 ms total)
[ PASSED ] 20 tests.
[ FAILED ] 1 test, listed below:
[ FAILED ] Parameters/TestRpc.TestCallWithChainCertAndChainCA/SSL_UnixSocket, where GetParam() = (true, true)
1 FAILED TEST