Diagnosed failure
Parameters/TestRpc.TestCallWithChainCertAndChainCA/SSL_TCP: /data0/somelongdirectorytoavoidrpathissues/src/kudu/src/kudu/rpc/rpc-test.cc:270: Failure
Failed
Bad status: Runtime error: could not verify certificate chain (error with cert: subject=CN = localhost, ST = sadfjas, C = AS, emailAddress = sdflkdsajf, O = lskdfjlsad, OU = sldfkja, issuer=C = AS, ST = ASDfkjdhf, L = lskdjf, O = saldfja, OU = skdjf, CN = localhost, emailAddress = sadjflkadsj): : certificate has expired
Google Test trace:
/data0/somelongdirectorytoavoidrpathissues/src/kudu/src/kudu/rpc/rpc-test.cc:267: Connecting to 0.0.0.0:38945
I20260928 21:46:40.399750 379 test_util.cc:175] -----------------------------------------------
I20260928 21:46:40.399829 379 test_util.cc:176] Had fatal failures, leaving test files at /tmp/dist-test-taskcVlxId/test-tmp/rpc-test.5.Parameters_TestRpc.TestCallWithChainCertAndChainCA_SSL_TCP.1790632000286956-379-0
Full log
Note: This is test shard 6 of 8.
[==========] Running 21 tests from 2 test suites.
[----------] Global test environment set-up.
[----------] 20 tests from Parameters/TestRpc
[ RUN ] Parameters/TestRpc.TestMessengerCreateDestroy/SSL_TCP
WARNING: Logging before InitGoogleLogging() is written to STDERR
I20260928 21:46:40.339794 379 rpc-test.cc:169] started messenger TestCreateDestroy
[ OK ] Parameters/TestRpc.TestMessengerCreateDestroy/SSL_TCP (34 ms)
[ RUN ] Parameters/TestRpc.TestNegotiationDeadlock/SSL_TCP
I20260928 21:46:40.355415 399 acceptor_pool.cc:254] collecting diagnostics on the listening RPC socket 0.0.0.0:34639 every 8 connection(s)
I20260928 21:46:40.355734 400 acceptor_pool.cc:254] collecting diagnostics on the listening RPC socket 0.0.0.0:34639 every 8 connection(s)
[ OK ] Parameters/TestRpc.TestNegotiationDeadlock/SSL_TCP (31 ms)
[ RUN ] Parameters/TestRpc.TestCallWithChainCertAndChainCA/SSL_TCP
I20260928 21:46:40.388942 415 acceptor_pool.cc:254] collecting diagnostics on the listening RPC socket 0.0.0.0:38945 every 8 connection(s)
I20260928 21:46:40.389252 416 acceptor_pool.cc:254] collecting diagnostics on the listening RPC socket 0.0.0.0:38945 every 8 connection(s)
/data0/somelongdirectorytoavoidrpathissues/src/kudu/src/kudu/rpc/rpc-test.cc:270: Failure
Failed
Bad status: Runtime error: could not verify certificate chain (error with cert: subject=CN = localhost, ST = sadfjas, C = AS, emailAddress = sdflkdsajf, O = lskdfjlsad, OU = sldfkja, issuer=C = AS, ST = ASDfkjdhf, L = lskdjf, O = saldfja, OU = skdjf, CN = localhost, emailAddress = sadjflkadsj): : certificate has expired
Google Test trace:
/data0/somelongdirectorytoavoidrpathissues/src/kudu/src/kudu/rpc/rpc-test.cc:267: Connecting to 0.0.0.0:38945
I20260928 21:46:40.399750 379 test_util.cc:175] -----------------------------------------------
I20260928 21:46:40.399829 379 test_util.cc:176] Had fatal failures, leaving test files at /tmp/dist-test-taskcVlxId/test-tmp/rpc-test.5.Parameters_TestRpc.TestCallWithChainCertAndChainCA_SSL_TCP.1790632000286956-379-0
[ FAILED ] Parameters/TestRpc.TestCallWithChainCertAndChainCA/SSL_TCP, where GetParam() = (true, false) (25 ms)
[ RUN ] Parameters/TestRpc.TestCallWithPasswordProtectedKey/SSL_TCP
I20260928 21:46:40.408061 440 acceptor_pool.cc:254] collecting diagnostics on the listening RPC socket 0.0.0.0:39589 every 8 connection(s)
I20260928 21:46:40.408298 441 acceptor_pool.cc:254] collecting diagnostics on the listening RPC socket 0.0.0.0:39589 every 8 connection(s)
[ OK ] Parameters/TestRpc.TestCallWithPasswordProtectedKey/SSL_TCP (42 ms)
[ RUN ] Parameters/TestRpc.TestCallToBadServer/SSL_TCP
I20260928 21:46:40.468603 379 rpc-test.cc:394] Status: Network error: Client connection negotiation failed: client connection to 0.0.0.0:0: connect: Connection refused (error 111)
I20260928 21:46:40.469259 379 rpc-test.cc:394] Status: Network error: Client connection negotiation failed: client connection to 0.0.0.0:0: connect: Connection refused (error 111)
I20260928 21:46:40.469887 379 rpc-test.cc:394] Status: Network error: Client connection negotiation failed: client connection to 0.0.0.0:0: connect: Connection refused (error 111)
I20260928 21:46:40.470430 379 rpc-test.cc:394] Status: Network error: Client connection negotiation failed: client connection to 0.0.0.0:0: connect: Connection refused (error 111)
I20260928 21:46:40.470970 379 rpc-test.cc:394] Status: Network error: Client connection negotiation failed: client connection to 0.0.0.0:0: connect: Connection refused (error 111)
[ OK ] Parameters/TestRpc.TestCallToBadServer/SSL_TCP (30 ms)
[ RUN ] Parameters/TestRpc.TestWrongService/SSL_TCP
I20260928 21:46:40.491554 475 acceptor_pool.cc:254] collecting diagnostics on the listening RPC socket 0.0.0.0:34137 every 8 connection(s)
I20260928 21:46:40.491806 476 acceptor_pool.cc:254] collecting diagnostics on the listening RPC socket 0.0.0.0:34137 every 8 connection(s)
I20260928 21:46:40.522596 473 messenger.cc:345] service WrongServiceName not registered on TestServer
[ OK ] Parameters/TestRpc.TestWrongService/SSL_TCP (54 ms)
[ RUN ] Parameters/TestRpc.TestConnectionKeepalive/SSL_TCP
I20260928 21:46:40.541066 498 acceptor_pool.cc:254] collecting diagnostics on the listening RPC socket 0.0.0.0:43637 every 8 connection(s)
I20260928 21:46:40.541340 499 acceptor_pool.cc:254] collecting diagnostics on the listening RPC socket 0.0.0.0:43637 every 8 connection(s)
I20260928 21:46:40.542213 379 rpc-test.cc:488] Connecting to 0.0.0.0:43637
[ OK ] Parameters/TestRpc.TestConnectionKeepalive/SSL_TCP (1043 ms)
[ RUN ] Parameters/TestRpc.TestClientConnectionMetrics/SSL_TCP
I20260928 21:46:41.582873 523 acceptor_pool.cc:254] collecting diagnostics on the listening RPC socket 0.0.0.0:33419 every 8 connection(s)
I20260928 21:46:41.583089 524 acceptor_pool.cc:254] collecting diagnostics on the listening RPC socket 0.0.0.0:33419 every 8 connection(s)
I20260928 21:46:41.583969 379 rpc-test.cc:569] Connecting to 0.0.0.0:33419
[ OK ] Parameters/TestRpc.TestClientConnectionMetrics/SSL_TCP (19962 ms)
[ RUN ] Parameters/TestRpc.TestCredentialsPolicy/SSL_TCP
I20260928 21:47:01.551049 546 acceptor_pool.cc:254] collecting diagnostics on the listening RPC socket 0.0.0.0:36643 every 8 connection(s)
I20260928 21:47:01.551362 547 acceptor_pool.cc:254] collecting diagnostics on the listening RPC socket 0.0.0.0:36643 every 8 connection(s)
I20260928 21:47:01.552337 379 rpc-test.cc:700] Connecting to 0.0.0.0:36643
[ OK ] Parameters/TestRpc.TestCredentialsPolicy/SSL_TCP (45 ms)
[ RUN ] Parameters/TestRpc.TestCallLongerThanKeepalive/SSL_TCP
I20260928 21:47:01.623821 571 acceptor_pool.cc:254] collecting diagnostics on the listening RPC socket 0.0.0.0:41459 every 8 connection(s)
I20260928 21:47:01.624039 572 acceptor_pool.cc:254] collecting diagnostics on the listening RPC socket 0.0.0.0:41459 every 8 connection(s)
I20260928 21:47:01.641788 575 rpc-test-base.h:222] got call: sleep_micros: 3000000 deferred: true
I20260928 21:47:04.643442 575 rpcz_store.cc:275] Call kudu.rpc.GenericCalculatorService.Sleep from 127.0.0.1:48882 (request call id 0) took 3001 ms. Trace:
I20260928 21:47:04.643607 575 rpcz_store.cc:276] 0928 21:47:01.641678 (+ 0us) service_pool.cc:170] Inserting onto call queue
0928 21:47:01.641742 (+ 64us) service_pool.cc:227] Handling call
0928 21:47:04.643391 (+3001649us) inbound_call.cc:173] Queueing success response
Metrics: {}
[ OK ] Parameters/TestRpc.TestCallLongerThanKeepalive/SSL_TCP (3069 ms)
[ RUN ] Parameters/TestRpc.TestRpcSidecar/SSL_TCP
I20260928 21:47:04.673780 596 acceptor_pool.cc:254] collecting diagnostics on the listening RPC socket 0.0.0.0:35621 every 8 connection(s)
I20260928 21:47:04.674057 597 acceptor_pool.cc:254] collecting diagnostics on the listening RPC socket 0.0.0.0:35621 every 8 connection(s)
[ OK ] Parameters/TestRpc.TestRpcSidecar/SSL_TCP (120 ms)
[ RUN ] Parameters/TestRpc.TestRpcSidecarLimits/SSL_TCP
I20260928 21:47:06.900619 621 acceptor_pool.cc:254] collecting diagnostics on the listening RPC socket 0.0.0.0:42819 every 8 connection(s)
I20260928 21:47:06.900913 622 acceptor_pool.cc:254] collecting diagnostics on the listening RPC socket 0.0.0.0:42819 every 8 connection(s)
W20260928 21:47:06.911293 379 serialization.cc:72] Serialized kudu.rpc_test.PushStringsRequestPB (2147483654 bytes) is larger than the maximum configured RPC message size (52428800 bytes). Sending anyway, but peer may reject the data.
W20260928 21:47:06.917569 620 connection.cc:535] server connection from 127.0.0.1:60982 recv error: Network error: RPC frame had a length of 2147483714, but we only support messages up to 52428800 bytes long.
W20260928 21:47:06.917716 620 connection.cc:158] shutting down server connection from 127.0.0.1:60982 with pending inbound data: 4/2147483714 bytes received; last active 0 ns ago: status Network error: RPC frame had a length of 2147483714, but we only support messages up to 52428800 bytes long.
W20260928 21:47:06.918201 634 connection.cc:196] Error closing socket: Network error: TlsSocket::Close: Connection reset by peer
I20260928 21:47:06.942548 646 acceptor_pool.cc:254] collecting diagnostics on the listening RPC socket 0.0.0.0:34459 every 8 connection(s)
I20260928 21:47:06.942827 647 acceptor_pool.cc:254] collecting diagnostics on the listening RPC socket 0.0.0.0:34459 every 8 connection(s)
W20260928 21:47:12.270840 644 connection.cc:577] server connection from 127.0.0.1:43008: received bad data: 'Corruption: Invalid packet: message had a length of 2147483710, but we only support messages up to 2147483647 bytes
'
[ OK ] Parameters/TestRpc.TestRpcSidecarLimits/SSL_TCP (7954 ms)
[ RUN ] Parameters/TestRpc.TestCallTimeoutDoesntAffectNegotiation/SSL_TCP
I20260928 21:47:12.757215 671 acceptor_pool.cc:254] collecting diagnostics on the listening RPC socket 0.0.0.0:46213 every 8 connection(s)
I20260928 21:47:12.757516 672 acceptor_pool.cc:254] collecting diagnostics on the listening RPC socket 0.0.0.0:46213 every 8 connection(s)
W20260928 21:47:12.773734 667 negotiation.cc:266] Injecting 500ms delay in negotiation
I20260928 21:47:12.824250 379 rpc-test-base.h:595] status: Timed out: connection negotiation to 0.0.0.0:46213 for RPC Sleep timed out after 0.050s (ON_OUTBOUND_QUEUE), seconds elapsed: 0.0511974
[ OK ] Parameters/TestRpc.TestCallTimeoutDoesntAffectNegotiation/SSL_TCP (560 ms)
[ RUN ] Parameters/TestRpc.TestRpcHandlerLatencyMetric/SSL_TCP
I20260928 21:47:13.296442 696 acceptor_pool.cc:254] collecting diagnostics on the listening RPC socket 0.0.0.0:37043 every 8 connection(s)
I20260928 21:47:13.296654 697 acceptor_pool.cc:254] collecting diagnostics on the listening RPC socket 0.0.0.0:37043 every 8 connection(s)
I20260928 21:47:13.342526 379 rpc-test.cc:1236] Sleep() min lat: 20699
I20260928 21:47:13.342613 379 rpc-test.cc:1237] Sleep() mean lat: 20699
I20260928 21:47:13.342651 379 rpc-test.cc:1238] Sleep() max lat: 20699
I20260928 21:47:13.342669 379 rpc-test.cc:1239] Sleep() #calls: 1
[ OK ] Parameters/TestRpc.TestRpcHandlerLatencyMetric/SSL_TCP (62 ms)
[ RUN ] Parameters/TestRpc.TimedOutOnResponseMetricServiceQueue/SSL_TCP
I20260928 21:47:13.376909 722 acceptor_pool.cc:254] collecting diagnostics on the listening RPC socket 0.0.0.0:35323 every 8 connection(s)
I20260928 21:47:13.377138 723 acceptor_pool.cc:254] collecting diagnostics on the listening RPC socket 0.0.0.0:35323 every 8 connection(s)
W20260928 21:47:13.451099 724 rpcz_store.cc:267] Call kudu.rpc_test.CalculatorService.Sleep from 127.0.0.1:35580 (request call id 2) took 20 ms (client timeout 20 ms). Trace:
W20260928 21:47:13.451295 724 rpcz_store.cc:269] 0928 21:47:13.430764 (+ 0us) service_pool.cc:170] Inserting onto call queue
0928 21:47:13.451042 (+ 20278us) service_pool.cc:214] Skipping call since client already timed out
0928 21:47:13.451082 (+ 40us) inbound_call.cc:173] Queueing failure response
Metrics: {}
[ OK ] Parameters/TestRpc.TimedOutOnResponseMetricServiceQueue/SSL_TCP (107 ms)
[ RUN ] Parameters/TestRpc.RpcPendingConnectionsMetric/SSL_TCP
I20260928 21:47:13.459934 745 acceptor_pool.cc:254] collecting diagnostics on the listening RPC socket 0.0.0.0:44645 every 8 connection(s)
I20260928 21:47:13.460180 746 acceptor_pool.cc:254] collecting diagnostics on the listening RPC socket 0.0.0.0:44645 every 8 connection(s)
W20260928 21:47:13.470899 741 negotiation.cc:337] Failed RPC negotiation. Trace:
0928 21:47:13.469971 (+ 0us) reactor.cc:625] Submitting negotiation task for server connection from 127.0.0.1:34154 (local address 127.0.0.1:44645)
0928 21:47:13.470216 (+ 245us) server_negotiation.cc:206] Beginning negotiation
0928 21:47:13.470225 (+ 9us) server_negotiation.cc:399] Waiting for connection header
0928 21:47:13.470456 (+ 231us) negotiation.cc:327] Negotiation complete: Network error: Server connection negotiation failed: server connection from 127.0.0.1:34154: BlockingRecv error: recv got EOF from 127.0.0.1:34154 (error 108)
Metrics: {"server-negotiator.queue_time_us":63}
[ OK ] Parameters/TestRpc.RpcPendingConnectionsMetric/SSL_TCP (28 ms)
[ RUN ] Parameters/TestRpc.TestRpcContextClientDeadline/SSL_TCP
I20260928 21:47:13.498726 761 acceptor_pool.cc:254] collecting diagnostics on the listening RPC socket 0.0.0.0:40487 every 8 connection(s)
I20260928 21:47:13.498965 762 acceptor_pool.cc:254] collecting diagnostics on the listening RPC socket 0.0.0.0:40487 every 8 connection(s)
[ OK ] Parameters/TestRpc.TestRpcContextClientDeadline/SSL_TCP (57 ms)
[ RUN ] Parameters/TestRpc.TestApplicationFeatureFlagUnsupportedServer/SSL_TCP
I20260928 21:47:13.559732 786 acceptor_pool.cc:254] collecting diagnostics on the listening RPC socket 0.0.0.0:35921 every 8 connection(s)
I20260928 21:47:13.559983 787 acceptor_pool.cc:254] collecting diagnostics on the listening RPC socket 0.0.0.0:35921 every 8 connection(s)
[ OK ] Parameters/TestRpc.TestApplicationFeatureFlagUnsupportedServer/SSL_TCP (50 ms)
[ RUN ] Parameters/TestRpc.TestCancellationAsync/SSL_TCP
I20260928 21:47:13.607590 811 acceptor_pool.cc:254] collecting diagnostics on the listening RPC socket 0.0.0.0:41455 every 8 connection(s)
I20260928 21:47:13.607831 812 acceptor_pool.cc:254] collecting diagnostics on the listening RPC socket 0.0.0.0:41455 every 8 connection(s)
I20260928 21:47:13.608672 379 rpc-test.cc:1716] Connecting to 0.0.0.0:41455
I20260928 21:47:13.628778 379 test_util.cc:268] Using random seed: 38384202
I20260928 21:47:13.663125 815 rpc-test-base.h:240] got call: sleep_micros: 500 pattern: 4294967295 num_repetitions: 2097152 sidecar_idx: 0
I20260928 21:47:13.683005 814 rpc-test-base.h:240] got call: sleep_micros: 500 pattern: 4294967295 num_repetitions: 2097152 sidecar_idx: 0
I20260928 21:47:13.707828 813 rpc-test-base.h:240] got call: sleep_micros: 500 pattern: 4294967295 num_repetitions: 2097152 sidecar_idx: 0
I20260928 21:47:13.736578 815 rpc-test-base.h:240] got call: sleep_micros: 500 pattern: 4294967295 num_repetitions: 2097152 sidecar_idx: 0
I20260928 21:47:13.762439 814 rpc-test-base.h:240] got call: sleep_micros: 500 pattern: 4294967295 num_repetitions: 2097152 sidecar_idx: 0
I20260928 21:47:13.794617 813 rpc-test-base.h:240] got call: sleep_micros: 500 pattern: 4294967295 num_repetitions: 2097152 sidecar_idx: 0
W20260928 21:47:13.819744 810 connection.cc:698] server connection from 127.0.0.1:38064 send error: Network error: failed to write to TLS socket: Broken pipe
W20260928 21:47:13.819911 810 connection.cc:441] server connection from 127.0.0.1:38064 torn down before Call kudu.rpc.GenericCalculatorService.SleepWithSidecar from 127.0.0.1:38064 (request call id 9) could send its response
W20260928 21:47:13.820286 810 connection.cc:196] Error closing socket: Network error: TlsSocket::Close: Success
W20260928 21:47:13.822969 810 connection.cc:441] server connection from 127.0.0.1:38064 torn down before Call kudu.rpc.GenericCalculatorService.SleepWithSidecar from 127.0.0.1:38064 (request call id 7) could send its response
W20260928 21:47:13.835305 810 connection.cc:441] server connection from 127.0.0.1:38064 torn down before Call kudu.rpc.GenericCalculatorService.SleepWithSidecar from 127.0.0.1:38064 (request call id 8) could send its response
[ OK ] Parameters/TestRpc.TestCancellationAsync/SSL_TCP (246 ms)
[ RUN ] Parameters/TestRpc.TestPerformanceBySocketType/SSL_TCP
I20260928 21:47:13.858600 836 acceptor_pool.cc:254] collecting diagnostics on the listening RPC socket 0.0.0.0:34251 every 8 connection(s)
I20260928 21:47:13.858841 837 acceptor_pool.cc:254] collecting diagnostics on the listening RPC socket 0.0.0.0:34251 every 8 connection(s)
I20260928 21:47:13.859707 379 rpc-test.cc:1846] Connecting to 0.0.0.0:34251
I20260928 21:47:16.785989 379 rpc-test.cc:1859] Sending 1024MB via ssl-enabled tcp socket: real 2.908s user 2.699s sys 2.142s
I20260928 21:47:19.648358 379 rpc-test.cc:1859] Sending 1024MB via ssl-enabled tcp socket: real 2.862s user 2.565s sys 2.173s
I20260928 21:47:22.524986 379 rpc-test.cc:1859] Sending 1024MB via ssl-enabled tcp socket: real 2.877s user 2.575s sys 2.176s
I20260928 21:47:25.392876 379 rpc-test.cc:1859] Sending 1024MB via ssl-enabled tcp socket: real 2.868s user 2.526s sys 2.199s
I20260928 21:47:28.286605 379 rpc-test.cc:1859] Sending 1024MB via ssl-enabled tcp socket: real 2.894s user 2.720s sys 2.054s
[ OK ] Parameters/TestRpc.TestPerformanceBySocketType/SSL_TCP (14454 ms)
[----------] 20 tests from Parameters/TestRpc (47984 ms total)
[----------] 1 test from Parameters/TestRpcSocketTxRxQueue
[ RUN ] Parameters/TestRpcSocketTxRxQueue.OverCapacity/0
W20260928 21:47:28.586874 871 negotiation.cc:337] Failed RPC negotiation. Trace:
0928 21:47:28.302278 (+ 0us) reactor.cc:625] Submitting negotiation task for client connection to 0.0.0.0:45189 (local address 127.0.0.1:53018)
0928 21:47:28.302442 (+ 164us) negotiation.cc:107] Waiting for socket to connect
0928 21:47:28.302457 (+ 15us) client_negotiation.cc:174] Beginning negotiation
0928 21:47:28.302551 (+ 94us) client_negotiation.cc:252] Sending NEGOTIATE NegotiatePB request
0928 21:47:28.586607 (+284056us) negotiation.cc:327] Negotiation complete: Network error: Client connection negotiation failed: client connection to 0.0.0.0:45189: BlockingRecv error: recv error from unknown peer: Transport endpoint is not connected (error 107)
Metrics: {"client-negotiator.queue_time_us":56}
W20260928 21:47:28.586826 862 negotiation.cc:337] Failed RPC negotiation. Trace:
0928 21:47:28.299962 (+ 0us) reactor.cc:625] Submitting negotiation task for client connection to 0.0.0.0:45189 (local address 127.0.0.1:53010)
0928 21:47:28.300094 (+ 132us) negotiation.cc:107] Waiting for socket to connect
0928 21:47:28.300110 (+ 16us) client_negotiation.cc:174] Beginning negotiation
0928 21:47:28.300203 (+ 93us) client_negotiation.cc:252] Sending NEGOTIATE NegotiatePB request
0928 21:47:28.586542 (+286339us) negotiation.cc:327] Negotiation complete: Network error: Client connection negotiation failed: client connection to 0.0.0.0:45189: BlockingRecv error: recv error from unknown peer: Transport endpoint is not connected (error 107)
Metrics: {"client-negotiator.queue_time_us":30}
W20260928 21:47:28.587289 898 negotiation.cc:337] Failed RPC negotiation. Trace:
0928 21:47:28.309729 (+ 0us) reactor.cc:625] Submitting negotiation task for client connection to 0.0.0.0:45189 (local address 127.0.0.1:53050)
0928 21:47:28.309867 (+ 138us) negotiation.cc:107] Waiting for socket to connect
0928 21:47:28.309881 (+ 14us) client_negotiation.cc:174] Beginning negotiation
0928 21:47:28.309952 (+ 71us) client_negotiation.cc:252] Sending NEGOTIATE NegotiatePB request
0928 21:47:28.586695 (+276743us) negotiation.cc:327] Negotiation complete: Network error: Client connection negotiation failed: client connection to 0.0.0.0:45189: BlockingRecv error: recv error from unknown peer: Transport endpoint is not connected (error 107)
Metrics: {"client-negotiator.queue_time_us":52}
W20260928 21:47:28.586812 853 negotiation.cc:337] Failed RPC negotiation. Trace:
0928 21:47:28.297154 (+ 0us) reactor.cc:625] Submitting negotiation task for client connection to 0.0.0.0:45189 (local address 127.0.0.1:53004)
0928 21:47:28.297389 (+ 235us) negotiation.cc:107] Waiting for socket to connect
0928 21:47:28.297406 (+ 17us) client_negotiation.cc:174] Beginning negotiation
0928 21:47:28.297530 (+ 124us) client_negotiation.cc:252] Sending NEGOTIATE NegotiatePB request
0928 21:47:28.586429 (+288899us) negotiation.cc:327] Negotiation complete: Network error: Client connection negotiation failed: client connection to 0.0.0.0:45189: BlockingRecv error: recv error from unknown peer: Transport endpoint is not connected (error 107)
Metrics: {"client-negotiator.queue_time_us":64}
W20260928 21:47:28.587700 880 negotiation.cc:337] Failed RPC negotiation. Trace:
0928 21:47:28.304698 (+ 0us) reactor.cc:625] Submitting negotiation task for client connection to 0.0.0.0:45189 (local address 127.0.0.1:53028)
0928 21:47:28.304849 (+ 151us) negotiation.cc:107] Waiting for socket to connect
0928 21:47:28.304863 (+ 14us) client_negotiation.cc:174] Beginning negotiation
0928 21:47:28.304954 (+ 91us) client_negotiation.cc:252] Sending NEGOTIATE NegotiatePB request
0928 21:47:28.586450 (+281496us) negotiation.cc:327] Negotiation complete: Network error: Client connection negotiation failed: client connection to 0.0.0.0:45189: BlockingRecv error: recv error from unknown peer: Transport endpoint is not connected (error 107)
Metrics: {"client-negotiator.queue_time_us":51}
W20260928 21:47:28.591969 889 negotiation.cc:337] Failed RPC negotiation. Trace:
0928 21:47:28.307065 (+ 0us) reactor.cc:625] Submitting negotiation task for client connection to 0.0.0.0:45189 (local address 127.0.0.1:53040)
0928 21:47:28.307215 (+ 150us) negotiation.cc:107] Waiting for socket to connect
0928 21:47:28.307232 (+ 17us) client_negotiation.cc:174] Beginning negotiation
0928 21:47:28.307328 (+ 96us) client_negotiation.cc:252] Sending NEGOTIATE NegotiatePB request
0928 21:47:28.587093 (+279765us) negotiation.cc:327] Negotiation complete: Network error: Client connection negotiation failed: client connection to 0.0.0.0:45189: BlockingRecv error: recv error from unknown peer: Transport endpoint is not connected (error 107)
Metrics: {"client-negotiator.queue_time_us":31}
[ OK ] Parameters/TestRpcSocketTxRxQueue.OverCapacity/0 (1060 ms)
[----------] 1 test from Parameters/TestRpcSocketTxRxQueue (1061 ms total)
[----------] Global test environment tear-down
[==========] 21 tests from 2 test suites ran. (49045 ms total)
[ PASSED ] 20 tests.
[ FAILED ] 1 test, listed below:
[ FAILED ] Parameters/TestRpc.TestCallWithChainCertAndChainCA/SSL_TCP, where GetParam() = (true, false)
1 FAILED TEST