Diagnosed failure

Parameters/TestRpc.TestCallWithChainCertAndChainCA/SSL_TCP: /data0/somelongdirectorytoavoidrpathissues/src/kudu/src/kudu/rpc/rpc-test.cc:270: Failure
Failed
Bad status: Runtime error: could not verify certificate chain (error with cert: subject=CN = localhost, ST = sadfjas, C = AS, emailAddress = sdflkdsajf, O = lskdfjlsad, OU = sldfkja, issuer=C = AS, ST = ASDfkjdhf, L = lskdjf, O = saldfja, OU = skdjf, CN = localhost, emailAddress = sadjflkadsj): : certificate has expired
Google Test trace:
/data0/somelongdirectorytoavoidrpathissues/src/kudu/src/kudu/rpc/rpc-test.cc:267: Connecting to 0.0.0.0:42127
I20260925 02:23:38.310401 24718 test_util.cc:175] -----------------------------------------------
I20260925 02:23:38.310460 24718 test_util.cc:176] Had fatal failures, leaving test files at /tmp/dist-test-taskMYBaU7/test-tmp/rpc-test.5.Parameters_TestRpc.TestCallWithChainCertAndChainCA_SSL_TCP.1790303018240986-24718-0

Full log

Note: This is test shard 6 of 8.
[==========] Running 21 tests from 2 test suites.
[----------] Global test environment set-up.
[----------] 20 tests from Parameters/TestRpc
[ RUN      ] Parameters/TestRpc.TestMessengerCreateDestroy/SSL_TCP
WARNING: Logging before InitGoogleLogging() is written to STDERR
I20260925 02:23:38.271850 24718 rpc-test.cc:169] started messenger TestCreateDestroy
[       OK ] Parameters/TestRpc.TestMessengerCreateDestroy/SSL_TCP (34 ms)
[ RUN      ] Parameters/TestRpc.TestNegotiationDeadlock/SSL_TCP
I20260925 02:23:38.287827 24738 acceptor_pool.cc:254] collecting diagnostics on the listening RPC socket 0.0.0.0:43613 every 8 connection(s)
I20260925 02:23:38.287849 24739 acceptor_pool.cc:254] collecting diagnostics on the listening RPC socket 0.0.0.0:43613 every 8 connection(s)
[       OK ] Parameters/TestRpc.TestNegotiationDeadlock/SSL_TCP (18 ms)
[ RUN      ] Parameters/TestRpc.TestCallWithChainCertAndChainCA/SSL_TCP
I20260925 02:23:38.305274 24754 acceptor_pool.cc:254] collecting diagnostics on the listening RPC socket 0.0.0.0:42127 every 8 connection(s)
I20260925 02:23:38.305423 24755 acceptor_pool.cc:254] collecting diagnostics on the listening RPC socket 0.0.0.0:42127 every 8 connection(s)
/data0/somelongdirectorytoavoidrpathissues/src/kudu/src/kudu/rpc/rpc-test.cc:270: Failure
Failed
Bad status: Runtime error: could not verify certificate chain (error with cert: subject=CN = localhost, ST = sadfjas, C = AS, emailAddress = sdflkdsajf, O = lskdfjlsad, OU = sldfkja, issuer=C = AS, ST = ASDfkjdhf, L = lskdjf, O = saldfja, OU = skdjf, CN = localhost, emailAddress = sadjflkadsj): : certificate has expired
Google Test trace:
/data0/somelongdirectorytoavoidrpathissues/src/kudu/src/kudu/rpc/rpc-test.cc:267: Connecting to 0.0.0.0:42127
I20260925 02:23:38.310401 24718 test_util.cc:175] -----------------------------------------------
I20260925 02:23:38.310460 24718 test_util.cc:176] Had fatal failures, leaving test files at /tmp/dist-test-taskMYBaU7/test-tmp/rpc-test.5.Parameters_TestRpc.TestCallWithChainCertAndChainCA_SSL_TCP.1790303018240986-24718-0
[  FAILED  ] Parameters/TestRpc.TestCallWithChainCertAndChainCA/SSL_TCP, where GetParam() = (true, false) (13 ms)
[ RUN      ] Parameters/TestRpc.TestCallWithPasswordProtectedKey/SSL_TCP
I20260925 02:23:38.324122 24780 acceptor_pool.cc:254] collecting diagnostics on the listening RPC socket 0.0.0.0:45263 every 8 connection(s)
I20260925 02:23:38.324189 24781 acceptor_pool.cc:254] collecting diagnostics on the listening RPC socket 0.0.0.0:45263 every 8 connection(s)
[       OK ] Parameters/TestRpc.TestCallWithPasswordProtectedKey/SSL_TCP (28 ms)
[ RUN      ] Parameters/TestRpc.TestCallToBadServer/SSL_TCP
I20260925 02:23:38.361554 24718 rpc-test.cc:394] Status: Network error: Client connection negotiation failed: client connection to 0.0.0.0:0: connect: Connection refused (error 111)
I20260925 02:23:38.362241 24718 rpc-test.cc:394] Status: Network error: Client connection negotiation failed: client connection to 0.0.0.0:0: connect: Connection refused (error 111)
I20260925 02:23:38.362720 24718 rpc-test.cc:394] Status: Network error: Client connection negotiation failed: client connection to 0.0.0.0:0: connect: Connection refused (error 111)
I20260925 02:23:38.363178 24718 rpc-test.cc:394] Status: Network error: Client connection negotiation failed: client connection to 0.0.0.0:0: connect: Connection refused (error 111)
I20260925 02:23:38.363461 24718 rpc-test.cc:394] Status: Network error: Client connection negotiation failed: client connection to 0.0.0.0:0: connect: Connection refused (error 111)
[       OK ] Parameters/TestRpc.TestCallToBadServer/SSL_TCP (24 ms)
[ RUN      ] Parameters/TestRpc.TestWrongService/SSL_TCP
I20260925 02:23:38.375619 24816 acceptor_pool.cc:254] collecting diagnostics on the listening RPC socket 0.0.0.0:46333 every 8 connection(s)
I20260925 02:23:38.375645 24815 acceptor_pool.cc:254] collecting diagnostics on the listening RPC socket 0.0.0.0:46333 every 8 connection(s)
I20260925 02:23:38.399143 24814 messenger.cc:345] service WrongServiceName not registered on TestServer
[       OK ] Parameters/TestRpc.TestWrongService/SSL_TCP (37 ms)
[ RUN      ] Parameters/TestRpc.TestConnectionKeepalive/SSL_TCP
I20260925 02:23:38.416565 24839 acceptor_pool.cc:254] collecting diagnostics on the listening RPC socket 0.0.0.0:44929 every 8 connection(s)
I20260925 02:23:38.416536 24838 acceptor_pool.cc:254] collecting diagnostics on the listening RPC socket 0.0.0.0:44929 every 8 connection(s)
I20260925 02:23:38.416726 24718 rpc-test.cc:488] Connecting to 0.0.0.0:44929
[       OK ] Parameters/TestRpc.TestConnectionKeepalive/SSL_TCP (1049 ms)
[ RUN      ] Parameters/TestRpc.TestClientConnectionMetrics/SSL_TCP
I20260925 02:23:39.471781 24863 acceptor_pool.cc:254] collecting diagnostics on the listening RPC socket 0.0.0.0:41121 every 8 connection(s)
I20260925 02:23:39.471808 24864 acceptor_pool.cc:254] collecting diagnostics on the listening RPC socket 0.0.0.0:41121 every 8 connection(s)
I20260925 02:23:39.471988 24718 rpc-test.cc:569] Connecting to 0.0.0.0:41121
[       OK ] Parameters/TestRpc.TestClientConnectionMetrics/SSL_TCP (12132 ms)
[ RUN      ] Parameters/TestRpc.TestCredentialsPolicy/SSL_TCP
I20260925 02:23:51.601532 24886 acceptor_pool.cc:254] collecting diagnostics on the listening RPC socket 0.0.0.0:46041 every 8 connection(s)
I20260925 02:23:51.601596 24887 acceptor_pool.cc:254] collecting diagnostics on the listening RPC socket 0.0.0.0:46041 every 8 connection(s)
I20260925 02:23:51.601768 24718 rpc-test.cc:700] Connecting to 0.0.0.0:46041
[       OK ] Parameters/TestRpc.TestCredentialsPolicy/SSL_TCP (49 ms)
[ RUN      ] Parameters/TestRpc.TestCallLongerThanKeepalive/SSL_TCP
I20260925 02:23:51.642310 24912 acceptor_pool.cc:254] collecting diagnostics on the listening RPC socket 0.0.0.0:40733 every 8 connection(s)
I20260925 02:23:51.642328 24913 acceptor_pool.cc:254] collecting diagnostics on the listening RPC socket 0.0.0.0:40733 every 8 connection(s)
I20260925 02:23:51.662952 24915 rpc-test-base.h:222] got call: sleep_micros: 3000000 deferred: true
I20260925 02:23:54.663767 24915 rpcz_store.cc:275] Call kudu.rpc.GenericCalculatorService.Sleep from 127.0.0.1:47816 (request call id 0) took 3000 ms. Trace:
I20260925 02:23:54.663921 24915 rpcz_store.cc:276] 0925 02:23:51.662864 (+     0us) service_pool.cc:170] Inserting onto call queue
0925 02:23:51.662923 (+    59us) service_pool.cc:227] Handling call
0925 02:23:54.663739 (+3000816us) inbound_call.cc:173] Queueing success response
Metrics: {}
[       OK ] Parameters/TestRpc.TestCallLongerThanKeepalive/SSL_TCP (3033 ms)
[ RUN      ] Parameters/TestRpc.TestRpcSidecar/SSL_TCP
I20260925 02:23:54.674914 24937 acceptor_pool.cc:254] collecting diagnostics on the listening RPC socket 0.0.0.0:46267 every 8 connection(s)
I20260925 02:23:54.675169 24938 acceptor_pool.cc:254] collecting diagnostics on the listening RPC socket 0.0.0.0:46267 every 8 connection(s)
[       OK ] Parameters/TestRpc.TestRpcSidecar/SSL_TCP (57 ms)
[ RUN      ] Parameters/TestRpc.TestRpcSidecarLimits/SSL_TCP
I20260925 02:23:56.917183 24962 acceptor_pool.cc:254] collecting diagnostics on the listening RPC socket 0.0.0.0:36309 every 8 connection(s)
I20260925 02:23:56.917183 24963 acceptor_pool.cc:254] collecting diagnostics on the listening RPC socket 0.0.0.0:36309 every 8 connection(s)
W20260925 02:23:56.930111 24718 serialization.cc:72] Serialized kudu.rpc_test.PushStringsRequestPB (2147483654 bytes) is larger than the maximum configured RPC message size (52428800 bytes). Sending anyway, but peer may reject the data.
W20260925 02:23:56.934195 24960 connection.cc:535] server connection from 127.0.0.1:40250 recv error: Network error: RPC frame had a length of 2147483714, but we only support messages up to 52428800 bytes long.
W20260925 02:23:56.934273 24960 connection.cc:158] shutting down server connection from 127.0.0.1:40250 with pending inbound data: 4/2147483714 bytes received; last active 0 ns ago: status Network error: RPC frame had a length of 2147483714, but we only support messages up to 52428800 bytes long.
W20260925 02:23:56.934531 24975 connection.cc:196] Error closing socket: Network error: TlsSocket::Close: Connection reset by peer
I20260925 02:23:56.971596 24987 acceptor_pool.cc:254] collecting diagnostics on the listening RPC socket 0.0.0.0:36021 every 8 connection(s)
I20260925 02:23:56.971624 24988 acceptor_pool.cc:254] collecting diagnostics on the listening RPC socket 0.0.0.0:36021 every 8 connection(s)
W20260925 02:24:02.107134 24986 connection.cc:577] server connection from 127.0.0.1:47256: received bad data: 'Corruption: Invalid packet: message had a length of 2147483710, but we only support messages up to 2147483647 bytes
'
[       OK ] Parameters/TestRpc.TestRpcSidecarLimits/SSL_TCP (7386 ms)
[ RUN      ] Parameters/TestRpc.TestCallTimeoutDoesntAffectNegotiation/SSL_TCP
I20260925 02:24:02.127800 25012 acceptor_pool.cc:254] collecting diagnostics on the listening RPC socket 0.0.0.0:46599 every 8 connection(s)
I20260925 02:24:02.128010 25013 acceptor_pool.cc:254] collecting diagnostics on the listening RPC socket 0.0.0.0:46599 every 8 connection(s)
W20260925 02:24:02.140084 25008 negotiation.cc:266] Injecting 500ms delay in negotiation
I20260925 02:24:02.190349 24718 rpc-test-base.h:595] status: Timed out: connection negotiation to 0.0.0.0:46599 for RPC Sleep timed out after 0.050s (ON_OUTBOUND_QUEUE), seconds elapsed: 0.0506794
[       OK ] Parameters/TestRpc.TestCallTimeoutDoesntAffectNegotiation/SSL_TCP (535 ms)
[ RUN      ] Parameters/TestRpc.TestRpcHandlerLatencyMetric/SSL_TCP
I20260925 02:24:02.653251 25037 acceptor_pool.cc:254] collecting diagnostics on the listening RPC socket 0.0.0.0:35121 every 8 connection(s)
I20260925 02:24:02.653375 25038 acceptor_pool.cc:254] collecting diagnostics on the listening RPC socket 0.0.0.0:35121 every 8 connection(s)
I20260925 02:24:02.691567 24718 rpc-test.cc:1236] Sleep() min lat: 20327
I20260925 02:24:02.691642 24718 rpc-test.cc:1237] Sleep() mean lat: 20327
I20260925 02:24:02.691668 24718 rpc-test.cc:1238] Sleep() max lat: 20327
I20260925 02:24:02.691681 24718 rpc-test.cc:1239] Sleep() #calls: 1
[       OK ] Parameters/TestRpc.TestRpcHandlerLatencyMetric/SSL_TCP (47 ms)
[ RUN      ] Parameters/TestRpc.TimedOutOnResponseMetricServiceQueue/SSL_TCP
I20260925 02:24:02.707466 25064 acceptor_pool.cc:254] collecting diagnostics on the listening RPC socket 0.0.0.0:33475 every 8 connection(s)
I20260925 02:24:02.707492 25065 acceptor_pool.cc:254] collecting diagnostics on the listening RPC socket 0.0.0.0:33475 every 8 connection(s)
W20260925 02:24:02.779572 25066 rpcz_store.cc:267] Call kudu.rpc_test.CalculatorService.Sleep from 127.0.0.1:54264 (request call id 2) took 20 ms (client timeout 20 ms). Trace:
W20260925 02:24:02.779663 25066 rpcz_store.cc:269] 0925 02:24:02.759184 (+     0us) service_pool.cc:170] Inserting onto call queue
0925 02:24:02.779523 (+ 20339us) service_pool.cc:214] Skipping call since client already timed out
0925 02:24:02.779534 (+    11us) inbound_call.cc:173] Queueing failure response
Metrics: {}
[       OK ] Parameters/TestRpc.TimedOutOnResponseMetricServiceQueue/SSL_TCP (88 ms)
[ RUN      ] Parameters/TestRpc.RpcPendingConnectionsMetric/SSL_TCP
I20260925 02:24:02.784176 25088 acceptor_pool.cc:254] collecting diagnostics on the listening RPC socket 0.0.0.0:41329 every 8 connection(s)
I20260925 02:24:02.784332 25089 acceptor_pool.cc:254] collecting diagnostics on the listening RPC socket 0.0.0.0:41329 every 8 connection(s)
W20260925 02:24:02.784822 25083 negotiation.cc:337] Failed RPC negotiation. Trace:
0925 02:24:02.784663 (+     0us) reactor.cc:625] Submitting negotiation task for server connection from 127.0.0.1:38592 (local address 127.0.0.1:41329)
0925 02:24:02.784715 (+    52us) server_negotiation.cc:206] Beginning negotiation
0925 02:24:02.784716 (+     1us) server_negotiation.cc:399] Waiting for connection header
0925 02:24:02.784773 (+    57us) negotiation.cc:327] Negotiation complete: Network error: Server connection negotiation failed: server connection from 127.0.0.1:38592: BlockingRecv error: recv got EOF from 127.0.0.1:38592 (error 108)
Metrics: {"server-negotiator.queue_time_us":16}
[       OK ] Parameters/TestRpc.RpcPendingConnectionsMetric/SSL_TCP (13 ms)
[ RUN      ] Parameters/TestRpc.TestRpcContextClientDeadline/SSL_TCP
I20260925 02:24:02.805675 25104 acceptor_pool.cc:254] collecting diagnostics on the listening RPC socket 0.0.0.0:36139 every 8 connection(s)
I20260925 02:24:02.805706 25105 acceptor_pool.cc:254] collecting diagnostics on the listening RPC socket 0.0.0.0:36139 every 8 connection(s)
[       OK ] Parameters/TestRpc.TestRpcContextClientDeadline/SSL_TCP (54 ms)
[ RUN      ] Parameters/TestRpc.TestApplicationFeatureFlagUnsupportedServer/SSL_TCP
I20260925 02:24:02.871984 25130 acceptor_pool.cc:254] collecting diagnostics on the listening RPC socket 0.0.0.0:39267 every 8 connection(s)
I20260925 02:24:02.871979 25129 acceptor_pool.cc:254] collecting diagnostics on the listening RPC socket 0.0.0.0:39267 every 8 connection(s)
[       OK ] Parameters/TestRpc.TestApplicationFeatureFlagUnsupportedServer/SSL_TCP (61 ms)
[ RUN      ] Parameters/TestRpc.TestCancellationAsync/SSL_TCP
I20260925 02:24:02.926769 25154 acceptor_pool.cc:254] collecting diagnostics on the listening RPC socket 0.0.0.0:33801 every 8 connection(s)
I20260925 02:24:02.926826 25155 acceptor_pool.cc:254] collecting diagnostics on the listening RPC socket 0.0.0.0:33801 every 8 connection(s)
I20260925 02:24:02.927014 24718 rpc-test.cc:1716] Connecting to 0.0.0.0:33801
I20260925 02:24:02.947252 24718 test_util.cc:268] Using random seed: 1760184495
I20260925 02:24:02.964730 25159 rpc-test-base.h:240] got call: sleep_micros: 500 pattern: 4294967295 num_repetitions: 2097152 sidecar_idx: 0
I20260925 02:24:02.979529 25159 rpc-test-base.h:240] got call: sleep_micros: 500 pattern: 4294967295 num_repetitions: 2097152 sidecar_idx: 0
I20260925 02:24:02.995436 25159 rpc-test-base.h:240] got call: sleep_micros: 500 pattern: 4294967295 num_repetitions: 2097152 sidecar_idx: 0
I20260925 02:24:03.011438 25159 rpc-test-base.h:240] got call: sleep_micros: 500 pattern: 4294967295 num_repetitions: 2097152 sidecar_idx: 0
I20260925 02:24:03.026532 25159 rpc-test-base.h:240] got call: sleep_micros: 500 pattern: 4294967295 num_repetitions: 2097152 sidecar_idx: 0
I20260925 02:24:03.041019 25159 rpc-test-base.h:240] got call: sleep_micros: 500 pattern: 4294967295 num_repetitions: 2097152 sidecar_idx: 0
I20260925 02:24:03.053791 25159 rpc-test-base.h:240] got call: sleep_micros: 500 pattern: 4294967295 num_repetitions: 2097152 sidecar_idx: 0
I20260925 02:24:03.068441 25159 rpc-test-base.h:240] got call: sleep_micros: 500 pattern: 4294967295 num_repetitions: 2097152 sidecar_idx: 0
W20260925 02:24:03.071543 25151 connection.cc:441] server connection from 127.0.0.1:58294 torn down before Call kudu.rpc.GenericCalculatorService.SleepWithSidecar from 127.0.0.1:58294 (request call id 9) could send its response
[       OK ] Parameters/TestRpc.TestCancellationAsync/SSL_TCP (160 ms)
[ RUN      ] Parameters/TestRpc.TestPerformanceBySocketType/SSL_TCP
I20260925 02:24:03.089949 25181 acceptor_pool.cc:254] collecting diagnostics on the listening RPC socket 0.0.0.0:42835 every 8 connection(s)
I20260925 02:24:03.090071 25180 acceptor_pool.cc:254] collecting diagnostics on the listening RPC socket 0.0.0.0:42835 every 8 connection(s)
I20260925 02:24:03.090147 24718 rpc-test.cc:1846] Connecting to 0.0.0.0:42835
I20260925 02:24:04.875770 24718 rpc-test.cc:1859] Sending 1024MB via ssl-enabled tcp socket: real 1.774s	user 1.570s	sys 1.554s
I20260925 02:24:06.722859 24718 rpc-test.cc:1859] Sending 1024MB via ssl-enabled tcp socket: real 1.847s	user 1.708s	sys 1.569s
I20260925 02:24:08.541273 24718 rpc-test.cc:1859] Sending 1024MB via ssl-enabled tcp socket: real 1.818s	user 1.734s	sys 1.492s
I20260925 02:24:10.416240 24718 rpc-test.cc:1859] Sending 1024MB via ssl-enabled tcp socket: real 1.875s	user 1.652s	sys 1.653s
I20260925 02:24:12.286561 24718 rpc-test.cc:1859] Sending 1024MB via ssl-enabled tcp socket: real 1.870s	user 1.638s	sys 1.681s
[       OK ] Parameters/TestRpc.TestPerformanceBySocketType/SSL_TCP (9215 ms)
[----------] 20 tests from Parameters/TestRpc (34045 ms total)

[----------] 1 test from Parameters/TestRpcSocketTxRxQueue
[ RUN      ] Parameters/TestRpcSocketTxRxQueue.OverCapacity/0
W20260925 02:24:12.562556 25197 negotiation.cc:337] Failed RPC negotiation. Trace:
0925 02:24:12.294553 (+     0us) reactor.cc:625] Submitting negotiation task for client connection to 0.0.0.0:38783 (local address 127.0.0.1:42754)
0925 02:24:12.294603 (+    50us) negotiation.cc:107] Waiting for socket to connect
0925 02:24:12.294615 (+    12us) client_negotiation.cc:174] Beginning negotiation
0925 02:24:12.294674 (+    59us) client_negotiation.cc:252] Sending NEGOTIATE NegotiatePB request
0925 02:24:12.562397 (+267723us) negotiation.cc:327] Negotiation complete: Network error: Client connection negotiation failed: client connection to 0.0.0.0:38783: BlockingRecv error: recv error from unknown peer: Transport endpoint is not connected (error 107)
Metrics: {"client-negotiator.queue_time_us":19}
W20260925 02:24:12.562729 25243 negotiation.cc:337] Failed RPC negotiation. Trace:
0925 02:24:12.301429 (+     0us) reactor.cc:625] Submitting negotiation task for client connection to 0.0.0.0:38783 (local address 127.0.0.1:42792)
0925 02:24:12.301488 (+    59us) negotiation.cc:107] Waiting for socket to connect
0925 02:24:12.301497 (+     9us) client_negotiation.cc:174] Beginning negotiation
0925 02:24:12.301535 (+    38us) client_negotiation.cc:252] Sending NEGOTIATE NegotiatePB request
0925 02:24:12.562664 (+261129us) negotiation.cc:327] Negotiation complete: Network error: Client connection negotiation failed: client connection to 0.0.0.0:38783: BlockingRecv error: recv error from unknown peer: Transport endpoint is not connected (error 107)
Metrics: {"client-negotiator.queue_time_us":39}
W20260925 02:24:12.562865 25215 negotiation.cc:337] Failed RPC negotiation. Trace:
0925 02:24:12.297428 (+     0us) reactor.cc:625] Submitting negotiation task for client connection to 0.0.0.0:38783 (local address 127.0.0.1:42768)
0925 02:24:12.297598 (+   170us) negotiation.cc:107] Waiting for socket to connect
0925 02:24:12.297610 (+    12us) client_negotiation.cc:174] Beginning negotiation
0925 02:24:12.297928 (+   318us) client_negotiation.cc:252] Sending NEGOTIATE NegotiatePB request
0925 02:24:12.562516 (+264588us) negotiation.cc:327] Negotiation complete: Network error: Client connection negotiation failed: client connection to 0.0.0.0:38783: BlockingRecv error: recv error from unknown peer: Transport endpoint is not connected (error 107)
Metrics: {"client-negotiator.queue_time_us":137}
W20260925 02:24:12.562556 25224 negotiation.cc:337] Failed RPC negotiation. Trace:
0925 02:24:12.299347 (+     0us) reactor.cc:625] Submitting negotiation task for client connection to 0.0.0.0:38783 (local address 127.0.0.1:42776)
0925 02:24:12.299498 (+   151us) negotiation.cc:107] Waiting for socket to connect
0925 02:24:12.299513 (+    15us) client_negotiation.cc:174] Beginning negotiation
0925 02:24:12.299602 (+    89us) client_negotiation.cc:252] Sending NEGOTIATE NegotiatePB request
0925 02:24:12.562421 (+262819us) negotiation.cc:327] Negotiation complete: Network error: Client connection negotiation failed: client connection to 0.0.0.0:38783: BlockingRecv error: recv error from unknown peer: Transport endpoint is not connected (error 107)
Metrics: {"client-negotiator.queue_time_us":71}
W20260925 02:24:12.562963 25206 negotiation.cc:337] Failed RPC negotiation. Trace:
0925 02:24:12.295794 (+     0us) reactor.cc:625] Submitting negotiation task for client connection to 0.0.0.0:38783 (local address 127.0.0.1:42766)
0925 02:24:12.295854 (+    60us) negotiation.cc:107] Waiting for socket to connect
0925 02:24:12.295864 (+    10us) client_negotiation.cc:174] Beginning negotiation
0925 02:24:12.295916 (+    52us) client_negotiation.cc:252] Sending NEGOTIATE NegotiatePB request
0925 02:24:12.562512 (+266596us) negotiation.cc:327] Negotiation complete: Network error: Client connection negotiation failed: client connection to 0.0.0.0:38783: BlockingRecv error: recv error from unknown peer: Transport endpoint is not connected (error 107)
Metrics: {"client-negotiator.queue_time_us":33}
W20260925 02:24:12.563086 25233 negotiation.cc:337] Failed RPC negotiation. Trace:
0925 02:24:12.300418 (+     0us) reactor.cc:625] Submitting negotiation task for client connection to 0.0.0.0:38783 (local address 127.0.0.1:42786)
0925 02:24:12.300458 (+    40us) negotiation.cc:107] Waiting for socket to connect
0925 02:24:12.300466 (+     8us) client_negotiation.cc:174] Beginning negotiation
0925 02:24:12.300505 (+    39us) client_negotiation.cc:252] Sending NEGOTIATE NegotiatePB request
0925 02:24:12.562665 (+262160us) negotiation.cc:327] Negotiation complete: Network error: Client connection negotiation failed: client connection to 0.0.0.0:38783: BlockingRecv error: recv error from unknown peer: Transport endpoint is not connected (error 107)
Metrics: {"client-negotiator.queue_time_us":20}
[       OK ] Parameters/TestRpcSocketTxRxQueue.OverCapacity/0 (1040 ms)
[----------] 1 test from Parameters/TestRpcSocketTxRxQueue (1041 ms total)

[----------] Global test environment tear-down
[==========] 21 tests from 2 test suites ran. (35086 ms total)
[  PASSED  ] 20 tests.
[  FAILED  ] 1 test, listed below:
[  FAILED  ] Parameters/TestRpc.TestCallWithChainCertAndChainCA/SSL_TCP, where GetParam() = (true, false)

 1 FAILED TEST