Diagnosed failure

Parameters/TestRpc.TestCallWithChainCertAndChainCA/SSL_TCP: /data0/somelongdirectorytoavoidrpathissues/src/kudu/src/kudu/rpc/rpc-test.cc:270: Failure
Failed
Bad status: Runtime error: could not verify certificate chain (error with cert: subject=CN = localhost, ST = sadfjas, C = AS, emailAddress = sdflkdsajf, O = lskdfjlsad, OU = sldfkja, issuer=C = AS, ST = ASDfkjdhf, L = lskdjf, O = saldfja, OU = skdjf, CN = localhost, emailAddress = sadjflkadsj): : certificate has expired
Google Test trace:
/data0/somelongdirectorytoavoidrpathissues/src/kudu/src/kudu/rpc/rpc-test.cc:267: Connecting to 0.0.0.0:35201
I20260929 21:49:38.820701   891 test_util.cc:175] -----------------------------------------------
I20260929 21:49:38.820876   891 test_util.cc:176] Had fatal failures, leaving test files at /tmp/dist-test-task7V_Zjz/test-tmp/rpc-test.5.Parameters_TestRpc.TestCallWithChainCertAndChainCA_SSL_TCP.1790718577526207-891-0

Full log

Note: This is test shard 6 of 8.
[==========] Running 21 tests from 2 test suites.
[----------] Global test environment set-up.
[----------] 20 tests from Parameters/TestRpc
[ RUN      ] Parameters/TestRpc.TestMessengerCreateDestroy/SSL_TCP
WARNING: Logging before InitGoogleLogging() is written to STDERR
I20260929 21:49:37.643819   891 rpc-test.cc:169] started messenger TestCreateDestroy
[       OK ] Parameters/TestRpc.TestMessengerCreateDestroy/SSL_TCP (1104 ms)
[ RUN      ] Parameters/TestRpc.TestNegotiationDeadlock/SSL_TCP
I20260929 21:49:38.714011   913 acceptor_pool.cc:254] collecting diagnostics on the listening RPC socket 0.0.0.0:45409 every 8 connection(s)
I20260929 21:49:38.715342   914 acceptor_pool.cc:254] collecting diagnostics on the listening RPC socket 0.0.0.0:45409 every 8 connection(s)
[       OK ] Parameters/TestRpc.TestNegotiationDeadlock/SSL_TCP (81 ms)
[ RUN      ] Parameters/TestRpc.TestCallWithChainCertAndChainCA/SSL_TCP
I20260929 21:49:38.794212   929 acceptor_pool.cc:254] collecting diagnostics on the listening RPC socket 0.0.0.0:35201 every 8 connection(s)
I20260929 21:49:38.796078   930 acceptor_pool.cc:254] collecting diagnostics on the listening RPC socket 0.0.0.0:35201 every 8 connection(s)
/data0/somelongdirectorytoavoidrpathissues/src/kudu/src/kudu/rpc/rpc-test.cc:270: Failure
Failed
Bad status: Runtime error: could not verify certificate chain (error with cert: subject=CN = localhost, ST = sadfjas, C = AS, emailAddress = sdflkdsajf, O = lskdfjlsad, OU = sldfkja, issuer=C = AS, ST = ASDfkjdhf, L = lskdjf, O = saldfja, OU = skdjf, CN = localhost, emailAddress = sadjflkadsj): : certificate has expired
Google Test trace:
/data0/somelongdirectorytoavoidrpathissues/src/kudu/src/kudu/rpc/rpc-test.cc:267: Connecting to 0.0.0.0:35201
I20260929 21:49:38.820701   891 test_util.cc:175] -----------------------------------------------
I20260929 21:49:38.820876   891 test_util.cc:176] Had fatal failures, leaving test files at /tmp/dist-test-task7V_Zjz/test-tmp/rpc-test.5.Parameters_TestRpc.TestCallWithChainCertAndChainCA_SSL_TCP.1790718577526207-891-0
[  FAILED  ] Parameters/TestRpc.TestCallWithChainCertAndChainCA/SSL_TCP, where GetParam() = (true, false) (57 ms)
[ RUN      ] Parameters/TestRpc.TestCallWithPasswordProtectedKey/SSL_TCP
I20260929 21:49:38.838764   954 acceptor_pool.cc:254] collecting diagnostics on the listening RPC socket 0.0.0.0:41809 every 8 connection(s)
I20260929 21:49:38.839437   955 acceptor_pool.cc:254] collecting diagnostics on the listening RPC socket 0.0.0.0:41809 every 8 connection(s)
[       OK ] Parameters/TestRpc.TestCallWithPasswordProtectedKey/SSL_TCP (63 ms)
[ RUN      ] Parameters/TestRpc.TestCallToBadServer/SSL_TCP
I20260929 21:49:38.912902   891 rpc-test.cc:394] Status: Network error: Client connection negotiation failed: client connection to 0.0.0.0:0: connect: Connection refused (error 111)
I20260929 21:49:38.914142   891 rpc-test.cc:394] Status: Network error: Client connection negotiation failed: client connection to 0.0.0.0:0: connect: Connection refused (error 111)
I20260929 21:49:38.915324   891 rpc-test.cc:394] Status: Network error: Client connection negotiation failed: client connection to 0.0.0.0:0: connect: Connection refused (error 111)
I20260929 21:49:38.916495   891 rpc-test.cc:394] Status: Network error: Client connection negotiation failed: client connection to 0.0.0.0:0: connect: Connection refused (error 111)
I20260929 21:49:38.917610   891 rpc-test.cc:394] Status: Network error: Client connection negotiation failed: client connection to 0.0.0.0:0: connect: Connection refused (error 111)
[       OK ] Parameters/TestRpc.TestCallToBadServer/SSL_TCP (35 ms)
[ RUN      ] Parameters/TestRpc.TestWrongService/SSL_TCP
I20260929 21:49:38.940994   989 acceptor_pool.cc:254] collecting diagnostics on the listening RPC socket 0.0.0.0:38223 every 8 connection(s)
I20260929 21:49:38.941737   990 acceptor_pool.cc:254] collecting diagnostics on the listening RPC socket 0.0.0.0:38223 every 8 connection(s)
I20260929 21:49:38.972115   987 messenger.cc:345] service WrongServiceName not registered on TestServer
[       OK ] Parameters/TestRpc.TestWrongService/SSL_TCP (59 ms)
[ RUN      ] Parameters/TestRpc.TestConnectionKeepalive/SSL_TCP
I20260929 21:49:39.001677  1012 acceptor_pool.cc:254] collecting diagnostics on the listening RPC socket 0.0.0.0:33317 every 8 connection(s)
I20260929 21:49:39.002384  1013 acceptor_pool.cc:254] collecting diagnostics on the listening RPC socket 0.0.0.0:33317 every 8 connection(s)
I20260929 21:49:39.005646   891 rpc-test.cc:488] Connecting to 0.0.0.0:33317
[       OK ] Parameters/TestRpc.TestConnectionKeepalive/SSL_TCP (1059 ms)
[ RUN      ] Parameters/TestRpc.TestClientConnectionMetrics/SSL_TCP
I20260929 21:49:40.055231  1037 acceptor_pool.cc:254] collecting diagnostics on the listening RPC socket 0.0.0.0:42959 every 8 connection(s)
I20260929 21:49:40.055888  1038 acceptor_pool.cc:254] collecting diagnostics on the listening RPC socket 0.0.0.0:42959 every 8 connection(s)
I20260929 21:49:40.058863   891 rpc-test.cc:569] Connecting to 0.0.0.0:42959
[       OK ] Parameters/TestRpc.TestClientConnectionMetrics/SSL_TCP (109514 ms)
[ RUN      ] Parameters/TestRpc.TestCredentialsPolicy/SSL_TCP
I20260929 21:51:29.584167  1071 acceptor_pool.cc:254] collecting diagnostics on the listening RPC socket 0.0.0.0:32943 every 8 connection(s)
I20260929 21:51:29.584940  1072 acceptor_pool.cc:254] collecting diagnostics on the listening RPC socket 0.0.0.0:32943 every 8 connection(s)
I20260929 21:51:29.588140   891 rpc-test.cc:700] Connecting to 0.0.0.0:32943
[       OK ] Parameters/TestRpc.TestCredentialsPolicy/SSL_TCP (85 ms)
[ RUN      ] Parameters/TestRpc.TestCallLongerThanKeepalive/SSL_TCP
I20260929 21:51:29.659890  1096 acceptor_pool.cc:254] collecting diagnostics on the listening RPC socket 0.0.0.0:44987 every 8 connection(s)
I20260929 21:51:29.660557  1097 acceptor_pool.cc:254] collecting diagnostics on the listening RPC socket 0.0.0.0:44987 every 8 connection(s)
I20260929 21:51:29.691915  1100 rpc-test-base.h:222] got call: sleep_micros: 3000000 deferred: true
I20260929 21:51:32.696025  1100 rpcz_store.cc:275] Call kudu.rpc.GenericCalculatorService.Sleep from 127.0.0.1:35756 (request call id 0) took 3004 ms. Trace:
I20260929 21:51:32.696329  1100 rpcz_store.cc:276] 0929 21:51:29.691666 (+     0us) service_pool.cc:170] Inserting onto call queue
0929 21:51:29.691768 (+   102us) service_pool.cc:227] Handling call
0929 21:51:32.695968 (+3004200us) inbound_call.cc:173] Queueing success response
Metrics: {}
[       OK ] Parameters/TestRpc.TestCallLongerThanKeepalive/SSL_TCP (3067 ms)
[ RUN      ] Parameters/TestRpc.TestRpcSidecar/SSL_TCP
I20260929 21:51:32.735036  1121 acceptor_pool.cc:254] collecting diagnostics on the listening RPC socket 0.0.0.0:33585 every 8 connection(s)
I20260929 21:51:32.735795  1122 acceptor_pool.cc:254] collecting diagnostics on the listening RPC socket 0.0.0.0:33585 every 8 connection(s)
[       OK ] Parameters/TestRpc.TestRpcSidecar/SSL_TCP (504 ms)
[ RUN      ] Parameters/TestRpc.TestRpcSidecarLimits/SSL_TCP
I20260929 21:51:49.227782  1148 acceptor_pool.cc:254] collecting diagnostics on the listening RPC socket 0.0.0.0:44629 every 8 connection(s)
I20260929 21:51:49.228524  1149 acceptor_pool.cc:254] collecting diagnostics on the listening RPC socket 0.0.0.0:44629 every 8 connection(s)
W20260929 21:51:49.247948   891 serialization.cc:72] Serialized kudu.rpc_test.PushStringsRequestPB (2147483654 bytes) is larger than the maximum configured RPC message size (52428800 bytes). Sending anyway, but peer may reject the data.
W20260929 21:51:49.258200  1146 connection.cc:535] server connection from 127.0.0.1:35276 recv error: Network error: RPC frame had a length of 2147483714, but we only support messages up to 52428800 bytes long.
W20260929 21:51:49.258512  1146 connection.cc:158] shutting down server connection from 127.0.0.1:35276 with pending inbound data: 4/2147483714 bytes received; last active 0 ns ago: status Network error: RPC frame had a length of 2147483714, but we only support messages up to 52428800 bytes long.
W20260929 21:51:49.259330  1161 connection.cc:698] client connection to 0.0.0.0:44629 send error: Network error: failed to write to TLS socket: Connection reset by peer
W20260929 21:51:49.259873  1161 connection.cc:196] Error closing socket: Network error: TlsSocket::Close: Success
[       OK ] Parameters/TestRpc.TestRpcSidecarLimits/SSL_TCP (16617 ms)
[ RUN      ] Parameters/TestRpc.TestCallTimeoutDoesntAffectNegotiation/SSL_TCP
I20260929 21:51:49.855563  1173 acceptor_pool.cc:254] collecting diagnostics on the listening RPC socket 0.0.0.0:46789 every 8 connection(s)
I20260929 21:51:49.856218  1174 acceptor_pool.cc:254] collecting diagnostics on the listening RPC socket 0.0.0.0:46789 every 8 connection(s)
W20260929 21:51:49.882387  1169 negotiation.cc:266] Injecting 500ms delay in negotiation
I20260929 21:51:49.931902   891 rpc-test-base.h:595] status: Timed out: connection negotiation to 0.0.0.0:46789 for RPC Sleep timed out after 0.050s (ON_OUTBOUND_QUEUE), seconds elapsed: 0.0505044
[       OK ] Parameters/TestRpc.TestCallTimeoutDoesntAffectNegotiation/SSL_TCP (569 ms)
[ RUN      ] Parameters/TestRpc.TestRpcHandlerLatencyMetric/SSL_TCP
I20260929 21:51:50.414440  1198 acceptor_pool.cc:254] collecting diagnostics on the listening RPC socket 0.0.0.0:42765 every 8 connection(s)
I20260929 21:51:50.415140  1199 acceptor_pool.cc:254] collecting diagnostics on the listening RPC socket 0.0.0.0:42765 every 8 connection(s)
I20260929 21:51:50.480052   891 rpc-test.cc:1236] Sleep() min lat: 21620
I20260929 21:51:50.480265   891 rpc-test.cc:1237] Sleep() mean lat: 21620
I20260929 21:51:50.480443   891 rpc-test.cc:1238] Sleep() max lat: 21620
I20260929 21:51:50.480607   891 rpc-test.cc:1239] Sleep() #calls: 1
[       OK ] Parameters/TestRpc.TestRpcHandlerLatencyMetric/SSL_TCP (92 ms)
[ RUN      ] Parameters/TestRpc.TimedOutOnResponseMetricServiceQueue/SSL_TCP
I20260929 21:51:50.513057  1224 acceptor_pool.cc:254] collecting diagnostics on the listening RPC socket 0.0.0.0:46631 every 8 connection(s)
I20260929 21:51:50.513768  1225 acceptor_pool.cc:254] collecting diagnostics on the listening RPC socket 0.0.0.0:46631 every 8 connection(s)
W20260929 21:51:50.585196  1226 rpcz_store.cc:267] Call kudu.rpc_test.CalculatorService.Sleep from 127.0.0.1:35108 (request call id 2) took 20 ms (client timeout 20 ms). Trace:
W20260929 21:51:50.585577  1226 rpcz_store.cc:269] 0929 21:51:50.564644 (+     0us) service_pool.cc:170] Inserting onto call queue
0929 21:51:50.585035 (+ 20391us) service_pool.cc:214] Skipping call since client already timed out
0929 21:51:50.585140 (+   105us) inbound_call.cc:173] Queueing failure response
Metrics: {}
[       OK ] Parameters/TestRpc.TimedOutOnResponseMetricServiceQueue/SSL_TCP (100 ms)
[ RUN      ] Parameters/TestRpc.RpcPendingConnectionsMetric/SSL_TCP
I20260929 21:51:50.602335  1247 acceptor_pool.cc:254] collecting diagnostics on the listening RPC socket 0.0.0.0:36579 every 8 connection(s)
I20260929 21:51:50.603047  1248 acceptor_pool.cc:254] collecting diagnostics on the listening RPC socket 0.0.0.0:36579 every 8 connection(s)
W20260929 21:51:50.617873  1243 negotiation.cc:337] Failed RPC negotiation. Trace:
0929 21:51:50.616155 (+     0us) reactor.cc:625] Submitting negotiation task for server connection from 127.0.0.1:45412 (local address 127.0.0.1:36579)
0929 21:51:50.616707 (+   552us) server_negotiation.cc:206] Beginning negotiation
0929 21:51:50.616734 (+    27us) server_negotiation.cc:399] Waiting for connection header
0929 21:51:50.617077 (+   343us) negotiation.cc:327] Negotiation complete: Network error: Server connection negotiation failed: server connection from 127.0.0.1:45412: BlockingRecv error: recv got EOF from 127.0.0.1:45412 (error 108)
Metrics: {"server-negotiator.queue_time_us":138}
[       OK ] Parameters/TestRpc.RpcPendingConnectionsMetric/SSL_TCP (38 ms)
[ RUN      ] Parameters/TestRpc.TestRpcContextClientDeadline/SSL_TCP
I20260929 21:51:50.649576  1263 acceptor_pool.cc:254] collecting diagnostics on the listening RPC socket 0.0.0.0:45975 every 8 connection(s)
I20260929 21:51:50.650303  1264 acceptor_pool.cc:254] collecting diagnostics on the listening RPC socket 0.0.0.0:45975 every 8 connection(s)
[       OK ] Parameters/TestRpc.TestRpcContextClientDeadline/SSL_TCP (79 ms)
[ RUN      ] Parameters/TestRpc.TestApplicationFeatureFlagUnsupportedServer/SSL_TCP
I20260929 21:51:50.747273  1288 acceptor_pool.cc:254] collecting diagnostics on the listening RPC socket 0.0.0.0:38197 every 8 connection(s)
I20260929 21:51:50.748003  1289 acceptor_pool.cc:254] collecting diagnostics on the listening RPC socket 0.0.0.0:38197 every 8 connection(s)
[       OK ] Parameters/TestRpc.TestApplicationFeatureFlagUnsupportedServer/SSL_TCP (75 ms)
[ RUN      ] Parameters/TestRpc.TestCancellationAsync/SSL_TCP
I20260929 21:51:50.804893  1313 acceptor_pool.cc:254] collecting diagnostics on the listening RPC socket 0.0.0.0:36433 every 8 connection(s)
I20260929 21:51:50.805572  1314 acceptor_pool.cc:254] collecting diagnostics on the listening RPC socket 0.0.0.0:36433 every 8 connection(s)
I20260929 21:51:50.808645   891 rpc-test.cc:1716] Connecting to 0.0.0.0:36433
I20260929 21:51:50.821086   891 test_util.cc:268] Using random seed: 816230598
I20260929 21:51:51.035164  1317 rpc-test-base.h:240] got call: sleep_micros: 500 pattern: 4294967295 num_repetitions: 2097152 sidecar_idx: 0
I20260929 21:51:51.189639  1316 rpc-test-base.h:240] got call: sleep_micros: 500 pattern: 4294967295 num_repetitions: 2097152 sidecar_idx: 0
I20260929 21:51:51.377228  1317 rpc-test-base.h:240] got call: sleep_micros: 500 pattern: 4294967295 num_repetitions: 2097152 sidecar_idx: 0
I20260929 21:51:51.556425  1316 rpc-test-base.h:240] got call: sleep_micros: 500 pattern: 4294967295 num_repetitions: 2097152 sidecar_idx: 0
I20260929 21:51:51.729106  1317 rpc-test-base.h:240] got call: sleep_micros: 500 pattern: 4294967295 num_repetitions: 2097152 sidecar_idx: 0
I20260929 21:51:51.903915  1316 rpc-test-base.h:240] got call: sleep_micros: 500 pattern: 4294967295 num_repetitions: 2097152 sidecar_idx: 0
W20260929 21:51:52.003209  1326 outbound_call.cc:322] RPC callback for RPC call kudu.rpc.GenericCalculatorService.SleepWithSidecar -> {remote=0.0.0.0:36433 (localhost), user_credentials={real_user=slave}} blocked reactor thread for 43781us
I20260929 21:51:52.082597  1317 rpc-test-base.h:240] got call: sleep_micros: 500 pattern: 4294967295 num_repetitions: 2097152 sidecar_idx: 0
I20260929 21:51:52.256264  1316 rpc-test-base.h:240] got call: sleep_micros: 500 pattern: 4294967295 num_repetitions: 2097152 sidecar_idx: 0
W20260929 21:51:52.425979  1310 connection.cc:196] Error closing socket: Network error: TlsSocket::Close: Broken pipe
W20260929 21:51:52.463189  1310 connection.cc:441] server connection from 127.0.0.1:53228 torn down before Call kudu.rpc.GenericCalculatorService.SleepWithSidecar from 127.0.0.1:53228 (request call id 8) could send its response
[       OK ] Parameters/TestRpc.TestCancellationAsync/SSL_TCP (1684 ms)
[ RUN      ] Parameters/TestRpc.TestPerformanceBySocketType/SSL_TCP
I20260929 21:51:52.560056  1338 acceptor_pool.cc:254] collecting diagnostics on the listening RPC socket 0.0.0.0:39401 every 8 connection(s)
I20260929 21:51:52.560729  1339 acceptor_pool.cc:254] collecting diagnostics on the listening RPC socket 0.0.0.0:39401 every 8 connection(s)
I20260929 21:51:52.563760   891 rpc-test.cc:1846] Connecting to 0.0.0.0:39401
I20260929 21:52:11.179005   891 rpc-test.cc:1859] Sending 1024MB via ssl-enabled tcp socket: real 18.596s	user 16.349s	sys 10.500s
I20260929 21:52:29.299557   891 rpc-test.cc:1859] Sending 1024MB via ssl-enabled tcp socket: real 18.120s	user 15.883s	sys 9.980s
I20260929 21:52:47.383479   891 rpc-test.cc:1859] Sending 1024MB via ssl-enabled tcp socket: real 18.083s	user 16.008s	sys 9.787s
I20260929 21:53:05.500550   891 rpc-test.cc:1859] Sending 1024MB via ssl-enabled tcp socket: real 18.117s	user 16.229s	sys 9.697s
I20260929 21:53:23.627631   891 rpc-test.cc:1859] Sending 1024MB via ssl-enabled tcp socket: real 18.127s	user 15.689s	sys 10.195s
[       OK ] Parameters/TestRpc.TestPerformanceBySocketType/SSL_TCP (91171 ms)
[----------] 20 tests from Parameters/TestRpc (226066 ms total)

[----------] 1 test from Parameters/TestRpcSocketTxRxQueue
[ RUN      ] Parameters/TestRpcSocketTxRxQueue.OverCapacity/0
W20260929 21:53:24.070176  1400 negotiation.cc:337] Failed RPC negotiation. Trace:
0929 21:53:23.693456 (+     0us) reactor.cc:625] Submitting negotiation task for client connection to 0.0.0.0:36641 (local address 127.0.0.1:50688)
0929 21:53:23.693939 (+   483us) negotiation.cc:107] Waiting for socket to connect
0929 21:53:23.693968 (+    29us) client_negotiation.cc:174] Beginning negotiation
0929 21:53:23.694175 (+   207us) client_negotiation.cc:252] Sending NEGOTIATE NegotiatePB request
0929 21:53:24.067472 (+373297us) negotiation.cc:327] Negotiation complete: Network error: Client connection negotiation failed: client connection to 0.0.0.0:36641: BlockingRecv error: recv error from unknown peer: Transport endpoint is not connected (error 107)
Metrics: {"client-negotiator.queue_time_us":119}
W20260929 21:53:24.070312  1364 negotiation.cc:337] Failed RPC negotiation. Trace:
0929 21:53:23.658069 (+     0us) reactor.cc:625] Submitting negotiation task for client connection to 0.0.0.0:36641 (local address 127.0.0.1:50656)
0929 21:53:23.658691 (+   622us) negotiation.cc:107] Waiting for socket to connect
0929 21:53:23.658731 (+    40us) client_negotiation.cc:174] Beginning negotiation
0929 21:53:23.659199 (+   468us) client_negotiation.cc:252] Sending NEGOTIATE NegotiatePB request
0929 21:53:24.067480 (+408281us) negotiation.cc:327] Negotiation complete: Network error: Client connection negotiation failed: client connection to 0.0.0.0:36641: BlockingRecv error: recv error from unknown peer: Transport endpoint is not connected (error 107)
Metrics: {"client-negotiator.queue_time_us":110}
W20260929 21:53:24.070601  1382 negotiation.cc:337] Failed RPC negotiation. Trace:
0929 21:53:23.670732 (+     0us) reactor.cc:625] Submitting negotiation task for client connection to 0.0.0.0:36641 (local address 127.0.0.1:50674)
0929 21:53:23.671212 (+   480us) negotiation.cc:107] Waiting for socket to connect
0929 21:53:23.671241 (+    29us) client_negotiation.cc:174] Beginning negotiation
0929 21:53:23.671424 (+   183us) client_negotiation.cc:252] Sending NEGOTIATE NegotiatePB request
0929 21:53:24.067492 (+396068us) negotiation.cc:327] Negotiation complete: Network error: Client connection negotiation failed: client connection to 0.0.0.0:36641: BlockingRecv error: recv error from unknown peer: Transport endpoint is not connected (error 107)
Metrics: {"client-negotiator.queue_time_us":110}
W20260929 21:53:24.071923  1409 negotiation.cc:337] Failed RPC negotiation. Trace:
0929 21:53:23.704655 (+     0us) reactor.cc:625] Submitting negotiation task for client connection to 0.0.0.0:36641 (local address 127.0.0.1:50700)
0929 21:53:23.705157 (+   502us) negotiation.cc:107] Waiting for socket to connect
0929 21:53:23.705198 (+    41us) client_negotiation.cc:174] Beginning negotiation
0929 21:53:23.705376 (+   178us) client_negotiation.cc:252] Sending NEGOTIATE NegotiatePB request
0929 21:53:24.069987 (+364611us) negotiation.cc:327] Negotiation complete: Network error: Client connection negotiation failed: client connection to 0.0.0.0:36641: BlockingRecv error: recv error from unknown peer: Transport endpoint is not connected (error 107)
Metrics: {"client-negotiator.queue_time_us":131}
W20260929 21:53:24.072175  1391 negotiation.cc:337] Failed RPC negotiation. Trace:
0929 21:53:23.682101 (+     0us) reactor.cc:625] Submitting negotiation task for client connection to 0.0.0.0:36641 (local address 127.0.0.1:50680)
0929 21:53:23.682591 (+   490us) negotiation.cc:107] Waiting for socket to connect
0929 21:53:23.682620 (+    29us) client_negotiation.cc:174] Beginning negotiation
0929 21:53:23.682807 (+   187us) client_negotiation.cc:252] Sending NEGOTIATE NegotiatePB request
0929 21:53:24.068007 (+385200us) negotiation.cc:327] Negotiation complete: Network error: Client connection negotiation failed: client connection to 0.0.0.0:36641: BlockingRecv error: recv error from unknown peer: Transport endpoint is not connected (error 107)
Metrics: {"client-negotiator.queue_time_us":130}
W20260929 21:53:24.072340  1373 negotiation.cc:337] Failed RPC negotiation. Trace:
0929 21:53:23.664232 (+     0us) reactor.cc:625] Submitting negotiation task for client connection to 0.0.0.0:36641 (local address 127.0.0.1:50670)
0929 21:53:23.664727 (+   495us) negotiation.cc:107] Waiting for socket to connect
0929 21:53:23.664755 (+    28us) client_negotiation.cc:174] Beginning negotiation
0929 21:53:23.664935 (+   180us) client_negotiation.cc:252] Sending NEGOTIATE NegotiatePB request
0929 21:53:24.067758 (+402823us) negotiation.cc:327] Negotiation complete: Network error: Client connection negotiation failed: client connection to 0.0.0.0:36641: BlockingRecv error: recv error from unknown peer: Transport endpoint is not connected (error 107)
Metrics: {"client-negotiator.queue_time_us":124}
[       OK ] Parameters/TestRpcSocketTxRxQueue.OverCapacity/0 (1201 ms)
[----------] 1 test from Parameters/TestRpcSocketTxRxQueue (1201 ms total)

[----------] Global test environment tear-down
[==========] 21 tests from 2 test suites ran. (227268 ms total)
[  PASSED  ] 20 tests.
[  FAILED  ] 1 test, listed below:
[  FAILED  ] Parameters/TestRpc.TestCallWithChainCertAndChainCA/SSL_TCP, where GetParam() = (true, false)

 1 FAILED TEST