Diagnosed failure

Parameters/TestRpc.TestCallWithChainCertAndRootCA/SSL_TCP: /data0/somelongdirectorytoavoidrpathissues/src/kudu/src/kudu/rpc/rpc-test.cc:303: Failure
Failed
Bad status: Runtime error: could not verify certificate chain (error with cert: subject=CN = localhost, ST = sadfjas, C = AS, emailAddress = sdflkdsajf, O = lskdfjlsad, OU = sldfkja, issuer=C = AS, ST = ASDfkjdhf, L = lskdjf, O = saldfja, OU = skdjf, CN = localhost, emailAddress = sadjflkadsj): : certificate has expired
Google Test trace:
/data0/somelongdirectorytoavoidrpathissues/src/kudu/src/kudu/rpc/rpc-test.cc:300: Connecting to 0.0.0.0:35803
I20260924 14:27:46.371441 18503 test_util.cc:175] -----------------------------------------------
I20260924 14:27:46.371681 18503 test_util.cc:176] Had fatal failures, leaving test files at /tmp/dist-test-taskL_zN0P/test-tmp/rpc-test.1.Parameters_TestRpc.TestCallWithChainCertAndRootCA_SSL_TCP.1790260064778412-18503-0

Full log

Note: This is test shard 2 of 8.
[==========] Running 21 tests from 2 test suites.
[----------] Global test environment set-up.
[----------] 1 test from TestRpc
[ RUN      ] TestRpc.TestMethodsByName
[       OK ] TestRpc.TestMethodsByName (6 ms)
[----------] 1 test from TestRpc (6 ms total)

[----------] 20 tests from Parameters/TestRpc
[ RUN      ] Parameters/TestRpc.TestAcceptorPoolStartStop/SSL_TCP
WARNING: Logging before InitGoogleLogging() is written to STDERR
I20260924 14:27:44.917052 18518 acceptor_pool.cc:254] collecting diagnostics on the listening RPC socket 0.0.0.0:33619 every 8 connection(s)
I20260924 14:27:44.918627 18519 acceptor_pool.cc:254] collecting diagnostics on the listening RPC socket 0.0.0.0:33619 every 8 connection(s)
W20260924 14:27:45.919252 18503 thread.cc:536] Waited for 1000ms trying to join with acceptor (tid 18519)
I20260924 14:27:46.083231 18530 acceptor_pool.cc:254] collecting diagnostics on the listening RPC socket 0.0.0.0:37501 every 8 connection(s)
I20260924 14:27:46.084861 18531 acceptor_pool.cc:254] collecting diagnostics on the listening RPC socket 0.0.0.0:37501 every 8 connection(s)
I20260924 14:27:46.118597 18541 acceptor_pool.cc:254] collecting diagnostics on the listening RPC socket 0.0.0.0:35029 every 8 connection(s)
I20260924 14:27:46.120136 18542 acceptor_pool.cc:254] collecting diagnostics on the listening RPC socket 0.0.0.0:35029 every 8 connection(s)
I20260924 14:27:46.150795 18552 acceptor_pool.cc:254] collecting diagnostics on the listening RPC socket 0.0.0.0:43087 every 8 connection(s)
I20260924 14:27:46.151633 18553 acceptor_pool.cc:254] collecting diagnostics on the listening RPC socket 0.0.0.0:43087 every 8 connection(s)
I20260924 14:27:46.175405 18563 acceptor_pool.cc:254] collecting diagnostics on the listening RPC socket 0.0.0.0:45839 every 8 connection(s)
I20260924 14:27:46.176190 18564 acceptor_pool.cc:254] collecting diagnostics on the listening RPC socket 0.0.0.0:45839 every 8 connection(s)
[       OK ] Parameters/TestRpc.TestAcceptorPoolStartStop/SSL_TCP (1342 ms)
[ RUN      ] Parameters/TestRpc.TestCall/SSL_TCP
I20260924 14:27:46.214506 18576 acceptor_pool.cc:254] collecting diagnostics on the listening RPC socket 0.0.0.0:40143 every 8 connection(s)
I20260924 14:27:46.216714 18577 acceptor_pool.cc:254] collecting diagnostics on the listening RPC socket 0.0.0.0:40143 every 8 connection(s)
I20260924 14:27:46.221966 18503 rpc-test.cc:234] Connecting to 0.0.0.0:40143
[       OK ] Parameters/TestRpc.TestCall/SSL_TCP (152 ms)
[ RUN      ] Parameters/TestRpc.TestCallWithChainCertAndRootCA/SSL_TCP
I20260924 14:27:46.350713 18601 acceptor_pool.cc:254] collecting diagnostics on the listening RPC socket 0.0.0.0:35803 every 8 connection(s)
I20260924 14:27:46.351493 18602 acceptor_pool.cc:254] collecting diagnostics on the listening RPC socket 0.0.0.0:35803 every 8 connection(s)
/data0/somelongdirectorytoavoidrpathissues/src/kudu/src/kudu/rpc/rpc-test.cc:303: Failure
Failed
Bad status: Runtime error: could not verify certificate chain (error with cert: subject=CN = localhost, ST = sadfjas, C = AS, emailAddress = sdflkdsajf, O = lskdfjlsad, OU = sldfkja, issuer=C = AS, ST = ASDfkjdhf, L = lskdjf, O = saldfja, OU = skdjf, CN = localhost, emailAddress = sadjflkadsj): : certificate has expired
Google Test trace:
/data0/somelongdirectorytoavoidrpathissues/src/kudu/src/kudu/rpc/rpc-test.cc:300: Connecting to 0.0.0.0:35803
I20260924 14:27:46.371441 18503 test_util.cc:175] -----------------------------------------------
I20260924 14:27:46.371681 18503 test_util.cc:176] Had fatal failures, leaving test files at /tmp/dist-test-taskL_zN0P/test-tmp/rpc-test.1.Parameters_TestRpc.TestCallWithChainCertAndRootCA_SSL_TCP.1790260064778412-18503-0
[  FAILED  ] Parameters/TestRpc.TestCallWithChainCertAndRootCA/SSL_TCP, where GetParam() = (true, false) (38 ms)
[ RUN      ] Parameters/TestRpc.TestCallWithBadPasswordProtectedKey/SSL_TCP
[       OK ] Parameters/TestRpc.TestCallWithBadPasswordProtectedKey/SSL_TCP (32 ms)
[ RUN      ] Parameters/TestRpc.TestInvalidMethodCall/SSL_TCP
I20260924 14:27:46.426822 18638 acceptor_pool.cc:254] collecting diagnostics on the listening RPC socket 0.0.0.0:37403 every 8 connection(s)
I20260924 14:27:46.427717 18639 acceptor_pool.cc:254] collecting diagnostics on the listening RPC socket 0.0.0.0:37403 every 8 connection(s)
I20260924 14:27:46.431226 18503 rpc-test.cc:406] Connecting to 0.0.0.0:37403
[       OK ] Parameters/TestRpc.TestInvalidMethodCall/SSL_TCP (61 ms)
[ RUN      ] Parameters/TestRpc.TestHighFDs/SSL_TCP
I20260924 14:27:46.675084 18663 acceptor_pool.cc:254] collecting diagnostics on the listening RPC socket 0.0.0.0:45289 every 8 connection(s)
I20260924 14:27:46.675835 18664 acceptor_pool.cc:254] collecting diagnostics on the listening RPC socket 0.0.0.0:45289 every 8 connection(s)
[       OK ] Parameters/TestRpc.TestHighFDs/SSL_TCP (275 ms)
[ RUN      ] Parameters/TestRpc.TestConnectionAlwaysKeepalive/SSL_TCP
I20260924 14:27:46.769757 18686 acceptor_pool.cc:254] collecting diagnostics on the listening RPC socket 0.0.0.0:39945 every 8 connection(s)
I20260924 14:27:46.770465 18687 acceptor_pool.cc:254] collecting diagnostics on the listening RPC socket 0.0.0.0:39945 every 8 connection(s)
I20260924 14:27:46.773550 18503 rpc-test.cc:532] Connecting to 0.0.0.0:39945
[       OK ] Parameters/TestRpc.TestConnectionAlwaysKeepalive/SSL_TCP (3071 ms)
[ RUN      ] Parameters/TestRpc.TestReopenOutboundConnections/SSL_TCP
I20260924 14:27:49.834820 18709 acceptor_pool.cc:254] collecting diagnostics on the listening RPC socket 0.0.0.0:44585 every 8 connection(s)
I20260924 14:27:49.835595 18710 acceptor_pool.cc:254] collecting diagnostics on the listening RPC socket 0.0.0.0:44585 every 8 connection(s)
I20260924 14:27:49.838881 18503 rpc-test.cc:658] Connecting to 0.0.0.0:44585
[       OK ] Parameters/TestRpc.TestReopenOutboundConnections/SSL_TCP (352 ms)
[ RUN      ] Parameters/TestRpc.TestConnectionNetworkPlane/SSL_TCP
I20260924 14:27:50.190822 18732 acceptor_pool.cc:254] collecting diagnostics on the listening RPC socket 0.0.0.0:33127 every 8 connection(s)
I20260924 14:27:50.191607 18733 acceptor_pool.cc:254] collecting diagnostics on the listening RPC socket 0.0.0.0:33127 every 8 connection(s)
I20260924 14:27:50.194694 18503 rpc-test.cc:772] Connecting to 0.0.0.0:33127
[       OK ] Parameters/TestRpc.TestConnectionNetworkPlane/SSL_TCP (78 ms)
[ RUN      ] Parameters/TestRpc.TestTCPKeepalive/SSL_TCP
I20260924 14:27:50.259892 18757 acceptor_pool.cc:254] collecting diagnostics on the listening RPC socket 0.0.0.0:34955 every 8 connection(s)
I20260924 14:27:50.260635 18758 acceptor_pool.cc:254] collecting diagnostics on the listening RPC socket 0.0.0.0:34955 every 8 connection(s)
I20260924 14:27:50.287711 18761 rpc-test-base.h:222] got call: sleep_micros: 8000000 deferred: true
I20260924 14:27:58.291806 18761 rpcz_store.cc:275] Call kudu.rpc.GenericCalculatorService.Sleep from 127.0.0.1:40626 (request call id 0) took 8004 ms. Trace:
I20260924 14:27:58.292273 18761 rpcz_store.cc:276] 0924 14:27:50.287444 (+     0us) service_pool.cc:170] Inserting onto call queue
0924 14:27:50.287556 (+   112us) service_pool.cc:227] Handling call
0924 14:27:58.291633 (+8004077us) inbound_call.cc:173] Queueing success response
Metrics: {}
[       OK ] Parameters/TestRpc.TestTCPKeepalive/SSL_TCP (8060 ms)
[ RUN      ] Parameters/TestRpc.TestMaxSmallSidecars/SSL_TCP
I20260924 14:27:58.329010 18783 acceptor_pool.cc:254] collecting diagnostics on the listening RPC socket 0.0.0.0:42489 every 8 connection(s)
I20260924 14:27:58.329751 18784 acceptor_pool.cc:254] collecting diagnostics on the listening RPC socket 0.0.0.0:42489 every 8 connection(s)
[       OK ] Parameters/TestRpc.TestMaxSmallSidecars/SSL_TCP (200 ms)
[ RUN      ] Parameters/TestRpc.TestCallTimeout/SSL_TCP
I20260924 14:27:58.531690 18808 acceptor_pool.cc:254] collecting diagnostics on the listening RPC socket 0.0.0.0:38693 every 8 connection(s)
I20260924 14:27:58.532409 18809 acceptor_pool.cc:254] collecting diagnostics on the listening RPC socket 0.0.0.0:38693 every 8 connection(s)
I20260924 14:27:58.552608 18503 rpc-test-base.h:595] status: Timed out: connection negotiation to 0.0.0.0:38693 for RPC Sleep timed out after 0.000s (ON_OUTBOUND_QUEUE), seconds elapsed: 0.00288209
I20260924 14:27:58.560631 18812 rpc-test-base.h:222] got call: sleep_micros: 700000
I20260924 14:27:58.754388 18503 rpc-test-base.h:595] status: Timed out: Sleep RPC to 0.0.0.0:38693 timed out after 0.200s (SENT), seconds elapsed: 0.201368
I20260924 14:27:58.755913 18811 rpc-test-base.h:222] got call: sleep_micros: 2000000
W20260924 14:27:59.261313 18812 rpcz_store.cc:267] Call kudu.rpc.GenericCalculatorService.Sleep from 127.0.0.1:38708 (request call id 1) took 700 ms (client timeout 200 ms). Trace:
W20260924 14:27:59.261646 18812 rpcz_store.cc:269] 0924 14:27:58.560465 (+     0us) service_pool.cc:170] Inserting onto call queue
0924 14:27:58.560572 (+   107us) service_pool.cc:227] Handling call
0924 14:27:59.261242 (+700670us) inbound_call.cc:173] Queueing success response
Metrics: {}
I20260924 14:28:00.256898 18503 rpc-test-base.h:595] status: Timed out: Sleep RPC to 0.0.0.0:38693 timed out after 1.500s (SENT), seconds elapsed: 1.50216
W20260924 14:28:00.756495 18811 rpcz_store.cc:267] Call kudu.rpc.GenericCalculatorService.Sleep from 127.0.0.1:38708 (request call id 2) took 2000 ms (client timeout 1500 ms). Trace:
W20260924 14:28:00.756999 18811 rpcz_store.cc:269] 0924 14:27:58.755630 (+     0us) service_pool.cc:170] Inserting onto call queue
0924 14:27:58.755759 (+   129us) service_pool.cc:227] Handling call
0924 14:28:00.756422 (+2000663us) inbound_call.cc:173] Queueing success response
Metrics: {}
W20260924 14:28:00.757681 18807 connection.cc:441] server connection from 127.0.0.1:38708 torn down before Call kudu.rpc.GenericCalculatorService.Sleep from 127.0.0.1:38708 (request call id 2) could send its response
[       OK ] Parameters/TestRpc.TestCallTimeout/SSL_TCP (2257 ms)
[ RUN      ] Parameters/TestRpc.TestServerShutsDown/SSL_TCP
I20260924 14:28:00.766229 18503 rpc-test.cc:1125] Connecting to 0.0.0.0:41559
W20260924 14:28:00.780841 18825 negotiation.cc:337] Failed RPC negotiation. Trace:
0924 14:28:00.779047 (+     0us) reactor.cc:625] Submitting negotiation task for client connection to 0.0.0.0:41559 (local address 127.0.0.1:54102)
0924 14:28:00.779628 (+   581us) negotiation.cc:107] Waiting for socket to connect
0924 14:28:00.779669 (+    41us) client_negotiation.cc:174] Beginning negotiation
0924 14:28:00.779950 (+   281us) client_negotiation.cc:252] Sending NEGOTIATE NegotiatePB request
0924 14:28:00.780226 (+   276us) negotiation.cc:327] Negotiation complete: Network error: Client connection negotiation failed: client connection to 0.0.0.0:41559: BlockingWrite error: write error: Broken pipe (error 32)
Metrics: {"client-negotiator.queue_time_us":140}
[       OK ] Parameters/TestRpc.TestServerShutsDown/SSL_TCP (19 ms)
[ RUN      ] Parameters/TestRpc.TimedOutOnResponseMetric/SSL_TCP
I20260924 14:28:00.802953 18842 acceptor_pool.cc:254] collecting diagnostics on the listening RPC socket 0.0.0.0:38925 every 8 connection(s)
I20260924 14:28:00.803714 18843 acceptor_pool.cc:254] collecting diagnostics on the listening RPC socket 0.0.0.0:38925 every 8 connection(s)
W20260924 14:28:01.042964 18846 rpcz_store.cc:267] Call kudu.rpc_test.CalculatorService.Sleep from 127.0.0.1:58820 (request call id 3) took 50 ms (client timeout 25 ms). Trace:
W20260924 14:28:01.043262 18846 rpcz_store.cc:269] 0924 14:28:00.992319 (+     0us) service_pool.cc:170] Inserting onto call queue
0924 14:28:00.992407 (+    88us) service_pool.cc:227] Handling call
0924 14:28:01.042896 (+ 50489us) inbound_call.cc:173] Queueing success response
Related trace 'test_child':
Metrics: {"test_sleep_us":50000,"child_traces":[["test_child",{"related_trace_metric":1}]]}
W20260924 14:28:01.102101 18846 rpcz_store.cc:267] Call kudu.rpc_test.CalculatorService.Sleep from 127.0.0.1:58820 (request call id 4) took 50 ms (client timeout 50 ms). Trace:
W20260924 14:28:01.102375 18846 rpcz_store.cc:269] 0924 14:28:01.051576 (+     0us) service_pool.cc:170] Inserting onto call queue
0924 14:28:01.051701 (+   125us) service_pool.cc:227] Handling call
0924 14:28:01.102041 (+ 50340us) inbound_call.cc:173] Queueing success response
Related trace 'test_child':
Metrics: {"test_sleep_us":50000,"child_traces":[["test_child",{"related_trace_metric":1}]]}
[       OK ] Parameters/TestRpc.TimedOutOnResponseMetric/SSL_TCP (326 ms)
[ RUN      ] Parameters/TestRpc.AcceptorDispatchingTimesMetric/SSL_TCP
I20260924 14:28:01.122699 18867 acceptor_pool.cc:254] collecting diagnostics on the listening RPC socket 0.0.0.0:38881 every 8 connection(s)
I20260924 14:28:01.123700 18868 acceptor_pool.cc:254] collecting diagnostics on the listening RPC socket 0.0.0.0:38881 every 8 connection(s)
W20260924 14:28:01.130474 18863 negotiation.cc:337] Failed RPC negotiation. Trace:
0924 14:28:01.127726 (+     0us) reactor.cc:625] Submitting negotiation task for server connection from 127.0.0.1:43922 (local address 127.0.0.1:38881)
0924 14:28:01.128508 (+   782us) server_negotiation.cc:206] Beginning negotiation
0924 14:28:01.128542 (+    34us) server_negotiation.cc:399] Waiting for connection header
0924 14:28:01.128865 (+   323us) negotiation.cc:327] Negotiation complete: Network error: Server connection negotiation failed: server connection from 127.0.0.1:43922: BlockingRecv error: recv got EOF from 127.0.0.1:43922 (error 108)
Metrics: {"server-negotiator.queue_time_us":130}
[       OK ] Parameters/TestRpc.AcceptorDispatchingTimesMetric/SSL_TCP (22 ms)
[ RUN      ] Parameters/TestRpc.TestRpcCallbackDestroysMessenger/SSL_TCP
[       OK ] Parameters/TestRpc.TestRpcCallbackDestroysMessenger/SSL_TCP (44 ms)
[ RUN      ] Parameters/TestRpc.TestApplicationFeatureFlag/SSL_TCP
I20260924 14:28:01.211711 18892 acceptor_pool.cc:254] collecting diagnostics on the listening RPC socket 0.0.0.0:32855 every 8 connection(s)
I20260924 14:28:01.212445 18893 acceptor_pool.cc:254] collecting diagnostics on the listening RPC socket 0.0.0.0:32855 every 8 connection(s)
W20260924 14:28:01.244854 18889 messenger.cc:357] Unable to handle RPC call: Not implemented: call requires unsupported application feature flags: 99
[       OK ] Parameters/TestRpc.TestApplicationFeatureFlag/SSL_TCP (75 ms)
[ RUN      ] Parameters/TestRpc.TestCancellation/SSL_TCP
I20260924 14:28:01.283193 18917 acceptor_pool.cc:254] collecting diagnostics on the listening RPC socket 0.0.0.0:36405 every 8 connection(s)
I20260924 14:28:01.283936 18918 acceptor_pool.cc:254] collecting diagnostics on the listening RPC socket 0.0.0.0:36405 every 8 connection(s)
I20260924 14:28:01.287079 18503 rpc-test.cc:1648] Connecting to 0.0.0.0:36405
I20260924 14:28:01.393086 18503 rpc-test-base.h:595] status: Aborted: Sleep RPC to 0.0.0.0:36405 is cancelled in state READY, seconds elapsed: 0.000424881
I20260924 14:28:01.549427 18503 rpc-test-base.h:595] status: Aborted: Sleep RPC to 0.0.0.0:36405 is cancelled in state SENT, seconds elapsed: 0.00097503
I20260924 14:28:01.601373 18920 rpc-test-base.h:222] got call: sleep_micros: 510000
I20260924 14:28:01.737161 18503 rpc-test-base.h:595] status: Aborted: Sleep RPC to 0.0.0.0:36405 is cancelled in state SENT, seconds elapsed: 0.00106066
I20260924 14:28:01.780638 18919 rpc-test-base.h:222] got call: sleep_micros: 510000
I20260924 14:28:01.897646 18503 rpc-test-base.h:595] status: Aborted: Sleep RPC to 0.0.0.0:36405 is cancelled in state SENT, seconds elapsed: 0.000860801
W20260924 14:28:01.938352 18921 rpcz_store.cc:267] Call kudu.rpc.GenericCalculatorService.Sleep from 127.0.0.1:43090 (request call id 11) took 15 ms (client timeout 10 ms). Trace:
W20260924 14:28:01.938673 18921 rpcz_store.cc:269] 0924 14:28:01.922444 (+     0us) service_pool.cc:170] Inserting onto call queue
0924 14:28:01.938042 (+ 15598us) service_pool.cc:214] Skipping call since client already timed out
0924 14:28:01.938167 (+   125us) inbound_call.cc:173] Queueing failure response
Metrics: {}
I20260924 14:28:01.939167 18921 rpc-test-base.h:222] got call: sleep_micros: 1500000
W20260924 14:28:02.112093 18920 rpcz_store.cc:267] Call kudu.rpc.GenericCalculatorService.Sleep from 127.0.0.1:43090 (request call id 3) took 511 ms (client timeout 10 ms). Trace:
W20260924 14:28:02.112416 18920 rpcz_store.cc:269] 0924 14:28:01.601146 (+     0us) service_pool.cc:170] Inserting onto call queue
0924 14:28:01.601289 (+   143us) service_pool.cc:227] Handling call
0924 14:28:02.112033 (+510744us) inbound_call.cc:173] Queueing success response
Metrics: {}
W20260924 14:28:02.291312 18919 rpcz_store.cc:267] Call kudu.rpc.GenericCalculatorService.Sleep from 127.0.0.1:43090 (request call id 7) took 510 ms (client timeout 10 ms). Trace:
W20260924 14:28:02.291651 18919 rpcz_store.cc:269] 0924 14:28:01.780399 (+     0us) service_pool.cc:170] Inserting onto call queue
0924 14:28:01.780564 (+   165us) service_pool.cc:227] Handling call
0924 14:28:02.291254 (+510690us) inbound_call.cc:173] Queueing success response
Metrics: {}
I20260924 14:28:02.899633 18503 rpc-test-base.h:595] status: Timed out: Sleep RPC to 0.0.0.0:36405 timed out after 1.000s (SENT), seconds elapsed: 1.00155
I20260924 14:28:02.901049 18919 rpc-test-base.h:222] got call: sleep_micros: 1500000
W20260924 14:28:03.439738 18921 rpcz_store.cc:267] Call kudu.rpc.GenericCalculatorService.Sleep from 127.0.0.1:43090 (request call id 12) took 1517 ms (client timeout 1000 ms). Trace:
W20260924 14:28:03.440112 18921 rpcz_store.cc:269] 0924 14:28:01.922793 (+     0us) service_pool.cc:170] Inserting onto call queue
0924 14:28:01.939123 (+ 16330us) service_pool.cc:227] Handling call
0924 14:28:03.439678 (+1500555us) inbound_call.cc:173] Queueing success response
Metrics: {}
I20260924 14:28:03.901661 18503 rpc-test-base.h:595] status: Timed out: Sleep RPC to 0.0.0.0:36405 timed out after 1.000s (SENT), seconds elapsed: 1.00171
W20260924 14:28:03.903070 18914 messenger.cc:357] Unable to handle RPC call: Not implemented: call requires unsupported application feature flags: 99, 1
W20260924 14:28:03.904608 18914 messenger.cc:357] Unable to handle RPC call: Not implemented: call requires unsupported application feature flags: 99, 1
W20260924 14:28:04.401592 18919 rpcz_store.cc:267] Call kudu.rpc.GenericCalculatorService.Sleep from 127.0.0.1:43090 (request call id 13) took 1500 ms (client timeout 1000 ms). Trace:
W20260924 14:28:04.401911 18919 rpcz_store.cc:269] 0924 14:28:02.900840 (+     0us) service_pool.cc:170] Inserting onto call queue
0924 14:28:02.901002 (+   162us) service_pool.cc:227] Handling call
0924 14:28:04.401529 (+1500527us) inbound_call.cc:173] Queueing success response
Metrics: {}
W20260924 14:28:04.402508 18914 connection.cc:441] server connection from 127.0.0.1:43090 torn down before Call kudu.rpc.GenericCalculatorService.Sleep from 127.0.0.1:43090 (request call id 13) could send its response
[       OK ] Parameters/TestRpc.TestCancellation/SSL_TCP (3155 ms)
[ RUN      ] Parameters/TestRpc.TestCancellationMultiThreads/SSL_TCP
I20260924 14:28:04.461234 18942 acceptor_pool.cc:254] collecting diagnostics on the listening RPC socket 0.0.0.0:46555 every 8 connection(s)
I20260924 14:28:04.461966 18943 acceptor_pool.cc:254] collecting diagnostics on the listening RPC socket 0.0.0.0:46555 every 8 connection(s)
I20260924 14:28:04.465070 18503 rpc-test.cc:1808] Connecting to 0.0.0.0:46555
I20260924 14:28:04.620995 18956 test_util.cc:268] Using random seed: 1751531173
I20260924 14:28:04.622123 18957 test_util.cc:268] Using random seed: 1751532306
I20260924 14:28:04.623473 18958 test_util.cc:268] Using random seed: 1751533655
I20260924 14:28:04.624827 18959 test_util.cc:268] Using random seed: 1751534995
I20260924 14:28:04.626471 18960 test_util.cc:268] Using random seed: 1751536502
I20260924 14:28:04.627944 18961 test_util.cc:268] Using random seed: 1751537989
I20260924 14:28:04.629562 18962 test_util.cc:268] Using random seed: 1751539592
I20260924 14:28:04.631224 18963 test_util.cc:268] Using random seed: 1751541273
I20260924 14:28:04.632591 18964 test_util.cc:268] Using random seed: 1751542672
I20260924 14:28:04.634001 18965 test_util.cc:268] Using random seed: 1751544080
I20260924 14:28:04.635428 18966 test_util.cc:268] Using random seed: 1751545471
I20260924 14:28:04.636858 18967 test_util.cc:268] Using random seed: 1751546886
I20260924 14:28:04.638229 18968 test_util.cc:268] Using random seed: 1751548310
I20260924 14:28:04.639705 18969 test_util.cc:268] Using random seed: 1751549757
I20260924 14:28:04.641592 18970 test_util.cc:268] Using random seed: 1751551569
I20260924 14:28:04.644095 18971 test_util.cc:268] Using random seed: 1751554137
I20260924 14:28:04.645849 18972 test_util.cc:268] Using random seed: 1751555878
I20260924 14:28:04.647550 18973 test_util.cc:268] Using random seed: 1751557515
I20260924 14:28:04.649173 18974 test_util.cc:268] Using random seed: 1751559188
I20260924 14:28:04.650851 18975 test_util.cc:268] Using random seed: 1751560837
I20260924 14:28:04.653010 18976 test_util.cc:268] Using random seed: 1751563014
I20260924 14:28:04.654889 18977 test_util.cc:268] Using random seed: 1751564928
I20260924 14:28:04.656592 18978 test_util.cc:268] Using random seed: 1751566539
I20260924 14:28:04.658618 18979 test_util.cc:268] Using random seed: 1751568627
I20260924 14:28:04.660256 18980 test_util.cc:268] Using random seed: 1751570274
I20260924 14:28:04.662037 18981 test_util.cc:268] Using random seed: 1751572081
I20260924 14:28:04.664354 18982 test_util.cc:268] Using random seed: 1751574395
I20260924 14:28:04.666249 18983 test_util.cc:268] Using random seed: 1751576266
I20260924 14:28:04.672322 18984 test_util.cc:268] Using random seed: 1751582320
I20260924 14:28:04.675383 18985 test_util.cc:268] Using random seed: 1751585381
[       OK ] Parameters/TestRpc.TestCancellationMultiThreads/SSL_TCP (17675 ms)
[ RUN      ] Parameters/TestRpc.TestCallId/SSL_TCP
I20260924 14:28:22.101392 18999 acceptor_pool.cc:254] collecting diagnostics on the listening RPC socket 0.0.0.0:34653 every 8 connection(s)
I20260924 14:28:22.102219 19000 acceptor_pool.cc:254] collecting diagnostics on the listening RPC socket 0.0.0.0:34653 every 8 connection(s)
[       OK ] Parameters/TestRpc.TestCallId/SSL_TCP (81 ms)
[----------] 20 tests from Parameters/TestRpc (37328 ms total)

[----------] Global test environment tear-down
[==========] 21 tests from 2 test suites ran. (37335 ms total)
[  PASSED  ] 20 tests.
[  FAILED  ] 1 test, listed below:
[  FAILED  ] Parameters/TestRpc.TestCallWithChainCertAndRootCA/SSL_TCP, where GetParam() = (true, false)

 1 FAILED TEST