Diagnosed failure

Parameters/TestRpc.TestCallWithChainCertAndChainCA/SSL_UnixSocket: /data0/somelongdirectorytoavoidrpathissues/src/kudu/src/kudu/rpc/rpc-test.cc:270: Failure
Failed
Bad status: Runtime error: could not verify certificate chain (error with cert: subject=CN = localhost, ST = sadfjas, C = AS, emailAddress = sdflkdsajf, O = lskdfjlsad, OU = sldfkja, issuer=C = AS, ST = ASDfkjdhf, L = lskdjf, O = saldfja, OU = skdjf, CN = localhost, emailAddress = sadjflkadsj): : certificate has expired
Google Test trace:
/data0/somelongdirectorytoavoidrpathissues/src/kudu/src/kudu/rpc/rpc-test.cc:267: Connecting to unix:/tmp/dist-test-taskGnOldu/test-tmp/rpc-test-22190acb945f49189f579f83ad0858c2.sock
I20260929 06:29:33.921402   383 test_util.cc:175] -----------------------------------------------
I20260929 06:29:33.921476   383 test_util.cc:176] Had fatal failures, leaving test files at /tmp/dist-test-taskGnOldu/test-tmp/rpc-test.6.Parameters_TestRpc.TestCallWithChainCertAndChainCA_SSL_UnixSocket.1790663373861707-383-0

Full log

Note: This is test shard 7 of 8.
[==========] Running 21 tests from 2 test suites.
[----------] Global test environment set-up.
[----------] 20 tests from Parameters/TestRpc
[ RUN      ] Parameters/TestRpc.TestMessengerCreateDestroy/SSL_UnixSocket
WARNING: Logging before InitGoogleLogging() is written to STDERR
I20260929 06:29:33.888818   383 rpc-test.cc:169] started messenger TestCreateDestroy
[       OK ] Parameters/TestRpc.TestMessengerCreateDestroy/SSL_UnixSocket (25 ms)
[ RUN      ] Parameters/TestRpc.TestNegotiationDeadlock/SSL_UnixSocket
I20260929 06:29:33.899060   403 acceptor_pool.cc:254] collecting diagnostics on the listening RPC socket unix:/tmp/dist-test-taskGnOldu/test-tmp/rpc-test-04aef20fb3354bd2910d030bc7f92153.sock every 8 connection(s)
I20260929 06:29:33.899101   404 acceptor_pool.cc:254] collecting diagnostics on the listening RPC socket unix:/tmp/dist-test-taskGnOldu/test-tmp/rpc-test-04aef20fb3354bd2910d030bc7f92153.sock every 8 connection(s)
[       OK ] Parameters/TestRpc.TestNegotiationDeadlock/SSL_UnixSocket (15 ms)
[ RUN      ] Parameters/TestRpc.TestCallWithChainCertAndChainCA/SSL_UnixSocket
I20260929 06:29:33.917532   419 acceptor_pool.cc:254] collecting diagnostics on the listening RPC socket unix:/tmp/dist-test-taskGnOldu/test-tmp/rpc-test-22190acb945f49189f579f83ad0858c2.sock every 8 connection(s)
I20260929 06:29:33.917577   420 acceptor_pool.cc:254] collecting diagnostics on the listening RPC socket unix:/tmp/dist-test-taskGnOldu/test-tmp/rpc-test-22190acb945f49189f579f83ad0858c2.sock every 8 connection(s)
/data0/somelongdirectorytoavoidrpathissues/src/kudu/src/kudu/rpc/rpc-test.cc:270: Failure
Failed
Bad status: Runtime error: could not verify certificate chain (error with cert: subject=CN = localhost, ST = sadfjas, C = AS, emailAddress = sdflkdsajf, O = lskdfjlsad, OU = sldfkja, issuer=C = AS, ST = ASDfkjdhf, L = lskdjf, O = saldfja, OU = skdjf, CN = localhost, emailAddress = sadjflkadsj): : certificate has expired
Google Test trace:
/data0/somelongdirectorytoavoidrpathissues/src/kudu/src/kudu/rpc/rpc-test.cc:267: Connecting to unix:/tmp/dist-test-taskGnOldu/test-tmp/rpc-test-22190acb945f49189f579f83ad0858c2.sock
I20260929 06:29:33.921402   383 test_util.cc:175] -----------------------------------------------
I20260929 06:29:33.921476   383 test_util.cc:176] Had fatal failures, leaving test files at /tmp/dist-test-taskGnOldu/test-tmp/rpc-test.6.Parameters_TestRpc.TestCallWithChainCertAndChainCA_SSL_UnixSocket.1790663373861707-383-0
[  FAILED  ] Parameters/TestRpc.TestCallWithChainCertAndChainCA/SSL_UnixSocket, where GetParam() = (true, true) (15 ms)
[ RUN      ] Parameters/TestRpc.TestCallWithPasswordProtectedKey/SSL_UnixSocket
I20260929 06:29:33.928489   444 acceptor_pool.cc:254] collecting diagnostics on the listening RPC socket unix:/tmp/dist-test-taskGnOldu/test-tmp/rpc-test-1b62f5e23da1418e9ec1382c6cfd093e.sock every 8 connection(s)
I20260929 06:29:33.928547   445 acceptor_pool.cc:254] collecting diagnostics on the listening RPC socket unix:/tmp/dist-test-taskGnOldu/test-tmp/rpc-test-1b62f5e23da1418e9ec1382c6cfd093e.sock every 8 connection(s)
W20260929 06:29:33.939895   441 connection.cc:196] Error closing socket: Network error: TlsSocket::Close: Broken pipe
[       OK ] Parameters/TestRpc.TestCallWithPasswordProtectedKey/SSL_UnixSocket (19 ms)
[ RUN      ] Parameters/TestRpc.TestCallToBadServer/SSL_UnixSocket
I20260929 06:29:33.953603   383 rpc-test.cc:394] Status: Network error: Client connection negotiation failed: client connection to 0.0.0.0:0: connect: Connection refused (error 111)
I20260929 06:29:33.953890   383 rpc-test.cc:394] Status: Network error: Client connection negotiation failed: client connection to 0.0.0.0:0: connect: Connection refused (error 111)
I20260929 06:29:33.954357   383 rpc-test.cc:394] Status: Network error: Client connection negotiation failed: client connection to 0.0.0.0:0: connect: Connection refused (error 111)
I20260929 06:29:33.954773   383 rpc-test.cc:394] Status: Network error: Client connection negotiation failed: client connection to 0.0.0.0:0: connect: Connection refused (error 111)
I20260929 06:29:33.955035   383 rpc-test.cc:394] Status: Network error: Client connection negotiation failed: client connection to 0.0.0.0:0: connect: Connection refused (error 111)
[       OK ] Parameters/TestRpc.TestCallToBadServer/SSL_UnixSocket (14 ms)
[ RUN      ] Parameters/TestRpc.TestWrongService/SSL_UnixSocket
I20260929 06:29:33.973249   479 acceptor_pool.cc:254] collecting diagnostics on the listening RPC socket unix:/tmp/dist-test-taskGnOldu/test-tmp/rpc-test-c0e85353b13644b9a7a92780e14116ff.sock every 8 connection(s)
I20260929 06:29:33.973289   480 acceptor_pool.cc:254] collecting diagnostics on the listening RPC socket unix:/tmp/dist-test-taskGnOldu/test-tmp/rpc-test-c0e85353b13644b9a7a92780e14116ff.sock every 8 connection(s)
I20260929 06:29:33.984931   476 messenger.cc:345] service WrongServiceName not registered on TestServer
W20260929 06:29:33.986419   476 connection.cc:196] Error closing socket: Network error: TlsSocket::Close: Broken pipe
[       OK ] Parameters/TestRpc.TestWrongService/SSL_UnixSocket (32 ms)
[ RUN      ] Parameters/TestRpc.TestConnectionKeepalive/SSL_UnixSocket
I20260929 06:29:34.013152   502 acceptor_pool.cc:254] collecting diagnostics on the listening RPC socket unix:/tmp/dist-test-taskGnOldu/test-tmp/rpc-test-c1fa998f34a341c9b99c8d8c5219ffb1.sock every 8 connection(s)
I20260929 06:29:34.013209   503 acceptor_pool.cc:254] collecting diagnostics on the listening RPC socket unix:/tmp/dist-test-taskGnOldu/test-tmp/rpc-test-c1fa998f34a341c9b99c8d8c5219ffb1.sock every 8 connection(s)
I20260929 06:29:34.013353   383 rpc-test.cc:488] Connecting to unix:/tmp/dist-test-taskGnOldu/test-tmp/rpc-test-c1fa998f34a341c9b99c8d8c5219ffb1.sock
W20260929 06:29:34.490160   515 connection.cc:196] Error closing socket: Network error: TlsSocket::Close: Broken pipe
[       OK ] Parameters/TestRpc.TestConnectionKeepalive/SSL_UnixSocket (1052 ms)
[ RUN      ] Parameters/TestRpc.TestClientConnectionMetrics/SSL_UnixSocket
I20260929 06:29:35.049328   528 acceptor_pool.cc:254] collecting diagnostics on the listening RPC socket unix:/tmp/dist-test-taskGnOldu/test-tmp/rpc-test-5e31851b5d474f42ad204ce779e63ec8.sock every 8 connection(s)
I20260929 06:29:35.049520   383 rpc-test.cc:569] Connecting to unix:/tmp/dist-test-taskGnOldu/test-tmp/rpc-test-5e31851b5d474f42ad204ce779e63ec8.sock
I20260929 06:29:35.049328   527 acceptor_pool.cc:254] collecting diagnostics on the listening RPC socket unix:/tmp/dist-test-taskGnOldu/test-tmp/rpc-test-5e31851b5d474f42ad204ce779e63ec8.sock every 8 connection(s)
W20260929 06:29:43.629236   524 connection.cc:196] Error closing socket: Network error: TlsSocket::Close: Broken pipe
[       OK ] Parameters/TestRpc.TestClientConnectionMetrics/SSL_UnixSocket (8589 ms)
[ RUN      ] Parameters/TestRpc.TestCredentialsPolicy/SSL_UnixSocket
I20260929 06:29:43.649855   550 acceptor_pool.cc:254] collecting diagnostics on the listening RPC socket unix:/tmp/dist-test-taskGnOldu/test-tmp/rpc-test-464b4071d1f6464caf3dfc35fabf2b0f.sock every 8 connection(s)
I20260929 06:29:43.649885   551 acceptor_pool.cc:254] collecting diagnostics on the listening RPC socket unix:/tmp/dist-test-taskGnOldu/test-tmp/rpc-test-464b4071d1f6464caf3dfc35fabf2b0f.sock every 8 connection(s)
I20260929 06:29:43.650068   383 rpc-test.cc:700] Connecting to unix:/tmp/dist-test-taskGnOldu/test-tmp/rpc-test-464b4071d1f6464caf3dfc35fabf2b0f.sock
W20260929 06:29:43.678817   549 connection.cc:196] Error closing socket: Network error: TlsSocket::Close: Broken pipe
[       OK ] Parameters/TestRpc.TestCredentialsPolicy/SSL_UnixSocket (53 ms)
[ RUN      ] Parameters/TestRpc.TestCallLongerThanKeepalive/SSL_UnixSocket
I20260929 06:29:43.695986   575 acceptor_pool.cc:254] collecting diagnostics on the listening RPC socket unix:/tmp/dist-test-taskGnOldu/test-tmp/rpc-test-b0d049aaecaa4d2cbfe226808fbbb6c5.sock every 8 connection(s)
I20260929 06:29:43.696033   576 acceptor_pool.cc:254] collecting diagnostics on the listening RPC socket unix:/tmp/dist-test-taskGnOldu/test-tmp/rpc-test-b0d049aaecaa4d2cbfe226808fbbb6c5.sock every 8 connection(s)
I20260929 06:29:43.711437   579 rpc-test-base.h:222] got call: sleep_micros: 3000000 deferred: true
I20260929 06:29:46.712110   579 rpcz_store.cc:275] Call kudu.rpc.GenericCalculatorService.Sleep from unix:<unnamed> (request call id 0) took 3000 ms. Trace:
I20260929 06:29:46.712199   579 rpcz_store.cc:276] 0929 06:29:43.711366 (+     0us) service_pool.cc:170] Inserting onto call queue
0929 06:29:43.711422 (+    56us) service_pool.cc:227] Handling call
0929 06:29:46.712096 (+3000674us) inbound_call.cc:173] Queueing success response
Metrics: {}
[       OK ] Parameters/TestRpc.TestCallLongerThanKeepalive/SSL_UnixSocket (3030 ms)
[ RUN      ] Parameters/TestRpc.TestRpcSidecar/SSL_UnixSocket
I20260929 06:29:46.732357   600 acceptor_pool.cc:254] collecting diagnostics on the listening RPC socket unix:/tmp/dist-test-taskGnOldu/test-tmp/rpc-test-238b16a2090d43639ca1349a47630cae.sock every 8 connection(s)
I20260929 06:29:46.732394   601 acceptor_pool.cc:254] collecting diagnostics on the listening RPC socket unix:/tmp/dist-test-taskGnOldu/test-tmp/rpc-test-238b16a2090d43639ca1349a47630cae.sock every 8 connection(s)
W20260929 06:29:46.775733   597 connection.cc:196] Error closing socket: Network error: TlsSocket::Close: Broken pipe
[       OK ] Parameters/TestRpc.TestRpcSidecar/SSL_UnixSocket (62 ms)
[ RUN      ] Parameters/TestRpc.TestRpcSidecarLimits/SSL_UnixSocket
I20260929 06:29:48.484674   625 acceptor_pool.cc:254] collecting diagnostics on the listening RPC socket unix:/tmp/dist-test-taskGnOldu/test-tmp/rpc-test-1e0d95b7269e4a2b810625b174fcff15.sock every 8 connection(s)
I20260929 06:29:48.485175   626 acceptor_pool.cc:254] collecting diagnostics on the listening RPC socket unix:/tmp/dist-test-taskGnOldu/test-tmp/rpc-test-1e0d95b7269e4a2b810625b174fcff15.sock every 8 connection(s)
W20260929 06:29:48.489598   383 serialization.cc:72] Serialized kudu.rpc_test.PushStringsRequestPB (2147483654 bytes) is larger than the maximum configured RPC message size (52428800 bytes). Sending anyway, but peer may reject the data.
W20260929 06:29:48.492410   622 connection.cc:535] server connection from unix:<unnamed> recv error: Network error: RPC frame had a length of 2147483714, but we only support messages up to 52428800 bytes long.
W20260929 06:29:48.492462   622 connection.cc:158] shutting down server connection from unix:<unnamed> with pending inbound data: 4/2147483714 bytes received; last active 0 ns ago: status Network error: RPC frame had a length of 2147483714, but we only support messages up to 52428800 bytes long.
W20260929 06:29:48.492635   638 connection.cc:196] Error closing socket: Network error: TlsSocket::Close: Broken pipe
I20260929 06:29:48.510329   650 acceptor_pool.cc:254] collecting diagnostics on the listening RPC socket unix:/tmp/dist-test-taskGnOldu/test-tmp/rpc-test-1e0d95b7269e4a2b810625b174fcff15.sock every 8 connection(s)
I20260929 06:29:48.510524   651 acceptor_pool.cc:254] collecting diagnostics on the listening RPC socket unix:/tmp/dist-test-taskGnOldu/test-tmp/rpc-test-1e0d95b7269e4a2b810625b174fcff15.sock every 8 connection(s)
W20260929 06:29:52.852154   647 connection.cc:577] server connection from unix:<unnamed>: received bad data: 'Corruption: Invalid packet: message had a length of 2147483710, but we only support messages up to 2147483647 bytes
'
W20260929 06:29:52.852407   663 connection.cc:196] Error closing socket: Network error: TlsSocket::Close: Broken pipe
[       OK ] Parameters/TestRpc.TestRpcSidecarLimits/SSL_UnixSocket (6077 ms)
[ RUN      ] Parameters/TestRpc.TestCallTimeoutDoesntAffectNegotiation/SSL_UnixSocket
I20260929 06:29:52.864805   676 acceptor_pool.cc:254] collecting diagnostics on the listening RPC socket unix:/tmp/dist-test-taskGnOldu/test-tmp/rpc-test-448d23bf3f6a42c2924368c9edb5b957.sock every 8 connection(s)
I20260929 06:29:52.864982   675 acceptor_pool.cc:254] collecting diagnostics on the listening RPC socket unix:/tmp/dist-test-taskGnOldu/test-tmp/rpc-test-448d23bf3f6a42c2924368c9edb5b957.sock every 8 connection(s)
W20260929 06:29:52.879259   670 negotiation.cc:266] Injecting 500ms delay in negotiation
I20260929 06:29:52.929508   383 rpc-test-base.h:595] status: Timed out: connection negotiation to unix:/tmp/dist-test-taskGnOldu/test-tmp/rpc-test-448d23bf3f6a42c2924368c9edb5b957.sock for RPC Sleep timed out after 0.050s (ON_OUTBOUND_QUEUE), seconds elapsed: 0.0505546
[       OK ] Parameters/TestRpc.TestCallTimeoutDoesntAffectNegotiation/SSL_UnixSocket (530 ms)
[ RUN      ] Parameters/TestRpc.TestRpcHandlerLatencyMetric/SSL_UnixSocket
I20260929 06:29:53.424962   700 acceptor_pool.cc:254] collecting diagnostics on the listening RPC socket unix:/tmp/dist-test-taskGnOldu/test-tmp/rpc-test-3a39b28214b346d48a4c9db4b80dbbfd.sock every 8 connection(s)
I20260929 06:29:53.425012   701 acceptor_pool.cc:254] collecting diagnostics on the listening RPC socket unix:/tmp/dist-test-taskGnOldu/test-tmp/rpc-test-3a39b28214b346d48a4c9db4b80dbbfd.sock every 8 connection(s)
I20260929 06:29:53.478854   383 rpc-test.cc:1236] Sleep() min lat: 20328
I20260929 06:29:53.478924   383 rpc-test.cc:1237] Sleep() mean lat: 20328
I20260929 06:29:53.478950   383 rpc-test.cc:1238] Sleep() max lat: 20328
I20260929 06:29:53.478963   383 rpc-test.cc:1239] Sleep() #calls: 1
W20260929 06:29:53.479605   697 connection.cc:196] Error closing socket: Network error: TlsSocket::Close: Broken pipe
[       OK ] Parameters/TestRpc.TestRpcHandlerLatencyMetric/SSL_UnixSocket (96 ms)
[ RUN      ] Parameters/TestRpc.TimedOutOnResponseMetricServiceQueue/SSL_UnixSocket
I20260929 06:29:53.493383   726 acceptor_pool.cc:254] collecting diagnostics on the listening RPC socket unix:/tmp/dist-test-taskGnOldu/test-tmp/rpc-test-f3fb331ce8fc4aa3b22fd3e0418391ca.sock every 8 connection(s)
I20260929 06:29:53.493412   727 acceptor_pool.cc:254] collecting diagnostics on the listening RPC socket unix:/tmp/dist-test-taskGnOldu/test-tmp/rpc-test-f3fb331ce8fc4aa3b22fd3e0418391ca.sock every 8 connection(s)
W20260929 06:29:53.555059   728 rpcz_store.cc:267] Call kudu.rpc_test.CalculatorService.Sleep from unix:<unnamed> (request call id 2) took 20 ms (client timeout 20 ms). Trace:
W20260929 06:29:53.555193   728 rpcz_store.cc:269] 0929 06:29:53.534711 (+     0us) service_pool.cc:170] Inserting onto call queue
0929 06:29:53.555030 (+ 20319us) service_pool.cc:214] Skipping call since client already timed out
0929 06:29:53.555040 (+    10us) inbound_call.cc:173] Queueing failure response
Metrics: {}
W20260929 06:29:53.555934   723 connection.cc:196] Error closing socket: Network error: TlsSocket::Close: Broken pipe
[       OK ] Parameters/TestRpc.TimedOutOnResponseMetricServiceQueue/SSL_UnixSocket (75 ms)
[ RUN      ] Parameters/TestRpc.RpcPendingConnectionsMetric/SSL_UnixSocket
I20260929 06:29:53.558444   749 acceptor_pool.cc:254] collecting diagnostics on the listening RPC socket 0.0.0.0:35569 every 8 connection(s)
I20260929 06:29:53.558539   750 acceptor_pool.cc:254] collecting diagnostics on the listening RPC socket 0.0.0.0:35569 every 8 connection(s)
W20260929 06:29:53.567366   745 negotiation.cc:337] Failed RPC negotiation. Trace:
0929 06:29:53.567180 (+     0us) reactor.cc:625] Submitting negotiation task for server connection from 127.0.0.1:34490 (local address 127.0.0.1:35569)
0929 06:29:53.567244 (+    64us) server_negotiation.cc:206] Beginning negotiation
0929 06:29:53.567245 (+     1us) server_negotiation.cc:399] Waiting for connection header
0929 06:29:53.567310 (+    65us) negotiation.cc:327] Negotiation complete: Network error: Server connection negotiation failed: server connection from 127.0.0.1:34490: BlockingRecv error: recv got EOF from 127.0.0.1:34490 (error 108)
Metrics: {"server-negotiator.queue_time_us":20}
[       OK ] Parameters/TestRpc.RpcPendingConnectionsMetric/SSL_UnixSocket (21 ms)
[ RUN      ] Parameters/TestRpc.TestRpcContextClientDeadline/SSL_UnixSocket
I20260929 06:29:53.585048   765 acceptor_pool.cc:254] collecting diagnostics on the listening RPC socket unix:/tmp/dist-test-taskGnOldu/test-tmp/rpc-test-660eff3a732b4f548ef965933adb2b0e.sock every 8 connection(s)
I20260929 06:29:53.585088   766 acceptor_pool.cc:254] collecting diagnostics on the listening RPC socket unix:/tmp/dist-test-taskGnOldu/test-tmp/rpc-test-660eff3a732b4f548ef965933adb2b0e.sock every 8 connection(s)
[       OK ] Parameters/TestRpc.TestRpcContextClientDeadline/SSL_UnixSocket (40 ms)
[ RUN      ] Parameters/TestRpc.TestApplicationFeatureFlagUnsupportedServer/SSL_UnixSocket
I20260929 06:29:53.632194   790 acceptor_pool.cc:254] collecting diagnostics on the listening RPC socket unix:/tmp/dist-test-taskGnOldu/test-tmp/rpc-test-66f331d0f96a4d1196a6c597a7cd94f5.sock every 8 connection(s)
I20260929 06:29:53.632241   791 acceptor_pool.cc:254] collecting diagnostics on the listening RPC socket unix:/tmp/dist-test-taskGnOldu/test-tmp/rpc-test-66f331d0f96a4d1196a6c597a7cd94f5.sock every 8 connection(s)
[       OK ] Parameters/TestRpc.TestApplicationFeatureFlagUnsupportedServer/SSL_UnixSocket (43 ms)
[ RUN      ] Parameters/TestRpc.TestCancellationAsync/SSL_UnixSocket
I20260929 06:29:53.668509   815 acceptor_pool.cc:254] collecting diagnostics on the listening RPC socket unix:/tmp/dist-test-taskGnOldu/test-tmp/rpc-test-bd842712c4914420b3cd88e3d34eb299.sock every 8 connection(s)
I20260929 06:29:53.668565   816 acceptor_pool.cc:254] collecting diagnostics on the listening RPC socket unix:/tmp/dist-test-taskGnOldu/test-tmp/rpc-test-bd842712c4914420b3cd88e3d34eb299.sock every 8 connection(s)
I20260929 06:29:53.668735   383 rpc-test.cc:1716] Connecting to unix:/tmp/dist-test-taskGnOldu/test-tmp/rpc-test-bd842712c4914420b3cd88e3d34eb299.sock
I20260929 06:29:53.693677   383 test_util.cc:268] Using random seed: 1333678057
I20260929 06:29:53.707389   819 rpc-test-base.h:240] got call: sleep_micros: 500 pattern: 4294967295 num_repetitions: 2097152 sidecar_idx: 0
I20260929 06:29:53.719017   819 rpc-test-base.h:240] got call: sleep_micros: 500 pattern: 4294967295 num_repetitions: 2097152 sidecar_idx: 0
I20260929 06:29:53.729312   819 rpc-test-base.h:240] got call: sleep_micros: 500 pattern: 4294967295 num_repetitions: 2097152 sidecar_idx: 0
I20260929 06:29:53.739609   819 rpc-test-base.h:240] got call: sleep_micros: 500 pattern: 4294967295 num_repetitions: 2097152 sidecar_idx: 0
I20260929 06:29:53.750123   819 rpc-test-base.h:240] got call: sleep_micros: 500 pattern: 4294967295 num_repetitions: 2097152 sidecar_idx: 0
I20260929 06:29:53.760123   819 rpc-test-base.h:240] got call: sleep_micros: 500 pattern: 4294967295 num_repetitions: 2097152 sidecar_idx: 0
I20260929 06:29:53.770078   819 rpc-test-base.h:240] got call: sleep_micros: 500 pattern: 4294967295 num_repetitions: 2097152 sidecar_idx: 0
I20260929 06:29:53.780381   819 rpc-test-base.h:240] got call: sleep_micros: 500 pattern: 4294967295 num_repetitions: 2097152 sidecar_idx: 0
W20260929 06:29:53.781575   812 connection.cc:196] Error closing socket: Network error: TlsSocket::Close: Broken pipe
W20260929 06:29:53.783602   812 connection.cc:441] server connection from unix:<unnamed> torn down before Call kudu.rpc.GenericCalculatorService.SleepWithSidecar from unix:<unnamed> (request call id 9) could send its response
[       OK ] Parameters/TestRpc.TestCancellationAsync/SSL_UnixSocket (121 ms)
[ RUN      ] Parameters/TestRpc.TestPerformanceBySocketType/SSL_UnixSocket
I20260929 06:29:53.803387   840 acceptor_pool.cc:254] collecting diagnostics on the listening RPC socket unix:/tmp/dist-test-taskGnOldu/test-tmp/rpc-test-3d417a9bf75447139dbe625c7339ee20.sock every 8 connection(s)
I20260929 06:29:53.803406   841 acceptor_pool.cc:254] collecting diagnostics on the listening RPC socket unix:/tmp/dist-test-taskGnOldu/test-tmp/rpc-test-3d417a9bf75447139dbe625c7339ee20.sock every 8 connection(s)
I20260929 06:29:53.803571   383 rpc-test.cc:1846] Connecting to unix:/tmp/dist-test-taskGnOldu/test-tmp/rpc-test-3d417a9bf75447139dbe625c7339ee20.sock
I20260929 06:29:55.052078   383 rpc-test.cc:1859] Sending 1024MB via ssl-enabled unix socket: real 1.237s	user 1.276s	sys 0.952s
I20260929 06:29:56.269928   383 rpc-test.cc:1859] Sending 1024MB via ssl-enabled unix socket: real 1.218s	user 1.336s	sys 0.862s
I20260929 06:29:57.471691   383 rpc-test.cc:1859] Sending 1024MB via ssl-enabled unix socket: real 1.202s	user 1.200s	sys 0.977s
I20260929 06:29:58.693679   383 rpc-test.cc:1859] Sending 1024MB via ssl-enabled unix socket: real 1.222s	user 1.308s	sys 0.904s
I20260929 06:29:59.907567   383 rpc-test.cc:1859] Sending 1024MB via ssl-enabled unix socket: real 1.214s	user 1.330s	sys 0.866s
W20260929 06:29:59.908200   837 connection.cc:196] Error closing socket: Network error: TlsSocket::Close: Broken pipe
[       OK ] Parameters/TestRpc.TestPerformanceBySocketType/SSL_UnixSocket (6124 ms)
[----------] 20 tests from Parameters/TestRpc (26044 ms total)

[----------] 1 test from Parameters/TestRpcSocketTxRxQueue
[ RUN      ] Parameters/TestRpcSocketTxRxQueue.AcceptorRxQueueSizeMetric/0
I20260929 06:29:59.915407   865 acceptor_pool.cc:254] collecting diagnostics on the listening RPC socket 0.0.0.0:40093 every 1 connection(s)
I20260929 06:29:59.915462   866 acceptor_pool.cc:254] collecting diagnostics on the listening RPC socket 0.0.0.0:40093 every 1 connection(s)
W20260929 06:29:59.915961   861 negotiation.cc:337] Failed RPC negotiation. Trace:
0929 06:29:59.915815 (+     0us) reactor.cc:625] Submitting negotiation task for server connection from 127.0.0.1:53852 (local address 127.0.0.1:40093)
0929 06:29:59.915857 (+    42us) server_negotiation.cc:206] Beginning negotiation
0929 06:29:59.915858 (+     1us) server_negotiation.cc:399] Waiting for connection header
0929 06:29:59.915931 (+    73us) negotiation.cc:327] Negotiation complete: Network error: Server connection negotiation failed: server connection from 127.0.0.1:53852: BlockingRecv error: recv got EOF from 127.0.0.1:53852 (error 108)
Metrics: {"server-negotiator.queue_time_us":13}
[       OK ] Parameters/TestRpcSocketTxRxQueue.AcceptorRxQueueSizeMetric/0 (8 ms)
[----------] 1 test from Parameters/TestRpcSocketTxRxQueue (8 ms total)

[----------] Global test environment tear-down
[==========] 21 tests from 2 test suites ran. (26053 ms total)
[  PASSED  ] 20 tests.
[  FAILED  ] 1 test, listed below:
[  FAILED  ] Parameters/TestRpc.TestCallWithChainCertAndChainCA/SSL_UnixSocket, where GetParam() = (true, true)

 1 FAILED TEST