Diagnosed failure

Parameters/TestRpc.TestCallWithChainCertAndChainCA/SSL_TCP: /data0/somelongdirectorytoavoidrpathissues/src/kudu/src/kudu/rpc/rpc-test.cc:270: Failure
Failed
Bad status: Runtime error: could not verify certificate chain (error with cert: subject=CN = localhost, ST = sadfjas, C = AS, emailAddress = sdflkdsajf, O = lskdfjlsad, OU = sldfkja, issuer=C = AS, ST = ASDfkjdhf, L = lskdjf, O = saldfja, OU = skdjf, CN = localhost, emailAddress = sadjflkadsj): : certificate has expired
Google Test trace:
/data0/somelongdirectorytoavoidrpathissues/src/kudu/src/kudu/rpc/rpc-test.cc:267: Connecting to 0.0.0.0:39161
I20260925 17:25:29.443692  1612 test_util.cc:175] -----------------------------------------------
I20260925 17:25:29.443753  1612 test_util.cc:176] Had fatal failures, leaving test files at /tmp/dist-test-taskCisHUJ/test-tmp/rpc-test.5.Parameters_TestRpc.TestCallWithChainCertAndChainCA_SSL_TCP.1790357129339197-1612-0

Full log

Note: This is test shard 6 of 8.
[==========] Running 21 tests from 2 test suites.
[----------] Global test environment set-up.
[----------] 20 tests from Parameters/TestRpc
[ RUN      ] Parameters/TestRpc.TestMessengerCreateDestroy/SSL_TCP
WARNING: Logging before InitGoogleLogging() is written to STDERR
I20260925 17:25:29.374089  1612 rpc-test.cc:169] started messenger TestCreateDestroy
[       OK ] Parameters/TestRpc.TestMessengerCreateDestroy/SSL_TCP (30 ms)
[ RUN      ] Parameters/TestRpc.TestNegotiationDeadlock/SSL_TCP
I20260925 17:25:29.412379  1632 acceptor_pool.cc:254] collecting diagnostics on the listening RPC socket 0.0.0.0:40355 every 8 connection(s)
I20260925 17:25:29.412379  1633 acceptor_pool.cc:254] collecting diagnostics on the listening RPC socket 0.0.0.0:40355 every 8 connection(s)
[       OK ] Parameters/TestRpc.TestNegotiationDeadlock/SSL_TCP (47 ms)
[ RUN      ] Parameters/TestRpc.TestCallWithChainCertAndChainCA/SSL_TCP
I20260925 17:25:29.438102  1648 acceptor_pool.cc:254] collecting diagnostics on the listening RPC socket 0.0.0.0:39161 every 8 connection(s)
I20260925 17:25:29.438149  1649 acceptor_pool.cc:254] collecting diagnostics on the listening RPC socket 0.0.0.0:39161 every 8 connection(s)
/data0/somelongdirectorytoavoidrpathissues/src/kudu/src/kudu/rpc/rpc-test.cc:270: Failure
Failed
Bad status: Runtime error: could not verify certificate chain (error with cert: subject=CN = localhost, ST = sadfjas, C = AS, emailAddress = sdflkdsajf, O = lskdfjlsad, OU = sldfkja, issuer=C = AS, ST = ASDfkjdhf, L = lskdjf, O = saldfja, OU = skdjf, CN = localhost, emailAddress = sadjflkadsj): : certificate has expired
Google Test trace:
/data0/somelongdirectorytoavoidrpathissues/src/kudu/src/kudu/rpc/rpc-test.cc:267: Connecting to 0.0.0.0:39161
I20260925 17:25:29.443692  1612 test_util.cc:175] -----------------------------------------------
I20260925 17:25:29.443753  1612 test_util.cc:176] Had fatal failures, leaving test files at /tmp/dist-test-taskCisHUJ/test-tmp/rpc-test.5.Parameters_TestRpc.TestCallWithChainCertAndChainCA_SSL_TCP.1790357129339197-1612-0
[  FAILED  ] Parameters/TestRpc.TestCallWithChainCertAndChainCA/SSL_TCP, where GetParam() = (true, false) (19 ms)
[ RUN      ] Parameters/TestRpc.TestCallWithPasswordProtectedKey/SSL_TCP
I20260925 17:25:29.449971  1673 acceptor_pool.cc:254] collecting diagnostics on the listening RPC socket 0.0.0.0:35939 every 8 connection(s)
I20260925 17:25:29.449977  1674 acceptor_pool.cc:254] collecting diagnostics on the listening RPC socket 0.0.0.0:35939 every 8 connection(s)
[       OK ] Parameters/TestRpc.TestCallWithPasswordProtectedKey/SSL_TCP (20 ms)
[ RUN      ] Parameters/TestRpc.TestCallToBadServer/SSL_TCP
I20260925 17:25:29.502542  1612 rpc-test.cc:394] Status: Network error: Client connection negotiation failed: client connection to 0.0.0.0:0: connect: Connection refused (error 111)
I20260925 17:25:29.503041  1612 rpc-test.cc:394] Status: Network error: Client connection negotiation failed: client connection to 0.0.0.0:0: connect: Connection refused (error 111)
I20260925 17:25:29.503495  1612 rpc-test.cc:394] Status: Network error: Client connection negotiation failed: client connection to 0.0.0.0:0: connect: Connection refused (error 111)
I20260925 17:25:29.503934  1612 rpc-test.cc:394] Status: Network error: Client connection negotiation failed: client connection to 0.0.0.0:0: connect: Connection refused (error 111)
I20260925 17:25:29.504383  1612 rpc-test.cc:394] Status: Network error: Client connection negotiation failed: client connection to 0.0.0.0:0: connect: Connection refused (error 111)
[       OK ] Parameters/TestRpc.TestCallToBadServer/SSL_TCP (40 ms)
[ RUN      ] Parameters/TestRpc.TestWrongService/SSL_TCP
I20260925 17:25:29.540063  1708 acceptor_pool.cc:254] collecting diagnostics on the listening RPC socket 0.0.0.0:45093 every 8 connection(s)
I20260925 17:25:29.540086  1709 acceptor_pool.cc:254] collecting diagnostics on the listening RPC socket 0.0.0.0:45093 every 8 connection(s)
I20260925 17:25:29.552008  1707 messenger.cc:345] service WrongServiceName not registered on TestServer
[       OK ] Parameters/TestRpc.TestWrongService/SSL_TCP (49 ms)
[ RUN      ] Parameters/TestRpc.TestConnectionKeepalive/SSL_TCP
I20260925 17:25:29.587347  1731 acceptor_pool.cc:254] collecting diagnostics on the listening RPC socket 0.0.0.0:43219 every 8 connection(s)
I20260925 17:25:29.587385  1732 acceptor_pool.cc:254] collecting diagnostics on the listening RPC socket 0.0.0.0:43219 every 8 connection(s)
I20260925 17:25:29.587683  1612 rpc-test.cc:488] Connecting to 0.0.0.0:43219
[       OK ] Parameters/TestRpc.TestConnectionKeepalive/SSL_TCP (1062 ms)
[ RUN      ] Parameters/TestRpc.TestClientConnectionMetrics/SSL_TCP
I20260925 17:25:30.623953  1756 acceptor_pool.cc:254] collecting diagnostics on the listening RPC socket 0.0.0.0:46365 every 8 connection(s)
I20260925 17:25:30.624074  1757 acceptor_pool.cc:254] collecting diagnostics on the listening RPC socket 0.0.0.0:46365 every 8 connection(s)
I20260925 17:25:30.624326  1612 rpc-test.cc:569] Connecting to 0.0.0.0:46365
[       OK ] Parameters/TestRpc.TestClientConnectionMetrics/SSL_TCP (14795 ms)
[ RUN      ] Parameters/TestRpc.TestCredentialsPolicy/SSL_TCP
I20260925 17:25:45.430095  1779 acceptor_pool.cc:254] collecting diagnostics on the listening RPC socket 0.0.0.0:41623 every 8 connection(s)
I20260925 17:25:45.430249  1780 acceptor_pool.cc:254] collecting diagnostics on the listening RPC socket 0.0.0.0:41623 every 8 connection(s)
I20260925 17:25:45.430501  1612 rpc-test.cc:700] Connecting to 0.0.0.0:41623
[       OK ] Parameters/TestRpc.TestCredentialsPolicy/SSL_TCP (42 ms)
[ RUN      ] Parameters/TestRpc.TestCallLongerThanKeepalive/SSL_TCP
I20260925 17:25:45.465361  1804 acceptor_pool.cc:254] collecting diagnostics on the listening RPC socket 0.0.0.0:44773 every 8 connection(s)
I20260925 17:25:45.465456  1805 acceptor_pool.cc:254] collecting diagnostics on the listening RPC socket 0.0.0.0:44773 every 8 connection(s)
I20260925 17:25:45.491725  1808 rpc-test-base.h:222] got call: sleep_micros: 3000000 deferred: true
I20260925 17:25:48.492592  1808 rpcz_store.cc:275] Call kudu.rpc.GenericCalculatorService.Sleep from 127.0.0.1:60632 (request call id 0) took 3000 ms. Trace:
I20260925 17:25:48.492712  1808 rpcz_store.cc:276] 0925 17:25:45.491631 (+     0us) service_pool.cc:170] Inserting onto call queue
0925 17:25:45.491691 (+    60us) service_pool.cc:227] Handling call
0925 17:25:48.492571 (+3000880us) inbound_call.cc:173] Queueing success response
Metrics: {}
[       OK ] Parameters/TestRpc.TestCallLongerThanKeepalive/SSL_TCP (3040 ms)
[ RUN      ] Parameters/TestRpc.TestRpcSidecar/SSL_TCP
I20260925 17:25:48.516140  1829 acceptor_pool.cc:254] collecting diagnostics on the listening RPC socket 0.0.0.0:36713 every 8 connection(s)
I20260925 17:25:48.516219  1830 acceptor_pool.cc:254] collecting diagnostics on the listening RPC socket 0.0.0.0:36713 every 8 connection(s)
[       OK ] Parameters/TestRpc.TestRpcSidecar/SSL_TCP (80 ms)
[ RUN      ] Parameters/TestRpc.TestRpcSidecarLimits/SSL_TCP
I20260925 17:25:50.347826  1854 acceptor_pool.cc:254] collecting diagnostics on the listening RPC socket 0.0.0.0:42159 every 8 connection(s)
I20260925 17:25:50.347842  1855 acceptor_pool.cc:254] collecting diagnostics on the listening RPC socket 0.0.0.0:42159 every 8 connection(s)
W20260925 17:25:50.366027  1612 serialization.cc:72] Serialized kudu.rpc_test.PushStringsRequestPB (2147483654 bytes) is larger than the maximum configured RPC message size (52428800 bytes). Sending anyway, but peer may reject the data.
W20260925 17:25:50.370041  1853 connection.cc:535] server connection from 127.0.0.1:34298 recv error: Network error: RPC frame had a length of 2147483714, but we only support messages up to 52428800 bytes long.
W20260925 17:25:50.370128  1853 connection.cc:158] shutting down server connection from 127.0.0.1:34298 with pending inbound data: 4/2147483714 bytes received; last active 0 ns ago: status Network error: RPC frame had a length of 2147483714, but we only support messages up to 52428800 bytes long.
W20260925 17:25:50.370330  1867 connection.cc:698] client connection to 0.0.0.0:42159 send error: Network error: failed to write to TLS socket: Connection reset by peer
W20260925 17:25:50.370513  1867 connection.cc:196] Error closing socket: Network error: TlsSocket::Close: Success
I20260925 17:25:50.395074  1880 acceptor_pool.cc:254] collecting diagnostics on the listening RPC socket 0.0.0.0:44791 every 8 connection(s)
I20260925 17:25:50.395074  1879 acceptor_pool.cc:254] collecting diagnostics on the listening RPC socket 0.0.0.0:44791 every 8 connection(s)
W20260925 17:25:54.865942  1878 connection.cc:577] server connection from 127.0.0.1:58974: received bad data: 'Corruption: Invalid packet: message had a length of 2147483710, but we only support messages up to 2147483647 bytes
'
[       OK ] Parameters/TestRpc.TestRpcSidecarLimits/SSL_TCP (6292 ms)
[ RUN      ] Parameters/TestRpc.TestCallTimeoutDoesntAffectNegotiation/SSL_TCP
I20260925 17:25:54.890626  1904 acceptor_pool.cc:254] collecting diagnostics on the listening RPC socket 0.0.0.0:46715 every 8 connection(s)
I20260925 17:25:54.890663  1905 acceptor_pool.cc:254] collecting diagnostics on the listening RPC socket 0.0.0.0:46715 every 8 connection(s)
W20260925 17:25:54.917502  1900 negotiation.cc:266] Injecting 500ms delay in negotiation
I20260925 17:25:54.967980  1612 rpc-test-base.h:595] status: Timed out: connection negotiation to 0.0.0.0:46715 for RPC Sleep timed out after 0.050s (ON_OUTBOUND_QUEUE), seconds elapsed: 0.0509939
[       OK ] Parameters/TestRpc.TestCallTimeoutDoesntAffectNegotiation/SSL_TCP (555 ms)
[ RUN      ] Parameters/TestRpc.TestRpcHandlerLatencyMetric/SSL_TCP
I20260925 17:25:55.444686  1929 acceptor_pool.cc:254] collecting diagnostics on the listening RPC socket 0.0.0.0:34283 every 8 connection(s)
I20260925 17:25:55.444722  1930 acceptor_pool.cc:254] collecting diagnostics on the listening RPC socket 0.0.0.0:34283 every 8 connection(s)
I20260925 17:25:55.492439  1612 rpc-test.cc:1236] Sleep() min lat: 20422
I20260925 17:25:55.492511  1612 rpc-test.cc:1237] Sleep() mean lat: 20422
I20260925 17:25:55.492540  1612 rpc-test.cc:1238] Sleep() max lat: 20422
I20260925 17:25:55.492553  1612 rpc-test.cc:1239] Sleep() #calls: 1
[       OK ] Parameters/TestRpc.TestRpcHandlerLatencyMetric/SSL_TCP (70 ms)
[ RUN      ] Parameters/TestRpc.TimedOutOnResponseMetricServiceQueue/SSL_TCP
I20260925 17:25:55.509711  1955 acceptor_pool.cc:254] collecting diagnostics on the listening RPC socket 0.0.0.0:41911 every 8 connection(s)
I20260925 17:25:55.509752  1956 acceptor_pool.cc:254] collecting diagnostics on the listening RPC socket 0.0.0.0:41911 every 8 connection(s)
W20260925 17:25:55.565027  1957 rpcz_store.cc:267] Call kudu.rpc_test.CalculatorService.Sleep from 127.0.0.1:34454 (request call id 2) took 20 ms (client timeout 20 ms). Trace:
W20260925 17:25:55.565148  1957 rpcz_store.cc:269] 0925 17:25:55.544576 (+     0us) service_pool.cc:170] Inserting onto call queue
0925 17:25:55.564960 (+ 20384us) service_pool.cc:214] Skipping call since client already timed out
0925 17:25:55.565006 (+    46us) inbound_call.cc:173] Queueing failure response
Metrics: {}
[       OK ] Parameters/TestRpc.TimedOutOnResponseMetricServiceQueue/SSL_TCP (72 ms)
[ RUN      ] Parameters/TestRpc.RpcPendingConnectionsMetric/SSL_TCP
I20260925 17:25:55.569720  1978 acceptor_pool.cc:254] collecting diagnostics on the listening RPC socket 0.0.0.0:45119 every 8 connection(s)
I20260925 17:25:55.569823  1979 acceptor_pool.cc:254] collecting diagnostics on the listening RPC socket 0.0.0.0:45119 every 8 connection(s)
W20260925 17:25:55.580353  1974 negotiation.cc:337] Failed RPC negotiation. Trace:
0925 17:25:55.579708 (+     0us) reactor.cc:625] Submitting negotiation task for server connection from 127.0.0.1:51944 (local address 127.0.0.1:45119)
0925 17:25:55.579856 (+   148us) server_negotiation.cc:206] Beginning negotiation
0925 17:25:55.579859 (+     3us) server_negotiation.cc:399] Waiting for connection header
0925 17:25:55.580023 (+   164us) negotiation.cc:327] Negotiation complete: Network error: Server connection negotiation failed: server connection from 127.0.0.1:51944: BlockingRecv error: recv got EOF from 127.0.0.1:51944 (error 108)
Metrics: {"server-negotiator.queue_time_us":45}
[       OK ] Parameters/TestRpc.RpcPendingConnectionsMetric/SSL_TCP (22 ms)
[ RUN      ] Parameters/TestRpc.TestRpcContextClientDeadline/SSL_TCP
I20260925 17:25:55.631111  1994 acceptor_pool.cc:254] collecting diagnostics on the listening RPC socket 0.0.0.0:38473 every 8 connection(s)
I20260925 17:25:55.631145  1995 acceptor_pool.cc:254] collecting diagnostics on the listening RPC socket 0.0.0.0:38473 every 8 connection(s)
[       OK ] Parameters/TestRpc.TestRpcContextClientDeadline/SSL_TCP (89 ms)
[ RUN      ] Parameters/TestRpc.TestApplicationFeatureFlagUnsupportedServer/SSL_TCP
I20260925 17:25:55.704675  2019 acceptor_pool.cc:254] collecting diagnostics on the listening RPC socket 0.0.0.0:42825 every 8 connection(s)
I20260925 17:25:55.704685  2020 acceptor_pool.cc:254] collecting diagnostics on the listening RPC socket 0.0.0.0:42825 every 8 connection(s)
[       OK ] Parameters/TestRpc.TestApplicationFeatureFlagUnsupportedServer/SSL_TCP (43 ms)
[ RUN      ] Parameters/TestRpc.TestCancellationAsync/SSL_TCP
I20260925 17:25:55.738618  2044 acceptor_pool.cc:254] collecting diagnostics on the listening RPC socket 0.0.0.0:46019 every 8 connection(s)
I20260925 17:25:55.738618  2045 acceptor_pool.cc:254] collecting diagnostics on the listening RPC socket 0.0.0.0:46019 every 8 connection(s)
I20260925 17:25:55.738927  1612 rpc-test.cc:1716] Connecting to 0.0.0.0:46019
I20260925 17:25:55.765267  1612 test_util.cc:268] Using random seed: 38427664
I20260925 17:25:55.784978  2048 rpc-test-base.h:240] got call: sleep_micros: 500 pattern: 4294967295 num_repetitions: 2097152 sidecar_idx: 0
I20260925 17:25:55.805305  2047 rpc-test-base.h:240] got call: sleep_micros: 500 pattern: 4294967295 num_repetitions: 2097152 sidecar_idx: 0
I20260925 17:25:55.822700  2048 rpc-test-base.h:240] got call: sleep_micros: 500 pattern: 4294967295 num_repetitions: 2097152 sidecar_idx: 0
I20260925 17:25:55.845417  2048 rpc-test-base.h:240] got call: sleep_micros: 500 pattern: 4294967295 num_repetitions: 2097152 sidecar_idx: 0
I20260925 17:25:55.870177  2048 rpc-test-base.h:240] got call: sleep_micros: 500 pattern: 4294967295 num_repetitions: 2097152 sidecar_idx: 0
I20260925 17:25:55.894812  2048 rpc-test-base.h:240] got call: sleep_micros: 500 pattern: 4294967295 num_repetitions: 2097152 sidecar_idx: 0
I20260925 17:25:55.918437  2047 rpc-test-base.h:240] got call: sleep_micros: 500 pattern: 4294967295 num_repetitions: 2097152 sidecar_idx: 0
I20260925 17:25:55.943030  2047 rpc-test-base.h:240] got call: sleep_micros: 500 pattern: 4294967295 num_repetitions: 2097152 sidecar_idx: 0
W20260925 17:25:55.961725  2042 connection.cc:441] server connection from 127.0.0.1:45382 torn down before Call kudu.rpc.GenericCalculatorService.SleepWithSidecar from 127.0.0.1:45382 (request call id 9) could send its response
[       OK ] Parameters/TestRpc.TestCancellationAsync/SSL_TCP (239 ms)
[ RUN      ] Parameters/TestRpc.TestPerformanceBySocketType/SSL_TCP
I20260925 17:25:55.975389  2069 acceptor_pool.cc:254] collecting diagnostics on the listening RPC socket 0.0.0.0:45163 every 8 connection(s)
I20260925 17:25:55.975410  2070 acceptor_pool.cc:254] collecting diagnostics on the listening RPC socket 0.0.0.0:45163 every 8 connection(s)
I20260925 17:25:55.975729  1612 rpc-test.cc:1846] Connecting to 0.0.0.0:45163
I20260925 17:25:58.235744  1612 rpc-test.cc:1859] Sending 1024MB via ssl-enabled tcp socket: real 2.247s	user 2.343s	sys 1.605s
I20260925 17:26:00.501830  1612 rpc-test.cc:1859] Sending 1024MB via ssl-enabled tcp socket: real 2.266s	user 2.397s	sys 1.615s
I20260925 17:26:02.712081  1612 rpc-test.cc:1859] Sending 1024MB via ssl-enabled tcp socket: real 2.210s	user 2.253s	sys 1.659s
I20260925 17:26:04.913822  1612 rpc-test.cc:1859] Sending 1024MB via ssl-enabled tcp socket: real 2.202s	user 2.265s	sys 1.626s
I20260925 17:26:07.179244  1612 rpc-test.cc:1859] Sending 1024MB via ssl-enabled tcp socket: real 2.265s	user 2.347s	sys 1.630s
[       OK ] Parameters/TestRpc.TestPerformanceBySocketType/SSL_TCP (11218 ms)
[----------] 20 tests from Parameters/TestRpc (37835 ms total)

[----------] 1 test from Parameters/TestRpcSocketTxRxQueue
[ RUN      ] Parameters/TestRpcSocketTxRxQueue.OverCapacity/0
W20260925 17:26:07.452574  2095 negotiation.cc:337] Failed RPC negotiation. Trace:
0925 17:26:07.185029 (+     0us) reactor.cc:625] Submitting negotiation task for client connection to 0.0.0.0:36053 (local address 127.0.0.1:51428)
0925 17:26:07.185123 (+    94us) negotiation.cc:107] Waiting for socket to connect
0925 17:26:07.185135 (+    12us) client_negotiation.cc:174] Beginning negotiation
0925 17:26:07.185217 (+    82us) client_negotiation.cc:252] Sending NEGOTIATE NegotiatePB request
0925 17:26:07.452383 (+267166us) negotiation.cc:327] Negotiation complete: Network error: Client connection negotiation failed: client connection to 0.0.0.0:36053: BlockingRecv error: recv error from unknown peer: Transport endpoint is not connected (error 107)
Metrics: {"client-negotiator.queue_time_us":25}
W20260925 17:26:07.452538  2113 negotiation.cc:337] Failed RPC negotiation. Trace:
0925 17:26:07.187432 (+     0us) reactor.cc:625] Submitting negotiation task for client connection to 0.0.0.0:36053 (local address 127.0.0.1:51450)
0925 17:26:07.187564 (+   132us) negotiation.cc:107] Waiting for socket to connect
0925 17:26:07.187579 (+    15us) client_negotiation.cc:174] Beginning negotiation
0925 17:26:07.187665 (+    86us) client_negotiation.cc:252] Sending NEGOTIATE NegotiatePB request
0925 17:26:07.452338 (+264673us) negotiation.cc:327] Negotiation complete: Network error: Client connection negotiation failed: client connection to 0.0.0.0:36053: BlockingRecv error: recv error from unknown peer: Transport endpoint is not connected (error 107)
Metrics: {"client-negotiator.queue_time_us":49}
W20260925 17:26:07.452522  2086 negotiation.cc:337] Failed RPC negotiation. Trace:
0925 17:26:07.183653 (+     0us) reactor.cc:625] Submitting negotiation task for client connection to 0.0.0.0:36053 (local address 127.0.0.1:51424)
0925 17:26:07.183801 (+   148us) negotiation.cc:107] Waiting for socket to connect
0925 17:26:07.183817 (+    16us) client_negotiation.cc:174] Beginning negotiation
0925 17:26:07.183913 (+    96us) client_negotiation.cc:252] Sending NEGOTIATE NegotiatePB request
0925 17:26:07.452395 (+268482us) negotiation.cc:327] Negotiation complete: Network error: Client connection negotiation failed: client connection to 0.0.0.0:36053: BlockingRecv error: recv error from unknown peer: Transport endpoint is not connected (error 107)
Metrics: {"client-negotiator.queue_time_us":54}
W20260925 17:26:07.452689  2104 negotiation.cc:337] Failed RPC negotiation. Trace:
0925 17:26:07.186220 (+     0us) reactor.cc:625] Submitting negotiation task for client connection to 0.0.0.0:36053 (local address 127.0.0.1:51438)
0925 17:26:07.186327 (+   107us) negotiation.cc:107] Waiting for socket to connect
0925 17:26:07.186340 (+    13us) client_negotiation.cc:174] Beginning negotiation
0925 17:26:07.186416 (+    76us) client_negotiation.cc:252] Sending NEGOTIATE NegotiatePB request
0925 17:26:07.452349 (+265933us) negotiation.cc:327] Negotiation complete: Network error: Client connection negotiation failed: client connection to 0.0.0.0:36053: BlockingRecv error: recv error from unknown peer: Transport endpoint is not connected (error 107)
Metrics: {"client-negotiator.queue_time_us":43}
W20260925 17:26:07.452877  2122 negotiation.cc:337] Failed RPC negotiation. Trace:
0925 17:26:07.188584 (+     0us) reactor.cc:625] Submitting negotiation task for client connection to 0.0.0.0:36053 (local address 127.0.0.1:51462)
0925 17:26:07.188703 (+   119us) negotiation.cc:107] Waiting for socket to connect
0925 17:26:07.188720 (+    17us) client_negotiation.cc:174] Beginning negotiation
0925 17:26:07.188810 (+    90us) client_negotiation.cc:252] Sending NEGOTIATE NegotiatePB request
0925 17:26:07.452613 (+263803us) negotiation.cc:327] Negotiation complete: Network error: Client connection negotiation failed: client connection to 0.0.0.0:36053: BlockingRecv error: recv error from unknown peer: Transport endpoint is not connected (error 107)
Metrics: {"client-negotiator.queue_time_us":29}
W20260925 17:26:07.453037  2131 negotiation.cc:337] Failed RPC negotiation. Trace:
0925 17:26:07.190010 (+     0us) reactor.cc:625] Submitting negotiation task for client connection to 0.0.0.0:36053 (local address 127.0.0.1:51470)
0925 17:26:07.190125 (+   115us) negotiation.cc:107] Waiting for socket to connect
0925 17:26:07.190138 (+    13us) client_negotiation.cc:174] Beginning negotiation
0925 17:26:07.190237 (+    99us) client_negotiation.cc:252] Sending NEGOTIATE NegotiatePB request
0925 17:26:07.452528 (+262291us) negotiation.cc:327] Negotiation complete: Network error: Client connection negotiation failed: client connection to 0.0.0.0:36053: BlockingRecv error: recv error from unknown peer: Transport endpoint is not connected (error 107)
Metrics: {"client-negotiator.queue_time_us":46}
[       OK ] Parameters/TestRpcSocketTxRxQueue.OverCapacity/0 (1050 ms)
[----------] 1 test from Parameters/TestRpcSocketTxRxQueue (1050 ms total)

[----------] Global test environment tear-down
[==========] 21 tests from 2 test suites ran. (38886 ms total)
[  PASSED  ] 20 tests.
[  FAILED  ] 1 test, listed below:
[  FAILED  ] Parameters/TestRpc.TestCallWithChainCertAndChainCA/SSL_TCP, where GetParam() = (true, false)

 1 FAILED TEST