Diagnosed failure

Parameters/TestRpc.TestCallWithChainCertAndChainCA/SSL_TCP: /data0/somelongdirectorytoavoidrpathissues/src/kudu/src/kudu/rpc/rpc-test.cc:270: Failure
Failed
Bad status: Runtime error: could not verify certificate chain (error with cert: subject=CN = localhost, ST = sadfjas, C = AS, emailAddress = sdflkdsajf, O = lskdfjlsad, OU = sldfkja, issuer=C = AS, ST = ASDfkjdhf, L = lskdjf, O = saldfja, OU = skdjf, CN = localhost, emailAddress = sadjflkadsj): : certificate has expired
Google Test trace:
/data0/somelongdirectorytoavoidrpathissues/src/kudu/src/kudu/rpc/rpc-test.cc:267: Connecting to 0.0.0.0:46197
I20260927 15:07:08.523304  4031 test_util.cc:175] -----------------------------------------------
I20260927 15:07:08.523370  4031 test_util.cc:176] Had fatal failures, leaving test files at /tmp/dist-test-taskT5QWDS/test-tmp/rpc-test.5.Parameters_TestRpc.TestCallWithChainCertAndChainCA_SSL_TCP.1790521628445256-4031-0

Full log

Note: This is test shard 6 of 8.
[==========] Running 21 tests from 2 test suites.
[----------] Global test environment set-up.
[----------] 20 tests from Parameters/TestRpc
[ RUN      ] Parameters/TestRpc.TestMessengerCreateDestroy/SSL_TCP
WARNING: Logging before InitGoogleLogging() is written to STDERR
I20260927 15:07:08.469498  4031 rpc-test.cc:169] started messenger TestCreateDestroy
[       OK ] Parameters/TestRpc.TestMessengerCreateDestroy/SSL_TCP (19 ms)
[ RUN      ] Parameters/TestRpc.TestNegotiationDeadlock/SSL_TCP
I20260927 15:07:08.478441  4051 acceptor_pool.cc:254] collecting diagnostics on the listening RPC socket 0.0.0.0:46231 every 8 connection(s)
I20260927 15:07:08.478408  4052 acceptor_pool.cc:254] collecting diagnostics on the listening RPC socket 0.0.0.0:46231 every 8 connection(s)
[       OK ] Parameters/TestRpc.TestNegotiationDeadlock/SSL_TCP (20 ms)
[ RUN      ] Parameters/TestRpc.TestCallWithChainCertAndChainCA/SSL_TCP
I20260927 15:07:08.518240  4067 acceptor_pool.cc:254] collecting diagnostics on the listening RPC socket 0.0.0.0:46197 every 8 connection(s)
I20260927 15:07:08.518340  4068 acceptor_pool.cc:254] collecting diagnostics on the listening RPC socket 0.0.0.0:46197 every 8 connection(s)
/data0/somelongdirectorytoavoidrpathissues/src/kudu/src/kudu/rpc/rpc-test.cc:270: Failure
Failed
Bad status: Runtime error: could not verify certificate chain (error with cert: subject=CN = localhost, ST = sadfjas, C = AS, emailAddress = sdflkdsajf, O = lskdfjlsad, OU = sldfkja, issuer=C = AS, ST = ASDfkjdhf, L = lskdjf, O = saldfja, OU = skdjf, CN = localhost, emailAddress = sadjflkadsj): : certificate has expired
Google Test trace:
/data0/somelongdirectorytoavoidrpathissues/src/kudu/src/kudu/rpc/rpc-test.cc:267: Connecting to 0.0.0.0:46197
I20260927 15:07:08.523304  4031 test_util.cc:175] -----------------------------------------------
I20260927 15:07:08.523370  4031 test_util.cc:176] Had fatal failures, leaving test files at /tmp/dist-test-taskT5QWDS/test-tmp/rpc-test.5.Parameters_TestRpc.TestCallWithChainCertAndChainCA_SSL_TCP.1790521628445256-4031-0
[  FAILED  ] Parameters/TestRpc.TestCallWithChainCertAndChainCA/SSL_TCP, where GetParam() = (true, false) (31 ms)
[ RUN      ] Parameters/TestRpc.TestCallWithPasswordProtectedKey/SSL_TCP
I20260927 15:07:08.536521  4092 acceptor_pool.cc:254] collecting diagnostics on the listening RPC socket 0.0.0.0:43267 every 8 connection(s)
I20260927 15:07:08.536521  4093 acceptor_pool.cc:254] collecting diagnostics on the listening RPC socket 0.0.0.0:43267 every 8 connection(s)
[       OK ] Parameters/TestRpc.TestCallWithPasswordProtectedKey/SSL_TCP (29 ms)
[ RUN      ] Parameters/TestRpc.TestCallToBadServer/SSL_TCP
I20260927 15:07:08.561605  4031 rpc-test.cc:394] Status: Network error: Client connection negotiation failed: client connection to 0.0.0.0:0: connect: Connection refused (error 111)
I20260927 15:07:08.562649  4031 rpc-test.cc:394] Status: Network error: Client connection negotiation failed: client connection to 0.0.0.0:0: connect: Connection refused (error 111)
I20260927 15:07:08.563128  4031 rpc-test.cc:394] Status: Network error: Client connection negotiation failed: client connection to 0.0.0.0:0: connect: Connection refused (error 111)
I20260927 15:07:08.563577  4031 rpc-test.cc:394] Status: Network error: Client connection negotiation failed: client connection to 0.0.0.0:0: connect: Connection refused (error 111)
I20260927 15:07:08.563948  4031 rpc-test.cc:394] Status: Network error: Client connection negotiation failed: client connection to 0.0.0.0:0: connect: Connection refused (error 111)
[       OK ] Parameters/TestRpc.TestCallToBadServer/SSL_TCP (11 ms)
[ RUN      ] Parameters/TestRpc.TestWrongService/SSL_TCP
I20260927 15:07:08.589744  4127 acceptor_pool.cc:254] collecting diagnostics on the listening RPC socket 0.0.0.0:45495 every 8 connection(s)
I20260927 15:07:08.589753  4128 acceptor_pool.cc:254] collecting diagnostics on the listening RPC socket 0.0.0.0:45495 every 8 connection(s)
I20260927 15:07:08.687871  4124 messenger.cc:345] service WrongServiceName not registered on TestServer
[       OK ] Parameters/TestRpc.TestWrongService/SSL_TCP (126 ms)
[ RUN      ] Parameters/TestRpc.TestConnectionKeepalive/SSL_TCP
I20260927 15:07:08.706200  4150 acceptor_pool.cc:254] collecting diagnostics on the listening RPC socket 0.0.0.0:39345 every 8 connection(s)
I20260927 15:07:08.706202  4151 acceptor_pool.cc:254] collecting diagnostics on the listening RPC socket 0.0.0.0:39345 every 8 connection(s)
I20260927 15:07:08.706439  4031 rpc-test.cc:488] Connecting to 0.0.0.0:39345
[       OK ] Parameters/TestRpc.TestConnectionKeepalive/SSL_TCP (1058 ms)
[ RUN      ] Parameters/TestRpc.TestClientConnectionMetrics/SSL_TCP
I20260927 15:07:09.759349  4175 acceptor_pool.cc:254] collecting diagnostics on the listening RPC socket 0.0.0.0:32999 every 8 connection(s)
I20260927 15:07:09.759413  4176 acceptor_pool.cc:254] collecting diagnostics on the listening RPC socket 0.0.0.0:32999 every 8 connection(s)
I20260927 15:07:09.759645  4031 rpc-test.cc:569] Connecting to 0.0.0.0:32999
[       OK ] Parameters/TestRpc.TestClientConnectionMetrics/SSL_TCP (13777 ms)
[ RUN      ] Parameters/TestRpc.TestCredentialsPolicy/SSL_TCP
I20260927 15:07:23.545789  4198 acceptor_pool.cc:254] collecting diagnostics on the listening RPC socket 0.0.0.0:43403 every 8 connection(s)
I20260927 15:07:23.545795  4199 acceptor_pool.cc:254] collecting diagnostics on the listening RPC socket 0.0.0.0:43403 every 8 connection(s)
I20260927 15:07:23.546075  4031 rpc-test.cc:700] Connecting to 0.0.0.0:43403
[       OK ] Parameters/TestRpc.TestCredentialsPolicy/SSL_TCP (63 ms)
[ RUN      ] Parameters/TestRpc.TestCallLongerThanKeepalive/SSL_TCP
I20260927 15:07:23.616145  4223 acceptor_pool.cc:254] collecting diagnostics on the listening RPC socket 0.0.0.0:38031 every 8 connection(s)
I20260927 15:07:23.616250  4224 acceptor_pool.cc:254] collecting diagnostics on the listening RPC socket 0.0.0.0:38031 every 8 connection(s)
I20260927 15:07:23.636853  4225 rpc-test-base.h:222] got call: sleep_micros: 3000000 deferred: true
I20260927 15:07:26.637742  4225 rpcz_store.cc:275] Call kudu.rpc.GenericCalculatorService.Sleep from 127.0.0.1:38446 (request call id 0) took 3000 ms. Trace:
I20260927 15:07:26.637864  4225 rpcz_store.cc:276] 0927 15:07:23.636776 (+     0us) service_pool.cc:170] Inserting onto call queue
0927 15:07:23.636823 (+    47us) service_pool.cc:227] Handling call
0927 15:07:26.637723 (+3000900us) inbound_call.cc:173] Queueing success response
Metrics: {}
[       OK ] Parameters/TestRpc.TestCallLongerThanKeepalive/SSL_TCP (3049 ms)
[ RUN      ] Parameters/TestRpc.TestRpcSidecar/SSL_TCP
I20260927 15:07:26.651172  4248 acceptor_pool.cc:254] collecting diagnostics on the listening RPC socket 0.0.0.0:39839 every 8 connection(s)
I20260927 15:07:26.651249  4249 acceptor_pool.cc:254] collecting diagnostics on the listening RPC socket 0.0.0.0:39839 every 8 connection(s)
[       OK ] Parameters/TestRpc.TestRpcSidecar/SSL_TCP (68 ms)
[ RUN      ] Parameters/TestRpc.TestRpcSidecarLimits/SSL_TCP
I20260927 15:07:28.398483  4273 acceptor_pool.cc:254] collecting diagnostics on the listening RPC socket 0.0.0.0:33323 every 8 connection(s)
I20260927 15:07:28.398481  4274 acceptor_pool.cc:254] collecting diagnostics on the listening RPC socket 0.0.0.0:33323 every 8 connection(s)
W20260927 15:07:28.406556  4031 serialization.cc:72] Serialized kudu.rpc_test.PushStringsRequestPB (2147483654 bytes) is larger than the maximum configured RPC message size (52428800 bytes). Sending anyway, but peer may reject the data.
W20260927 15:07:28.410856  4272 connection.cc:535] server connection from 127.0.0.1:53522 recv error: Network error: RPC frame had a length of 2147483714, but we only support messages up to 52428800 bytes long.
W20260927 15:07:28.410926  4272 connection.cc:158] shutting down server connection from 127.0.0.1:53522 with pending inbound data: 4/2147483714 bytes received; last active 0 ns ago: status Network error: RPC frame had a length of 2147483714, but we only support messages up to 52428800 bytes long.
W20260927 15:07:28.411219  4286 connection.cc:196] Error closing socket: Network error: TlsSocket::Close: Connection reset by peer
I20260927 15:07:28.431504  4299 acceptor_pool.cc:254] collecting diagnostics on the listening RPC socket 0.0.0.0:35763 every 8 connection(s)
I20260927 15:07:28.431495  4298 acceptor_pool.cc:254] collecting diagnostics on the listening RPC socket 0.0.0.0:35763 every 8 connection(s)
W20260927 15:07:32.532933  4295 connection.cc:577] server connection from 127.0.0.1:56622: received bad data: 'Corruption: Invalid packet: message had a length of 2147483710, but we only support messages up to 2147483647 bytes
'
[       OK ] Parameters/TestRpc.TestRpcSidecarLimits/SSL_TCP (5826 ms)
[ RUN      ] Parameters/TestRpc.TestCallTimeoutDoesntAffectNegotiation/SSL_TCP
I20260927 15:07:32.551770  4323 acceptor_pool.cc:254] collecting diagnostics on the listening RPC socket 0.0.0.0:37319 every 8 connection(s)
I20260927 15:07:32.551854  4324 acceptor_pool.cc:254] collecting diagnostics on the listening RPC socket 0.0.0.0:37319 every 8 connection(s)
W20260927 15:07:32.558346  4317 negotiation.cc:266] Injecting 500ms delay in negotiation
I20260927 15:07:32.608667  4031 rpc-test-base.h:595] status: Timed out: connection negotiation to 0.0.0.0:37319 for RPC Sleep timed out after 0.050s (ON_OUTBOUND_QUEUE), seconds elapsed: 0.0507964
[       OK ] Parameters/TestRpc.TestCallTimeoutDoesntAffectNegotiation/SSL_TCP (528 ms)
[ RUN      ] Parameters/TestRpc.TestRpcHandlerLatencyMetric/SSL_TCP
I20260927 15:07:33.089957  4348 acceptor_pool.cc:254] collecting diagnostics on the listening RPC socket 0.0.0.0:35285 every 8 connection(s)
I20260927 15:07:33.089969  4349 acceptor_pool.cc:254] collecting diagnostics on the listening RPC socket 0.0.0.0:35285 every 8 connection(s)
I20260927 15:07:33.129320  4031 rpc-test.cc:1236] Sleep() min lat: 20393
I20260927 15:07:33.129405  4031 rpc-test.cc:1237] Sleep() mean lat: 20393
I20260927 15:07:33.129436  4031 rpc-test.cc:1238] Sleep() max lat: 20393
I20260927 15:07:33.129446  4031 rpc-test.cc:1239] Sleep() #calls: 1
[       OK ] Parameters/TestRpc.TestRpcHandlerLatencyMetric/SSL_TCP (67 ms)
[ RUN      ] Parameters/TestRpc.TimedOutOnResponseMetricServiceQueue/SSL_TCP
I20260927 15:07:33.149667  4374 acceptor_pool.cc:254] collecting diagnostics on the listening RPC socket 0.0.0.0:35665 every 8 connection(s)
I20260927 15:07:33.149717  4375 acceptor_pool.cc:254] collecting diagnostics on the listening RPC socket 0.0.0.0:35665 every 8 connection(s)
W20260927 15:07:33.200129  4376 rpcz_store.cc:267] Call kudu.rpc_test.CalculatorService.Sleep from 127.0.0.1:53208 (request call id 2) took 20 ms (client timeout 20 ms). Trace:
W20260927 15:07:33.200223  4376 rpcz_store.cc:269] 0927 15:07:33.179769 (+     0us) service_pool.cc:170] Inserting onto call queue
0927 15:07:33.200089 (+ 20320us) service_pool.cc:214] Skipping call since client already timed out
0927 15:07:33.200114 (+    25us) inbound_call.cc:173] Queueing failure response
Metrics: {}
[       OK ] Parameters/TestRpc.TimedOutOnResponseMetricServiceQueue/SSL_TCP (70 ms)
[ RUN      ] Parameters/TestRpc.RpcPendingConnectionsMetric/SSL_TCP
I20260927 15:07:33.204269  4397 acceptor_pool.cc:254] collecting diagnostics on the listening RPC socket 0.0.0.0:37509 every 8 connection(s)
I20260927 15:07:33.204289  4398 acceptor_pool.cc:254] collecting diagnostics on the listening RPC socket 0.0.0.0:37509 every 8 connection(s)
W20260927 15:07:33.205279  4393 negotiation.cc:337] Failed RPC negotiation. Trace:
0927 15:07:33.204906 (+     0us) reactor.cc:625] Submitting negotiation task for server connection from 127.0.0.1:50902 (local address 127.0.0.1:37509)
0927 15:07:33.204998 (+    92us) server_negotiation.cc:206] Beginning negotiation
0927 15:07:33.205001 (+     3us) server_negotiation.cc:399] Waiting for connection header
0927 15:07:33.205097 (+    96us) negotiation.cc:327] Negotiation complete: Network error: Server connection negotiation failed: server connection from 127.0.0.1:50902: BlockingRecv error: recv got EOF from 127.0.0.1:50902 (error 108)
Metrics: {"server-negotiator.queue_time_us":30}
[       OK ] Parameters/TestRpc.RpcPendingConnectionsMetric/SSL_TCP (14 ms)
[ RUN      ] Parameters/TestRpc.TestRpcContextClientDeadline/SSL_TCP
I20260927 15:07:33.238826  4413 acceptor_pool.cc:254] collecting diagnostics on the listening RPC socket 0.0.0.0:35431 every 8 connection(s)
I20260927 15:07:33.238827  4414 acceptor_pool.cc:254] collecting diagnostics on the listening RPC socket 0.0.0.0:35431 every 8 connection(s)
[       OK ] Parameters/TestRpc.TestRpcContextClientDeadline/SSL_TCP (65 ms)
[ RUN      ] Parameters/TestRpc.TestApplicationFeatureFlagUnsupportedServer/SSL_TCP
I20260927 15:07:33.297616  4439 acceptor_pool.cc:254] collecting diagnostics on the listening RPC socket 0.0.0.0:39167 every 8 connection(s)
I20260927 15:07:33.297602  4438 acceptor_pool.cc:254] collecting diagnostics on the listening RPC socket 0.0.0.0:39167 every 8 connection(s)
[       OK ] Parameters/TestRpc.TestApplicationFeatureFlagUnsupportedServer/SSL_TCP (28 ms)
[ RUN      ] Parameters/TestRpc.TestCancellationAsync/SSL_TCP
I20260927 15:07:33.320590  4463 acceptor_pool.cc:254] collecting diagnostics on the listening RPC socket 0.0.0.0:41685 every 8 connection(s)
I20260927 15:07:33.320632  4464 acceptor_pool.cc:254] collecting diagnostics on the listening RPC socket 0.0.0.0:41685 every 8 connection(s)
I20260927 15:07:33.320860  4031 rpc-test.cc:1716] Connecting to 0.0.0.0:41685
I20260927 15:07:33.331770  4031 test_util.cc:268] Using random seed: 1327236919
I20260927 15:07:33.350495  4467 rpc-test-base.h:240] got call: sleep_micros: 500 pattern: 4294967295 num_repetitions: 2097152 sidecar_idx: 0
I20260927 15:07:33.366791  4466 rpc-test-base.h:240] got call: sleep_micros: 500 pattern: 4294967295 num_repetitions: 2097152 sidecar_idx: 0
I20260927 15:07:33.384090  4467 rpc-test-base.h:240] got call: sleep_micros: 500 pattern: 4294967295 num_repetitions: 2097152 sidecar_idx: 0
I20260927 15:07:33.402254  4466 rpc-test-base.h:240] got call: sleep_micros: 500 pattern: 4294967295 num_repetitions: 2097152 sidecar_idx: 0
I20260927 15:07:33.423389  4467 rpc-test-base.h:240] got call: sleep_micros: 500 pattern: 4294967295 num_repetitions: 2097152 sidecar_idx: 0
I20260927 15:07:33.445264  4467 rpc-test-base.h:240] got call: sleep_micros: 500 pattern: 4294967295 num_repetitions: 2097152 sidecar_idx: 0
I20260927 15:07:33.467031  4467 rpc-test-base.h:240] got call: sleep_micros: 500 pattern: 4294967295 num_repetitions: 2097152 sidecar_idx: 0
W20260927 15:07:33.484783  4460 connection.cc:196] Error closing socket: Network error: TlsSocket::Close: Broken pipe
W20260927 15:07:33.490370  4460 connection.cc:441] server connection from 127.0.0.1:49912 torn down before Call kudu.rpc.GenericCalculatorService.SleepWithSidecar from 127.0.0.1:49912 (request call id 8) could send its response
[       OK ] Parameters/TestRpc.TestCancellationAsync/SSL_TCP (181 ms)
[ RUN      ] Parameters/TestRpc.TestPerformanceBySocketType/SSL_TCP
I20260927 15:07:33.517386  4488 acceptor_pool.cc:254] collecting diagnostics on the listening RPC socket 0.0.0.0:45971 every 8 connection(s)
I20260927 15:07:33.517393  4489 acceptor_pool.cc:254] collecting diagnostics on the listening RPC socket 0.0.0.0:45971 every 8 connection(s)
I20260927 15:07:33.517654  4031 rpc-test.cc:1846] Connecting to 0.0.0.0:45971
I20260927 15:07:35.616433  4031 rpc-test.cc:1859] Sending 1024MB via ssl-enabled tcp socket: real 2.079s	user 2.236s	sys 1.428s
I20260927 15:07:37.791216  4031 rpc-test.cc:1859] Sending 1024MB via ssl-enabled tcp socket: real 2.175s	user 2.380s	sys 1.448s
I20260927 15:07:39.876483  4031 rpc-test.cc:1859] Sending 1024MB via ssl-enabled tcp socket: real 2.085s	user 2.337s	sys 1.338s
I20260927 15:07:42.011197  4031 rpc-test.cc:1859] Sending 1024MB via ssl-enabled tcp socket: real 2.135s	user 2.302s	sys 1.445s
I20260927 15:07:44.119817  4031 rpc-test.cc:1859] Sending 1024MB via ssl-enabled tcp socket: real 2.109s	user 2.384s	sys 1.340s
[       OK ] Parameters/TestRpc.TestPerformanceBySocketType/SSL_TCP (10630 ms)
[----------] 20 tests from Parameters/TestRpc (35670 ms total)

[----------] 1 test from Parameters/TestRpcSocketTxRxQueue
[ RUN      ] Parameters/TestRpcSocketTxRxQueue.OverCapacity/0
W20260927 15:07:44.398583  4504 negotiation.cc:337] Failed RPC negotiation. Trace:
0927 15:07:44.131536 (+     0us) reactor.cc:625] Submitting negotiation task for client connection to 0.0.0.0:32899 (local address 127.0.0.1:52984)
0927 15:07:44.131653 (+   117us) negotiation.cc:107] Waiting for socket to connect
0927 15:07:44.131667 (+    14us) client_negotiation.cc:174] Beginning negotiation
0927 15:07:44.131810 (+   143us) client_negotiation.cc:252] Sending NEGOTIATE NegotiatePB request
0927 15:07:44.398438 (+266628us) negotiation.cc:327] Negotiation complete: Network error: Client connection negotiation failed: client connection to 0.0.0.0:32899: BlockingRecv error: recv error from unknown peer: Transport endpoint is not connected (error 107)
Metrics: {"client-negotiator.queue_time_us":48}
W20260927 15:07:44.398631  4514 negotiation.cc:337] Failed RPC negotiation. Trace:
0927 15:07:44.132618 (+     0us) reactor.cc:625] Submitting negotiation task for client connection to 0.0.0.0:32899 (local address 127.0.0.1:52990)
0927 15:07:44.132734 (+   116us) negotiation.cc:107] Waiting for socket to connect
0927 15:07:44.132746 (+    12us) client_negotiation.cc:174] Beginning negotiation
0927 15:07:44.132828 (+    82us) client_negotiation.cc:252] Sending NEGOTIATE NegotiatePB request
0927 15:07:44.398492 (+265664us) negotiation.cc:327] Negotiation complete: Network error: Client connection negotiation failed: client connection to 0.0.0.0:32899: BlockingRecv error: recv error from unknown peer: Transport endpoint is not connected (error 107)
Metrics: {"client-negotiator.queue_time_us":41}
W20260927 15:07:44.398583  4541 negotiation.cc:337] Failed RPC negotiation. Trace:
0927 15:07:44.136350 (+     0us) reactor.cc:625] Submitting negotiation task for client connection to 0.0.0.0:32899 (local address 127.0.0.1:53018)
0927 15:07:44.136471 (+   121us) negotiation.cc:107] Waiting for socket to connect
0927 15:07:44.136483 (+    12us) client_negotiation.cc:174] Beginning negotiation
0927 15:07:44.136559 (+    76us) client_negotiation.cc:252] Sending NEGOTIATE NegotiatePB request
0927 15:07:44.398531 (+261972us) negotiation.cc:327] Negotiation complete: Network error: Client connection negotiation failed: client connection to 0.0.0.0:32899: BlockingRecv error: recv error from unknown peer: Transport endpoint is not connected (error 107)
Metrics: {"client-negotiator.queue_time_us":49}
W20260927 15:07:44.398964  4523 negotiation.cc:337] Failed RPC negotiation. Trace:
0927 15:07:44.133880 (+     0us) reactor.cc:625] Submitting negotiation task for client connection to 0.0.0.0:32899 (local address 127.0.0.1:53000)
0927 15:07:44.134029 (+   149us) negotiation.cc:107] Waiting for socket to connect
0927 15:07:44.134043 (+    14us) client_negotiation.cc:174] Beginning negotiation
0927 15:07:44.134125 (+    82us) client_negotiation.cc:252] Sending NEGOTIATE NegotiatePB request
0927 15:07:44.398492 (+264367us) negotiation.cc:327] Negotiation complete: Network error: Client connection negotiation failed: client connection to 0.0.0.0:32899: BlockingRecv error: recv error from unknown peer: Transport endpoint is not connected (error 107)
Metrics: {"client-negotiator.queue_time_us":61}
W20260927 15:07:44.398977  4532 negotiation.cc:337] Failed RPC negotiation. Trace:
0927 15:07:44.135133 (+     0us) reactor.cc:625] Submitting negotiation task for client connection to 0.0.0.0:32899 (local address 127.0.0.1:53002)
0927 15:07:44.135236 (+   103us) negotiation.cc:107] Waiting for socket to connect
0927 15:07:44.135247 (+    11us) client_negotiation.cc:174] Beginning negotiation
0927 15:07:44.135319 (+    72us) client_negotiation.cc:252] Sending NEGOTIATE NegotiatePB request
0927 15:07:44.398438 (+263119us) negotiation.cc:327] Negotiation complete: Network error: Client connection negotiation failed: client connection to 0.0.0.0:32899: BlockingRecv error: recv error from unknown peer: Transport endpoint is not connected (error 107)
Metrics: {"client-negotiator.queue_time_us":42}
W20260927 15:07:44.398754  4550 negotiation.cc:337] Failed RPC negotiation. Trace:
0927 15:07:44.137374 (+     0us) reactor.cc:625] Submitting negotiation task for client connection to 0.0.0.0:32899 (local address 127.0.0.1:53034)
0927 15:07:44.137454 (+    80us) negotiation.cc:107] Waiting for socket to connect
0927 15:07:44.137465 (+    11us) client_negotiation.cc:174] Beginning negotiation
0927 15:07:44.137538 (+    73us) client_negotiation.cc:252] Sending NEGOTIATE NegotiatePB request
0927 15:07:44.398673 (+261135us) negotiation.cc:327] Negotiation complete: Network error: Client connection negotiation failed: client connection to 0.0.0.0:32899: BlockingRecv error: recv error from unknown peer: Transport endpoint is not connected (error 107)
Metrics: {"client-negotiator.queue_time_us":25}
[       OK ] Parameters/TestRpcSocketTxRxQueue.OverCapacity/0 (1056 ms)
[----------] 1 test from Parameters/TestRpcSocketTxRxQueue (1057 ms total)

[----------] Global test environment tear-down
[==========] 21 tests from 2 test suites ran. (36727 ms total)
[  PASSED  ] 20 tests.
[  FAILED  ] 1 test, listed below:
[  FAILED  ] Parameters/TestRpc.TestCallWithChainCertAndChainCA/SSL_TCP, where GetParam() = (true, false)

 1 FAILED TEST