Diagnosed failure

Parameters/TestRpc.TestCallWithChainCertAndChainCA/SSL_TCP: /data0/somelongdirectorytoavoidrpathissues/src/kudu/src/kudu/rpc/rpc-test.cc:270: Failure
Failed
Bad status: Runtime error: could not verify certificate chain (error with cert: subject=CN = localhost, ST = sadfjas, C = AS, emailAddress = sdflkdsajf, O = lskdfjlsad, OU = sldfkja, issuer=C = AS, ST = ASDfkjdhf, L = lskdjf, O = saldfja, OU = skdjf, CN = localhost, emailAddress = sadjflkadsj): : certificate has expired
Google Test trace:
/data0/somelongdirectorytoavoidrpathissues/src/kudu/src/kudu/rpc/rpc-test.cc:267: Connecting to 0.0.0.0:41609
I20260928 19:27:18.937659   390 test_util.cc:175] -----------------------------------------------
I20260928 19:27:18.937841   390 test_util.cc:176] Had fatal failures, leaving test files at /tmp/dist-test-task3GJ_s8/test-tmp/rpc-test.5.Parameters_TestRpc.TestCallWithChainCertAndChainCA_SSL_TCP.1790623637482668-390-0

Full log

Note: This is test shard 6 of 8.
[==========] Running 21 tests from 2 test suites.
[----------] Global test environment set-up.
[----------] 20 tests from Parameters/TestRpc
[ RUN      ] Parameters/TestRpc.TestMessengerCreateDestroy/SSL_TCP
WARNING: Logging before InitGoogleLogging() is written to STDERR
I20260928 19:27:17.587634   390 rpc-test.cc:169] started messenger TestCreateDestroy
[       OK ] Parameters/TestRpc.TestMessengerCreateDestroy/SSL_TCP (1240 ms)
[ RUN      ] Parameters/TestRpc.TestNegotiationDeadlock/SSL_TCP
I20260928 19:27:18.814005   412 acceptor_pool.cc:254] collecting diagnostics on the listening RPC socket 0.0.0.0:37743 every 8 connection(s)
I20260928 19:27:18.815475   413 acceptor_pool.cc:254] collecting diagnostics on the listening RPC socket 0.0.0.0:37743 every 8 connection(s)
[       OK ] Parameters/TestRpc.TestNegotiationDeadlock/SSL_TCP (102 ms)
[ RUN      ] Parameters/TestRpc.TestCallWithChainCertAndChainCA/SSL_TCP
I20260928 19:27:18.902323   428 acceptor_pool.cc:254] collecting diagnostics on the listening RPC socket 0.0.0.0:41609 every 8 connection(s)
I20260928 19:27:18.904309   429 acceptor_pool.cc:254] collecting diagnostics on the listening RPC socket 0.0.0.0:41609 every 8 connection(s)
/data0/somelongdirectorytoavoidrpathissues/src/kudu/src/kudu/rpc/rpc-test.cc:270: Failure
Failed
Bad status: Runtime error: could not verify certificate chain (error with cert: subject=CN = localhost, ST = sadfjas, C = AS, emailAddress = sdflkdsajf, O = lskdfjlsad, OU = sldfkja, issuer=C = AS, ST = ASDfkjdhf, L = lskdjf, O = saldfja, OU = skdjf, CN = localhost, emailAddress = sadjflkadsj): : certificate has expired
Google Test trace:
/data0/somelongdirectorytoavoidrpathissues/src/kudu/src/kudu/rpc/rpc-test.cc:267: Connecting to 0.0.0.0:41609
I20260928 19:27:18.937659   390 test_util.cc:175] -----------------------------------------------
I20260928 19:27:18.937841   390 test_util.cc:176] Had fatal failures, leaving test files at /tmp/dist-test-task3GJ_s8/test-tmp/rpc-test.5.Parameters_TestRpc.TestCallWithChainCertAndChainCA_SSL_TCP.1790623637482668-390-0
[  FAILED  ] Parameters/TestRpc.TestCallWithChainCertAndChainCA/SSL_TCP, where GetParam() = (true, false) (56 ms)
[ RUN      ] Parameters/TestRpc.TestCallWithPasswordProtectedKey/SSL_TCP
I20260928 19:27:18.976305   453 acceptor_pool.cc:254] collecting diagnostics on the listening RPC socket 0.0.0.0:40921 every 8 connection(s)
I20260928 19:27:18.977042   454 acceptor_pool.cc:254] collecting diagnostics on the listening RPC socket 0.0.0.0:40921 every 8 connection(s)
[       OK ] Parameters/TestRpc.TestCallWithPasswordProtectedKey/SSL_TCP (90 ms)
[ RUN      ] Parameters/TestRpc.TestCallToBadServer/SSL_TCP
I20260928 19:27:19.068382   390 rpc-test.cc:394] Status: Network error: Client connection negotiation failed: client connection to 0.0.0.0:0: connect: Connection refused (error 111)
I20260928 19:27:19.069927   390 rpc-test.cc:394] Status: Network error: Client connection negotiation failed: client connection to 0.0.0.0:0: connect: Connection refused (error 111)
I20260928 19:27:19.071201   390 rpc-test.cc:394] Status: Network error: Client connection negotiation failed: client connection to 0.0.0.0:0: connect: Connection refused (error 111)
I20260928 19:27:19.072540   390 rpc-test.cc:394] Status: Network error: Client connection negotiation failed: client connection to 0.0.0.0:0: connect: Connection refused (error 111)
I20260928 19:27:19.073792   390 rpc-test.cc:394] Status: Network error: Client connection negotiation failed: client connection to 0.0.0.0:0: connect: Connection refused (error 111)
[       OK ] Parameters/TestRpc.TestCallToBadServer/SSL_TCP (48 ms)
[ RUN      ] Parameters/TestRpc.TestWrongService/SSL_TCP
I20260928 19:27:19.101593   488 acceptor_pool.cc:254] collecting diagnostics on the listening RPC socket 0.0.0.0:42443 every 8 connection(s)
I20260928 19:27:19.102543   489 acceptor_pool.cc:254] collecting diagnostics on the listening RPC socket 0.0.0.0:42443 every 8 connection(s)
I20260928 19:27:19.142829   487 messenger.cc:345] service WrongServiceName not registered on TestServer
[       OK ] Parameters/TestRpc.TestWrongService/SSL_TCP (73 ms)
[ RUN      ] Parameters/TestRpc.TestConnectionKeepalive/SSL_TCP
I20260928 19:27:19.180632   511 acceptor_pool.cc:254] collecting diagnostics on the listening RPC socket 0.0.0.0:40161 every 8 connection(s)
I20260928 19:27:19.181433   512 acceptor_pool.cc:254] collecting diagnostics on the listening RPC socket 0.0.0.0:40161 every 8 connection(s)
I20260928 19:27:19.184773   390 rpc-test.cc:488] Connecting to 0.0.0.0:40161
[       OK ] Parameters/TestRpc.TestConnectionKeepalive/SSL_TCP (1072 ms)
[ RUN      ] Parameters/TestRpc.TestClientConnectionMetrics/SSL_TCP
I20260928 19:27:20.248260   536 acceptor_pool.cc:254] collecting diagnostics on the listening RPC socket 0.0.0.0:36177 every 8 connection(s)
I20260928 19:27:20.248989   537 acceptor_pool.cc:254] collecting diagnostics on the listening RPC socket 0.0.0.0:36177 every 8 connection(s)
I20260928 19:27:20.252243   390 rpc-test.cc:569] Connecting to 0.0.0.0:36177
[       OK ] Parameters/TestRpc.TestClientConnectionMetrics/SSL_TCP (120231 ms)
[ RUN      ] Parameters/TestRpc.TestCredentialsPolicy/SSL_TCP
I20260928 19:29:20.476972   571 acceptor_pool.cc:254] collecting diagnostics on the listening RPC socket 0.0.0.0:46423 every 8 connection(s)
I20260928 19:29:20.477814   572 acceptor_pool.cc:254] collecting diagnostics on the listening RPC socket 0.0.0.0:46423 every 8 connection(s)
I20260928 19:29:20.480973   390 rpc-test.cc:700] Connecting to 0.0.0.0:46423
[       OK ] Parameters/TestRpc.TestCredentialsPolicy/SSL_TCP (80 ms)
[ RUN      ] Parameters/TestRpc.TestCallLongerThanKeepalive/SSL_TCP
I20260928 19:29:20.571266   596 acceptor_pool.cc:254] collecting diagnostics on the listening RPC socket 0.0.0.0:43975 every 8 connection(s)
I20260928 19:29:20.572007   597 acceptor_pool.cc:254] collecting diagnostics on the listening RPC socket 0.0.0.0:43975 every 8 connection(s)
I20260928 19:29:20.603570   600 rpc-test-base.h:222] got call: sleep_micros: 3000000 deferred: true
I20260928 19:29:23.607847   600 rpcz_store.cc:275] Call kudu.rpc.GenericCalculatorService.Sleep from 127.0.0.1:55178 (request call id 0) took 3004 ms. Trace:
I20260928 19:29:23.608409   600 rpcz_store.cc:276] 0928 19:29:20.603322 (+     0us) service_pool.cc:170] Inserting onto call queue
0928 19:29:20.603421 (+    99us) service_pool.cc:227] Handling call
0928 19:29:23.607788 (+3004367us) inbound_call.cc:173] Queueing success response
Metrics: {}
[       OK ] Parameters/TestRpc.TestCallLongerThanKeepalive/SSL_TCP (3081 ms)
[ RUN      ] Parameters/TestRpc.TestRpcSidecar/SSL_TCP
I20260928 19:29:23.644414   621 acceptor_pool.cc:254] collecting diagnostics on the listening RPC socket 0.0.0.0:38815 every 8 connection(s)
I20260928 19:29:23.645267   622 acceptor_pool.cc:254] collecting diagnostics on the listening RPC socket 0.0.0.0:38815 every 8 connection(s)
[       OK ] Parameters/TestRpc.TestRpcSidecar/SSL_TCP (535 ms)
[ RUN      ] Parameters/TestRpc.TestRpcSidecarLimits/SSL_TCP
I20260928 19:29:41.603271   648 acceptor_pool.cc:254] collecting diagnostics on the listening RPC socket 0.0.0.0:33051 every 8 connection(s)
I20260928 19:29:41.604071   649 acceptor_pool.cc:254] collecting diagnostics on the listening RPC socket 0.0.0.0:33051 every 8 connection(s)
W20260928 19:29:41.619486   390 serialization.cc:72] Serialized kudu.rpc_test.PushStringsRequestPB (2147483654 bytes) is larger than the maximum configured RPC message size (52428800 bytes). Sending anyway, but peer may reject the data.
W20260928 19:29:41.631711   646 connection.cc:535] server connection from 127.0.0.1:37640 recv error: Network error: RPC frame had a length of 2147483714, but we only support messages up to 52428800 bytes long.
W20260928 19:29:41.632157   646 connection.cc:158] shutting down server connection from 127.0.0.1:37640 with pending inbound data: 4/2147483714 bytes received; last active 0 ns ago: status Network error: RPC frame had a length of 2147483714, but we only support messages up to 52428800 bytes long.
W20260928 19:29:41.633409   661 connection.cc:698] client connection to 0.0.0.0:33051 send error: Network error: failed to write to TLS socket: Connection reset by peer
W20260928 19:29:41.634078   661 connection.cc:196] Error closing socket: Network error: TlsSocket::Close: Success
[       OK ] Parameters/TestRpc.TestRpcSidecarLimits/SSL_TCP (18144 ms)
[ RUN      ] Parameters/TestRpc.TestCallTimeoutDoesntAffectNegotiation/SSL_TCP
I20260928 19:29:42.347733   673 acceptor_pool.cc:254] collecting diagnostics on the listening RPC socket 0.0.0.0:41741 every 8 connection(s)
I20260928 19:29:42.348464   674 acceptor_pool.cc:254] collecting diagnostics on the listening RPC socket 0.0.0.0:41741 every 8 connection(s)
W20260928 19:29:42.365986   669 negotiation.cc:266] Injecting 500ms delay in negotiation
I20260928 19:29:42.415807   390 rpc-test-base.h:595] status: Timed out: connection negotiation to 0.0.0.0:41741 for RPC Sleep timed out after 0.050s (ON_OUTBOUND_QUEUE), seconds elapsed: 0.0510652
[       OK ] Parameters/TestRpc.TestCallTimeoutDoesntAffectNegotiation/SSL_TCP (591 ms)
[ RUN      ] Parameters/TestRpc.TestRpcHandlerLatencyMetric/SSL_TCP
I20260928 19:29:42.918641   698 acceptor_pool.cc:254] collecting diagnostics on the listening RPC socket 0.0.0.0:40275 every 8 connection(s)
I20260928 19:29:42.919241   699 acceptor_pool.cc:254] collecting diagnostics on the listening RPC socket 0.0.0.0:40275 every 8 connection(s)
I20260928 19:29:42.980436   390 rpc-test.cc:1236] Sleep() min lat: 21625
I20260928 19:29:42.980633   390 rpc-test.cc:1237] Sleep() mean lat: 21625
I20260928 19:29:42.980827   390 rpc-test.cc:1238] Sleep() max lat: 21625
I20260928 19:29:42.981006   390 rpc-test.cc:1239] Sleep() #calls: 1
[       OK ] Parameters/TestRpc.TestRpcHandlerLatencyMetric/SSL_TCP (97 ms)
[ RUN      ] Parameters/TestRpc.TimedOutOnResponseMetricServiceQueue/SSL_TCP
I20260928 19:29:43.010341   724 acceptor_pool.cc:254] collecting diagnostics on the listening RPC socket 0.0.0.0:37901 every 8 connection(s)
I20260928 19:29:43.011093   725 acceptor_pool.cc:254] collecting diagnostics on the listening RPC socket 0.0.0.0:37901 every 8 connection(s)
W20260928 19:29:43.092432   726 rpcz_store.cc:267] Call kudu.rpc_test.CalculatorService.Sleep from 127.0.0.1:35258 (request call id 2) took 20 ms (client timeout 20 ms). Trace:
W20260928 19:29:43.092809   726 rpcz_store.cc:269] 0928 19:29:43.071793 (+     0us) service_pool.cc:170] Inserting onto call queue
0928 19:29:43.092216 (+ 20423us) service_pool.cc:214] Skipping call since client already timed out
0928 19:29:43.092369 (+   153us) inbound_call.cc:173] Queueing failure response
Metrics: {}
W20260928 19:29:43.094933   721 connection.cc:196] Error closing socket: Network error: TlsSocket::Close: Connection reset by peer
[       OK ] Parameters/TestRpc.TimedOutOnResponseMetricServiceQueue/SSL_TCP (110 ms)
[ RUN      ] Parameters/TestRpc.RpcPendingConnectionsMetric/SSL_TCP
I20260928 19:29:43.109908   747 acceptor_pool.cc:254] collecting diagnostics on the listening RPC socket 0.0.0.0:41609 every 8 connection(s)
I20260928 19:29:43.110621   748 acceptor_pool.cc:254] collecting diagnostics on the listening RPC socket 0.0.0.0:41609 every 8 connection(s)
W20260928 19:29:43.124276   743 negotiation.cc:337] Failed RPC negotiation. Trace:
0928 19:29:43.122414 (+     0us) reactor.cc:625] Submitting negotiation task for server connection from 127.0.0.1:52684 (local address 127.0.0.1:41609)
0928 19:29:43.123003 (+   589us) server_negotiation.cc:206] Beginning negotiation
0928 19:29:43.123030 (+    27us) server_negotiation.cc:399] Waiting for connection header
0928 19:29:43.123426 (+   396us) negotiation.cc:327] Negotiation complete: Network error: Server connection negotiation failed: server connection from 127.0.0.1:52684: BlockingRecv error: recv got EOF from 127.0.0.1:52684 (error 108)
Metrics: {"server-negotiator.queue_time_us":142}
[       OK ] Parameters/TestRpc.RpcPendingConnectionsMetric/SSL_TCP (38 ms)
[ RUN      ] Parameters/TestRpc.TestRpcContextClientDeadline/SSL_TCP
I20260928 19:29:43.175071   763 acceptor_pool.cc:254] collecting diagnostics on the listening RPC socket 0.0.0.0:34923 every 8 connection(s)
I20260928 19:29:43.175798   764 acceptor_pool.cc:254] collecting diagnostics on the listening RPC socket 0.0.0.0:34923 every 8 connection(s)
[       OK ] Parameters/TestRpc.TestRpcContextClientDeadline/SSL_TCP (99 ms)
[ RUN      ] Parameters/TestRpc.TestApplicationFeatureFlagUnsupportedServer/SSL_TCP
I20260928 19:29:43.258240   788 acceptor_pool.cc:254] collecting diagnostics on the listening RPC socket 0.0.0.0:36163 every 8 connection(s)
I20260928 19:29:43.258965   789 acceptor_pool.cc:254] collecting diagnostics on the listening RPC socket 0.0.0.0:36163 every 8 connection(s)
[       OK ] Parameters/TestRpc.TestApplicationFeatureFlagUnsupportedServer/SSL_TCP (67 ms)
[ RUN      ] Parameters/TestRpc.TestCancellationAsync/SSL_TCP
I20260928 19:29:43.331054   813 acceptor_pool.cc:254] collecting diagnostics on the listening RPC socket 0.0.0.0:46729 every 8 connection(s)
I20260928 19:29:43.331959   814 acceptor_pool.cc:254] collecting diagnostics on the listening RPC socket 0.0.0.0:46729 every 8 connection(s)
I20260928 19:29:43.335207   390 rpc-test.cc:1716] Connecting to 0.0.0.0:46729
I20260928 19:29:43.349514   390 test_util.cc:268] Using random seed: 378039539
I20260928 19:29:43.602699   817 rpc-test-base.h:240] got call: sleep_micros: 500 pattern: 4294967295 num_repetitions: 2097152 sidecar_idx: 0
I20260928 19:29:43.803704   817 rpc-test-base.h:240] got call: sleep_micros: 500 pattern: 4294967295 num_repetitions: 2097152 sidecar_idx: 0
I20260928 19:29:43.987504   817 rpc-test-base.h:240] got call: sleep_micros: 500 pattern: 4294967295 num_repetitions: 2097152 sidecar_idx: 0
I20260928 19:29:44.171627   817 rpc-test-base.h:240] got call: sleep_micros: 500 pattern: 4294967295 num_repetitions: 2097152 sidecar_idx: 0
I20260928 19:29:44.353061   817 rpc-test-base.h:240] got call: sleep_micros: 500 pattern: 4294967295 num_repetitions: 2097152 sidecar_idx: 0
I20260928 19:29:44.538839   817 rpc-test-base.h:240] got call: sleep_micros: 500 pattern: 4294967295 num_repetitions: 2097152 sidecar_idx: 0
I20260928 19:29:44.723150   817 rpc-test-base.h:240] got call: sleep_micros: 500 pattern: 4294967295 num_repetitions: 2097152 sidecar_idx: 0
I20260928 19:29:44.905850   817 rpc-test-base.h:240] got call: sleep_micros: 500 pattern: 4294967295 num_repetitions: 2097152 sidecar_idx: 0
W20260928 19:29:45.062637   810 connection.cc:196] Error closing socket: Network error: TlsSocket::Close: Broken pipe
W20260928 19:29:45.089008   810 connection.cc:441] server connection from 127.0.0.1:60208 torn down before Call kudu.rpc.GenericCalculatorService.SleepWithSidecar from 127.0.0.1:60208 (request call id 8) could send its response
[       OK ] Parameters/TestRpc.TestCancellationAsync/SSL_TCP (1794 ms)
[ RUN      ] Parameters/TestRpc.TestPerformanceBySocketType/SSL_TCP
I20260928 19:29:45.197376   838 acceptor_pool.cc:254] collecting diagnostics on the listening RPC socket 0.0.0.0:33505 every 8 connection(s)
I20260928 19:29:45.198091   839 acceptor_pool.cc:254] collecting diagnostics on the listening RPC socket 0.0.0.0:33505 every 8 connection(s)
I20260928 19:29:45.201282   390 rpc-test.cc:1846] Connecting to 0.0.0.0:33505
I20260928 19:30:04.765635   390 rpc-test.cc:1859] Sending 1024MB via ssl-enabled tcp socket: real 19.537s	user 16.956s	sys 11.037s
I20260928 19:30:24.204622   390 rpc-test.cc:1859] Sending 1024MB via ssl-enabled tcp socket: real 19.438s	user 16.569s	sys 11.147s
I20260928 19:30:43.584362   390 rpc-test.cc:1859] Sending 1024MB via ssl-enabled tcp socket: real 19.379s	user 16.443s	sys 11.186s
I20260928 19:31:02.944379   390 rpc-test.cc:1859] Sending 1024MB via ssl-enabled tcp socket: real 19.360s	user 16.500s	sys 11.082s
I20260928 19:31:22.410781   390 rpc-test.cc:1859] Sending 1024MB via ssl-enabled tcp socket: real 19.466s	user 16.804s	sys 10.995s
[       OK ] Parameters/TestRpc.TestPerformanceBySocketType/SSL_TCP (97329 ms)
[----------] 20 tests from Parameters/TestRpc (244891 ms total)

[----------] 1 test from Parameters/TestRpcSocketTxRxQueue
[ RUN      ] Parameters/TestRpcSocketTxRxQueue.OverCapacity/0
W20260928 19:31:22.873961   865 negotiation.cc:337] Failed RPC negotiation. Trace:
0928 19:31:22.448287 (+     0us) reactor.cc:625] Submitting negotiation task for client connection to 0.0.0.0:36199 (local address 127.0.0.1:56310)
0928 19:31:22.449000 (+   713us) negotiation.cc:107] Waiting for socket to connect
0928 19:31:22.449050 (+    50us) client_negotiation.cc:174] Beginning negotiation
0928 19:31:22.449619 (+   569us) client_negotiation.cc:252] Sending NEGOTIATE NegotiatePB request
0928 19:31:22.871429 (+421810us) negotiation.cc:327] Negotiation complete: Network error: Client connection negotiation failed: client connection to 0.0.0.0:36199: BlockingRecv error: recv error from unknown peer: Transport endpoint is not connected (error 107)
Metrics: {"client-negotiator.queue_time_us":146}
W20260928 19:31:22.874272   901 negotiation.cc:337] Failed RPC negotiation. Trace:
0928 19:31:22.485968 (+     0us) reactor.cc:625] Submitting negotiation task for client connection to 0.0.0.0:36199 (local address 127.0.0.1:56348)
0928 19:31:22.486525 (+   557us) negotiation.cc:107] Waiting for socket to connect
0928 19:31:22.486555 (+    30us) client_negotiation.cc:174] Beginning negotiation
0928 19:31:22.486735 (+   180us) client_negotiation.cc:252] Sending NEGOTIATE NegotiatePB request
0928 19:31:22.871862 (+385127us) negotiation.cc:327] Negotiation complete: Network error: Client connection negotiation failed: client connection to 0.0.0.0:36199: BlockingRecv error: recv error from unknown peer: Transport endpoint is not connected (error 107)
Metrics: {"client-negotiator.queue_time_us":138}
W20260928 19:31:22.874580   874 negotiation.cc:337] Failed RPC negotiation. Trace:
0928 19:31:22.455149 (+     0us) reactor.cc:625] Submitting negotiation task for client connection to 0.0.0.0:36199 (local address 127.0.0.1:56312)
0928 19:31:22.455691 (+   542us) negotiation.cc:107] Waiting for socket to connect
0928 19:31:22.455720 (+    29us) client_negotiation.cc:174] Beginning negotiation
0928 19:31:22.455901 (+   181us) client_negotiation.cc:252] Sending NEGOTIATE NegotiatePB request
0928 19:31:22.871404 (+415503us) negotiation.cc:327] Negotiation complete: Network error: Client connection negotiation failed: client connection to 0.0.0.0:36199: BlockingRecv error: recv error from unknown peer: Transport endpoint is not connected (error 107)
Metrics: {"client-negotiator.queue_time_us":133}
W20260928 19:31:22.875016   883 negotiation.cc:337] Failed RPC negotiation. Trace:
0928 19:31:22.462323 (+     0us) reactor.cc:625] Submitting negotiation task for client connection to 0.0.0.0:36199 (local address 127.0.0.1:56322)
0928 19:31:22.462782 (+   459us) negotiation.cc:107] Waiting for socket to connect
0928 19:31:22.462811 (+    29us) client_negotiation.cc:174] Beginning negotiation
0928 19:31:22.463009 (+   198us) client_negotiation.cc:252] Sending NEGOTIATE NegotiatePB request
0928 19:31:22.874058 (+411049us) negotiation.cc:327] Negotiation complete: Network error: Client connection negotiation failed: client connection to 0.0.0.0:36199: BlockingRecv error: recv error from unknown peer: Transport endpoint is not connected (error 107)
Metrics: {"client-negotiator.queue_time_us":102}
W20260928 19:31:22.875831   910 negotiation.cc:337] Failed RPC negotiation. Trace:
0928 19:31:22.497299 (+     0us) reactor.cc:625] Submitting negotiation task for client connection to 0.0.0.0:36199 (local address 127.0.0.1:56350)
0928 19:31:22.497884 (+   585us) negotiation.cc:107] Waiting for socket to connect
0928 19:31:22.497921 (+    37us) client_negotiation.cc:174] Beginning negotiation
0928 19:31:22.498106 (+   185us) client_negotiation.cc:252] Sending NEGOTIATE NegotiatePB request
0928 19:31:22.871429 (+373323us) negotiation.cc:327] Negotiation complete: Network error: Client connection negotiation failed: client connection to 0.0.0.0:36199: BlockingRecv error: recv error from unknown peer: Transport endpoint is not connected (error 107)
Metrics: {"client-negotiator.queue_time_us":172}
W20260928 19:31:22.876039   892 negotiation.cc:337] Failed RPC negotiation. Trace:
0928 19:31:22.474346 (+     0us) reactor.cc:625] Submitting negotiation task for client connection to 0.0.0.0:36199 (local address 127.0.0.1:56336)
0928 19:31:22.474880 (+   534us) negotiation.cc:107] Waiting for socket to connect
0928 19:31:22.474922 (+    42us) client_negotiation.cc:174] Beginning negotiation
0928 19:31:22.475100 (+   178us) client_negotiation.cc:252] Sending NEGOTIATE NegotiatePB request
0928 19:31:22.873895 (+398795us) negotiation.cc:327] Negotiation complete: Network error: Client connection negotiation failed: client connection to 0.0.0.0:36199: BlockingRecv error: recv error from unknown peer: Transport endpoint is not connected (error 107)
Metrics: {"client-negotiator.queue_time_us":147}
[       OK ] Parameters/TestRpcSocketTxRxQueue.OverCapacity/0 (1233 ms)
[----------] 1 test from Parameters/TestRpcSocketTxRxQueue (1233 ms total)

[----------] Global test environment tear-down
[==========] 21 tests from 2 test suites ran. (246126 ms total)
[  PASSED  ] 20 tests.
[  FAILED  ] 1 test, listed below:
[  FAILED  ] Parameters/TestRpc.TestCallWithChainCertAndChainCA/SSL_TCP, where GetParam() = (true, false)

 1 FAILED TEST