Diagnosed failure
Parameters/TestRpc.TestCallWithChainCertAndChainCA/SSL_UnixSocket: /data0/somelongdirectorytoavoidrpathissues/src/kudu/src/kudu/rpc/rpc-test.cc:270: Failure
Failed
Bad status: Runtime error: could not verify certificate chain (error with cert: subject=CN = localhost, ST = sadfjas, C = AS, emailAddress = sdflkdsajf, O = lskdfjlsad, OU = sldfkja, issuer=C = AS, ST = ASDfkjdhf, L = lskdjf, O = saldfja, OU = skdjf, CN = localhost, emailAddress = sadjflkadsj): : certificate has expired
Google Test trace:
/data0/somelongdirectorytoavoidrpathissues/src/kudu/src/kudu/rpc/rpc-test.cc:267: Connecting to unix:/tmp/dist-test-tasknekIfH/test-tmp/rpc-test-e761a340e803472aa31c3dc4a6080316.sock
I20260924 16:00:29.279767 4950 test_util.cc:175] -----------------------------------------------
I20260924 16:00:29.279842 4950 test_util.cc:176] Had fatal failures, leaving test files at /tmp/dist-test-tasknekIfH/test-tmp/rpc-test.6.Parameters_TestRpc.TestCallWithChainCertAndChainCA_SSL_UnixSocket.1790265629171514-4950-0
Full log
Note: This is test shard 7 of 8.
[==========] Running 21 tests from 2 test suites.
[----------] Global test environment set-up.
[----------] 20 tests from Parameters/TestRpc
[ RUN ] Parameters/TestRpc.TestMessengerCreateDestroy/SSL_UnixSocket
WARNING: Logging before InitGoogleLogging() is written to STDERR
I20260924 16:00:29.215878 4950 rpc-test.cc:169] started messenger TestCreateDestroy
[ OK ] Parameters/TestRpc.TestMessengerCreateDestroy/SSL_UnixSocket (28 ms)
[ RUN ] Parameters/TestRpc.TestNegotiationDeadlock/SSL_UnixSocket
I20260924 16:00:29.228853 4970 acceptor_pool.cc:254] collecting diagnostics on the listening RPC socket unix:/tmp/dist-test-tasknekIfH/test-tmp/rpc-test-2e105f476e4c414591b162c878613007.sock every 8 connection(s)
I20260924 16:00:29.229120 4971 acceptor_pool.cc:254] collecting diagnostics on the listening RPC socket unix:/tmp/dist-test-tasknekIfH/test-tmp/rpc-test-2e105f476e4c414591b162c878613007.sock every 8 connection(s)
[ OK ] Parameters/TestRpc.TestNegotiationDeadlock/SSL_UnixSocket (28 ms)
[ RUN ] Parameters/TestRpc.TestCallWithChainCertAndChainCA/SSL_UnixSocket
I20260924 16:00:29.268594 4987 acceptor_pool.cc:254] collecting diagnostics on the listening RPC socket unix:/tmp/dist-test-tasknekIfH/test-tmp/rpc-test-e761a340e803472aa31c3dc4a6080316.sock every 8 connection(s)
I20260924 16:00:29.268919 4988 acceptor_pool.cc:254] collecting diagnostics on the listening RPC socket unix:/tmp/dist-test-tasknekIfH/test-tmp/rpc-test-e761a340e803472aa31c3dc4a6080316.sock every 8 connection(s)
/data0/somelongdirectorytoavoidrpathissues/src/kudu/src/kudu/rpc/rpc-test.cc:270: Failure
Failed
Bad status: Runtime error: could not verify certificate chain (error with cert: subject=CN = localhost, ST = sadfjas, C = AS, emailAddress = sdflkdsajf, O = lskdfjlsad, OU = sldfkja, issuer=C = AS, ST = ASDfkjdhf, L = lskdjf, O = saldfja, OU = skdjf, CN = localhost, emailAddress = sadjflkadsj): : certificate has expired
Google Test trace:
/data0/somelongdirectorytoavoidrpathissues/src/kudu/src/kudu/rpc/rpc-test.cc:267: Connecting to unix:/tmp/dist-test-tasknekIfH/test-tmp/rpc-test-e761a340e803472aa31c3dc4a6080316.sock
I20260924 16:00:29.279767 4950 test_util.cc:175] -----------------------------------------------
I20260924 16:00:29.279842 4950 test_util.cc:176] Had fatal failures, leaving test files at /tmp/dist-test-tasknekIfH/test-tmp/rpc-test.6.Parameters_TestRpc.TestCallWithChainCertAndChainCA_SSL_UnixSocket.1790265629171514-4950-0
[ FAILED ] Parameters/TestRpc.TestCallWithChainCertAndChainCA/SSL_UnixSocket, where GetParam() = (true, true) (32 ms)
[ RUN ] Parameters/TestRpc.TestCallWithPasswordProtectedKey/SSL_UnixSocket
I20260924 16:00:29.297103 5012 acceptor_pool.cc:254] collecting diagnostics on the listening RPC socket unix:/tmp/dist-test-tasknekIfH/test-tmp/rpc-test-411ece9e4ac04fe7ab3a317a51d0a6e5.sock every 8 connection(s)
I20260924 16:00:29.297344 5013 acceptor_pool.cc:254] collecting diagnostics on the listening RPC socket unix:/tmp/dist-test-tasknekIfH/test-tmp/rpc-test-411ece9e4ac04fe7ab3a317a51d0a6e5.sock every 8 connection(s)
W20260924 16:00:29.328277 5009 connection.cc:196] Error closing socket: Network error: TlsSocket::Close: Broken pipe
[ OK ] Parameters/TestRpc.TestCallWithPasswordProtectedKey/SSL_UnixSocket (52 ms)
[ RUN ] Parameters/TestRpc.TestCallToBadServer/SSL_UnixSocket
I20260924 16:00:29.348783 4950 rpc-test.cc:394] Status: Network error: Client connection negotiation failed: client connection to 0.0.0.0:0: connect: Connection refused (error 111)
I20260924 16:00:29.349423 4950 rpc-test.cc:394] Status: Network error: Client connection negotiation failed: client connection to 0.0.0.0:0: connect: Connection refused (error 111)
I20260924 16:00:29.349983 4950 rpc-test.cc:394] Status: Network error: Client connection negotiation failed: client connection to 0.0.0.0:0: connect: Connection refused (error 111)
I20260924 16:00:29.350548 4950 rpc-test.cc:394] Status: Network error: Client connection negotiation failed: client connection to 0.0.0.0:0: connect: Connection refused (error 111)
I20260924 16:00:29.351130 4950 rpc-test.cc:394] Status: Network error: Client connection negotiation failed: client connection to 0.0.0.0:0: connect: Connection refused (error 111)
[ OK ] Parameters/TestRpc.TestCallToBadServer/SSL_UnixSocket (20 ms)
[ RUN ] Parameters/TestRpc.TestWrongService/SSL_UnixSocket
I20260924 16:00:29.374583 5047 acceptor_pool.cc:254] collecting diagnostics on the listening RPC socket unix:/tmp/dist-test-tasknekIfH/test-tmp/rpc-test-dff05b479fb748e78e82b396266ed1f6.sock every 8 connection(s)
I20260924 16:00:29.374853 5048 acceptor_pool.cc:254] collecting diagnostics on the listening RPC socket unix:/tmp/dist-test-tasknekIfH/test-tmp/rpc-test-dff05b479fb748e78e82b396266ed1f6.sock every 8 connection(s)
I20260924 16:00:29.393064 5044 messenger.cc:345] service WrongServiceName not registered on TestServer
[ OK ] Parameters/TestRpc.TestWrongService/SSL_UnixSocket (44 ms)
[ RUN ] Parameters/TestRpc.TestConnectionKeepalive/SSL_UnixSocket
I20260924 16:00:29.409581 5070 acceptor_pool.cc:254] collecting diagnostics on the listening RPC socket unix:/tmp/dist-test-tasknekIfH/test-tmp/rpc-test-c4a40fa72c0c441b872b893389a1d7a1.sock every 8 connection(s)
I20260924 16:00:29.409822 5071 acceptor_pool.cc:254] collecting diagnostics on the listening RPC socket unix:/tmp/dist-test-tasknekIfH/test-tmp/rpc-test-c4a40fa72c0c441b872b893389a1d7a1.sock every 8 connection(s)
I20260924 16:00:29.410676 4950 rpc-test.cc:488] Connecting to unix:/tmp/dist-test-tasknekIfH/test-tmp/rpc-test-c4a40fa72c0c441b872b893389a1d7a1.sock
W20260924 16:00:29.900384 5083 connection.cc:196] Error closing socket: Network error: TlsSocket::Close: Broken pipe
[ OK ] Parameters/TestRpc.TestConnectionKeepalive/SSL_UnixSocket (1037 ms)
[ RUN ] Parameters/TestRpc.TestClientConnectionMetrics/SSL_UnixSocket
I20260924 16:00:30.479251 5095 acceptor_pool.cc:254] collecting diagnostics on the listening RPC socket unix:/tmp/dist-test-tasknekIfH/test-tmp/rpc-test-2c3c3f71f9cc41769081348a10f2a912.sock every 8 connection(s)
I20260924 16:00:30.479496 5096 acceptor_pool.cc:254] collecting diagnostics on the listening RPC socket unix:/tmp/dist-test-tasknekIfH/test-tmp/rpc-test-2c3c3f71f9cc41769081348a10f2a912.sock every 8 connection(s)
I20260924 16:00:30.480476 4950 rpc-test.cc:569] Connecting to unix:/tmp/dist-test-tasknekIfH/test-tmp/rpc-test-2c3c3f71f9cc41769081348a10f2a912.sock
W20260924 16:00:51.001597 5092 connection.cc:196] Error closing socket: Network error: TlsSocket::Close: Broken pipe
[ OK ] Parameters/TestRpc.TestClientConnectionMetrics/SSL_UnixSocket (20573 ms)
[ RUN ] Parameters/TestRpc.TestCredentialsPolicy/SSL_UnixSocket
I20260924 16:00:51.035503 5118 acceptor_pool.cc:254] collecting diagnostics on the listening RPC socket unix:/tmp/dist-test-tasknekIfH/test-tmp/rpc-test-4735c3b6f45a4baf9cab40a57c94067d.sock every 8 connection(s)
I20260924 16:00:51.035766 5119 acceptor_pool.cc:254] collecting diagnostics on the listening RPC socket unix:/tmp/dist-test-tasknekIfH/test-tmp/rpc-test-4735c3b6f45a4baf9cab40a57c94067d.sock every 8 connection(s)
I20260924 16:00:51.036801 4950 rpc-test.cc:700] Connecting to unix:/tmp/dist-test-tasknekIfH/test-tmp/rpc-test-4735c3b6f45a4baf9cab40a57c94067d.sock
W20260924 16:00:51.076716 5117 connection.cc:196] Error closing socket: Network error: TlsSocket::Close: Broken pipe
[ OK ] Parameters/TestRpc.TestCredentialsPolicy/SSL_UnixSocket (78 ms)
[ RUN ] Parameters/TestRpc.TestCallLongerThanKeepalive/SSL_UnixSocket
I20260924 16:00:51.113210 5143 acceptor_pool.cc:254] collecting diagnostics on the listening RPC socket unix:/tmp/dist-test-tasknekIfH/test-tmp/rpc-test-26582613eb8e4cd99a47b7cd30562586.sock every 8 connection(s)
I20260924 16:00:51.113442 5144 acceptor_pool.cc:254] collecting diagnostics on the listening RPC socket unix:/tmp/dist-test-tasknekIfH/test-tmp/rpc-test-26582613eb8e4cd99a47b7cd30562586.sock every 8 connection(s)
I20260924 16:00:51.129959 5147 rpc-test-base.h:222] got call: sleep_micros: 3000000 deferred: true
I20260924 16:00:54.131739 5147 rpcz_store.cc:275] Call kudu.rpc.GenericCalculatorService.Sleep from unix:<unnamed> (request call id 0) took 3001 ms. Trace:
I20260924 16:00:54.131910 5147 rpcz_store.cc:276] 0924 16:00:51.129805 (+ 0us) service_pool.cc:170] Inserting onto call queue
0924 16:00:51.129912 (+ 107us) service_pool.cc:227] Handling call
0924 16:00:54.131691 (+3001779us) inbound_call.cc:173] Queueing success response
Metrics: {}
[ OK ] Parameters/TestRpc.TestCallLongerThanKeepalive/SSL_UnixSocket (3050 ms)
[ RUN ] Parameters/TestRpc.TestRpcSidecar/SSL_UnixSocket
I20260924 16:00:54.154377 5168 acceptor_pool.cc:254] collecting diagnostics on the listening RPC socket unix:/tmp/dist-test-tasknekIfH/test-tmp/rpc-test-54b73333ad8c4ca8b47a96a77bd53b95.sock every 8 connection(s)
I20260924 16:00:54.154636 5169 acceptor_pool.cc:254] collecting diagnostics on the listening RPC socket unix:/tmp/dist-test-tasknekIfH/test-tmp/rpc-test-54b73333ad8c4ca8b47a96a77bd53b95.sock every 8 connection(s)
W20260924 16:00:54.243319 5165 connection.cc:196] Error closing socket: Network error: TlsSocket::Close: Broken pipe
[ OK ] Parameters/TestRpc.TestRpcSidecar/SSL_UnixSocket (108 ms)
[ RUN ] Parameters/TestRpc.TestRpcSidecarLimits/SSL_UnixSocket
I20260924 16:00:57.039176 5193 acceptor_pool.cc:254] collecting diagnostics on the listening RPC socket unix:/tmp/dist-test-tasknekIfH/test-tmp/rpc-test-52b4e3214bfd4b058b4efcb52b95e78e.sock every 8 connection(s)
I20260924 16:00:57.039433 5194 acceptor_pool.cc:254] collecting diagnostics on the listening RPC socket unix:/tmp/dist-test-tasknekIfH/test-tmp/rpc-test-52b4e3214bfd4b058b4efcb52b95e78e.sock every 8 connection(s)
W20260924 16:00:57.075683 4950 serialization.cc:72] Serialized kudu.rpc_test.PushStringsRequestPB (2147483654 bytes) is larger than the maximum configured RPC message size (52428800 bytes). Sending anyway, but peer may reject the data.
W20260924 16:00:57.082226 5190 connection.cc:535] server connection from unix:<unnamed> recv error: Network error: RPC frame had a length of 2147483714, but we only support messages up to 52428800 bytes long.
W20260924 16:00:57.082487 5190 connection.cc:158] shutting down server connection from unix:<unnamed> with pending inbound data: 4/2147483714 bytes received; last active 0 ns ago: status Network error: RPC frame had a length of 2147483714, but we only support messages up to 52428800 bytes long.
W20260924 16:00:57.083039 5206 connection.cc:196] Error closing socket: Network error: TlsSocket::Close: Broken pipe
I20260924 16:00:57.118381 5218 acceptor_pool.cc:254] collecting diagnostics on the listening RPC socket unix:/tmp/dist-test-tasknekIfH/test-tmp/rpc-test-52b4e3214bfd4b058b4efcb52b95e78e.sock every 8 connection(s)
I20260924 16:00:57.118789 5219 acceptor_pool.cc:254] collecting diagnostics on the listening RPC socket unix:/tmp/dist-test-tasknekIfH/test-tmp/rpc-test-52b4e3214bfd4b058b4efcb52b95e78e.sock every 8 connection(s)
W20260924 16:01:06.912851 5215 connection.cc:577] server connection from unix:<unnamed>: received bad data: 'Corruption: Invalid packet: message had a length of 2147483710, but we only support messages up to 2147483647 bytes
'
W20260924 16:01:06.913563 5231 connection.cc:196] Error closing socket: Network error: TlsSocket::Close: Broken pipe
[ OK ] Parameters/TestRpc.TestRpcSidecarLimits/SSL_UnixSocket (13162 ms)
[ RUN ] Parameters/TestRpc.TestCallTimeoutDoesntAffectNegotiation/SSL_UnixSocket
I20260924 16:01:07.418785 5243 acceptor_pool.cc:254] collecting diagnostics on the listening RPC socket unix:/tmp/dist-test-tasknekIfH/test-tmp/rpc-test-00191cb668ea4a78a7593c8e36775ad6.sock every 8 connection(s)
I20260924 16:01:07.419034 5244 acceptor_pool.cc:254] collecting diagnostics on the listening RPC socket unix:/tmp/dist-test-tasknekIfH/test-tmp/rpc-test-00191cb668ea4a78a7593c8e36775ad6.sock every 8 connection(s)
W20260924 16:01:07.441872 5239 negotiation.cc:266] Injecting 500ms delay in negotiation
I20260924 16:01:07.492362 4950 rpc-test-base.h:595] status: Timed out: connection negotiation to unix:/tmp/dist-test-tasknekIfH/test-tmp/rpc-test-00191cb668ea4a78a7593c8e36775ad6.sock for RPC Sleep timed out after 0.050s (ON_OUTBOUND_QUEUE), seconds elapsed: 0.0510958
W20260924 16:01:07.949384 5240 connection.cc:196] Error closing socket: Network error: TlsSocket::Close: Broken pipe
[ OK ] Parameters/TestRpc.TestCallTimeoutDoesntAffectNegotiation/SSL_UnixSocket (543 ms)
[ RUN ] Parameters/TestRpc.TestRpcHandlerLatencyMetric/SSL_UnixSocket
I20260924 16:01:07.967653 5268 acceptor_pool.cc:254] collecting diagnostics on the listening RPC socket unix:/tmp/dist-test-tasknekIfH/test-tmp/rpc-test-7a37885fc12046299a85287073ea2e04.sock every 8 connection(s)
I20260924 16:01:07.967908 5269 acceptor_pool.cc:254] collecting diagnostics on the listening RPC socket unix:/tmp/dist-test-tasknekIfH/test-tmp/rpc-test-7a37885fc12046299a85287073ea2e04.sock every 8 connection(s)
I20260924 16:01:08.006951 4950 rpc-test.cc:1236] Sleep() min lat: 20676
I20260924 16:01:08.007071 4950 rpc-test.cc:1237] Sleep() mean lat: 20676
I20260924 16:01:08.007117 4950 rpc-test.cc:1238] Sleep() max lat: 20676
I20260924 16:01:08.007171 4950 rpc-test.cc:1239] Sleep() #calls: 1
W20260924 16:01:08.008973 5265 connection.cc:196] Error closing socket: Network error: TlsSocket::Close: Broken pipe
[ OK ] Parameters/TestRpc.TestRpcHandlerLatencyMetric/SSL_UnixSocket (61 ms)
[ RUN ] Parameters/TestRpc.TimedOutOnResponseMetricServiceQueue/SSL_UnixSocket
I20260924 16:01:08.034299 5294 acceptor_pool.cc:254] collecting diagnostics on the listening RPC socket unix:/tmp/dist-test-tasknekIfH/test-tmp/rpc-test-5bb6cb27b24746b48c99ac0bbe295673.sock every 8 connection(s)
I20260924 16:01:08.034533 5295 acceptor_pool.cc:254] collecting diagnostics on the listening RPC socket unix:/tmp/dist-test-tasknekIfH/test-tmp/rpc-test-5bb6cb27b24746b48c99ac0bbe295673.sock every 8 connection(s)
W20260924 16:01:08.095340 5296 rpcz_store.cc:267] Call kudu.rpc_test.CalculatorService.Sleep from unix:<unnamed> (request call id 2) took 20 ms (client timeout 20 ms). Trace:
W20260924 16:01:08.095516 5296 rpcz_store.cc:269] 0924 16:01:08.074943 (+ 0us) service_pool.cc:170] Inserting onto call queue
0924 16:01:08.095246 (+ 20303us) service_pool.cc:214] Skipping call since client already timed out
0924 16:01:08.095316 (+ 70us) inbound_call.cc:173] Queueing failure response
Metrics: {}
W20260924 16:01:08.096861 5291 connection.cc:196] Error closing socket: Network error: TlsSocket::Close: Broken pipe
[ OK ] Parameters/TestRpc.TimedOutOnResponseMetricServiceQueue/SSL_UnixSocket (85 ms)
[ RUN ] Parameters/TestRpc.RpcPendingConnectionsMetric/SSL_UnixSocket
I20260924 16:01:08.104822 5317 acceptor_pool.cc:254] collecting diagnostics on the listening RPC socket 0.0.0.0:35701 every 8 connection(s)
I20260924 16:01:08.105064 5318 acceptor_pool.cc:254] collecting diagnostics on the listening RPC socket 0.0.0.0:35701 every 8 connection(s)
W20260924 16:01:08.107110 5313 negotiation.cc:337] Failed RPC negotiation. Trace:
0924 16:01:08.106506 (+ 0us) reactor.cc:625] Submitting negotiation task for server connection from 127.0.0.1:44122 (local address 127.0.0.1:35701)
0924 16:01:08.106648 (+ 142us) server_negotiation.cc:206] Beginning negotiation
0924 16:01:08.106652 (+ 4us) server_negotiation.cc:399] Waiting for connection header
0924 16:01:08.106777 (+ 125us) negotiation.cc:327] Negotiation complete: Network error: Server connection negotiation failed: server connection from 127.0.0.1:44122: BlockingRecv error: recv got EOF from 127.0.0.1:44122 (error 108)
Metrics: {"server-negotiator.queue_time_us":46}
[ OK ] Parameters/TestRpc.RpcPendingConnectionsMetric/SSL_UnixSocket (20 ms)
[ RUN ] Parameters/TestRpc.TestRpcContextClientDeadline/SSL_UnixSocket
I20260924 16:01:08.130987 5333 acceptor_pool.cc:254] collecting diagnostics on the listening RPC socket unix:/tmp/dist-test-tasknekIfH/test-tmp/rpc-test-e70b107e0c614c8fa5f711c5ab83aa82.sock every 8 connection(s)
I20260924 16:01:08.131210 5334 acceptor_pool.cc:254] collecting diagnostics on the listening RPC socket unix:/tmp/dist-test-tasknekIfH/test-tmp/rpc-test-e70b107e0c614c8fa5f711c5ab83aa82.sock every 8 connection(s)
[ OK ] Parameters/TestRpc.TestRpcContextClientDeadline/SSL_UnixSocket (53 ms)
[ RUN ] Parameters/TestRpc.TestApplicationFeatureFlagUnsupportedServer/SSL_UnixSocket
I20260924 16:01:08.202730 5358 acceptor_pool.cc:254] collecting diagnostics on the listening RPC socket unix:/tmp/dist-test-tasknekIfH/test-tmp/rpc-test-18427f74f7754dc5a37772b026c02048.sock every 8 connection(s)
I20260924 16:01:08.202991 5359 acceptor_pool.cc:254] collecting diagnostics on the listening RPC socket unix:/tmp/dist-test-tasknekIfH/test-tmp/rpc-test-18427f74f7754dc5a37772b026c02048.sock every 8 connection(s)
[ OK ] Parameters/TestRpc.TestApplicationFeatureFlagUnsupportedServer/SSL_UnixSocket (57 ms)
[ RUN ] Parameters/TestRpc.TestCancellationAsync/SSL_UnixSocket
I20260924 16:01:08.251791 5383 acceptor_pool.cc:254] collecting diagnostics on the listening RPC socket unix:/tmp/dist-test-tasknekIfH/test-tmp/rpc-test-55e490007bc04003a6351a78f9c3ae3f.sock every 8 connection(s)
I20260924 16:01:08.252020 5384 acceptor_pool.cc:254] collecting diagnostics on the listening RPC socket unix:/tmp/dist-test-tasknekIfH/test-tmp/rpc-test-55e490007bc04003a6351a78f9c3ae3f.sock every 8 connection(s)
I20260924 16:01:08.252971 4950 rpc-test.cc:1716] Connecting to unix:/tmp/dist-test-tasknekIfH/test-tmp/rpc-test-55e490007bc04003a6351a78f9c3ae3f.sock
I20260924 16:01:08.262496 4950 test_util.cc:268] Using random seed: -1254761906
I20260924 16:01:08.296654 5387 rpc-test-base.h:240] got call: sleep_micros: 500 pattern: 4294967295 num_repetitions: 2097152 sidecar_idx: 0
I20260924 16:01:08.324234 5386 rpc-test-base.h:240] got call: sleep_micros: 500 pattern: 4294967295 num_repetitions: 2097152 sidecar_idx: 0
I20260924 16:01:08.353291 5387 rpc-test-base.h:240] got call: sleep_micros: 500 pattern: 4294967295 num_repetitions: 2097152 sidecar_idx: 0
I20260924 16:01:08.381009 5386 rpc-test-base.h:240] got call: sleep_micros: 500 pattern: 4294967295 num_repetitions: 2097152 sidecar_idx: 0
I20260924 16:01:08.408506 5385 rpc-test-base.h:240] got call: sleep_micros: 500 pattern: 4294967295 num_repetitions: 2097152 sidecar_idx: 0
I20260924 16:01:08.437384 5386 rpc-test-base.h:240] got call: sleep_micros: 500 pattern: 4294967295 num_repetitions: 2097152 sidecar_idx: 0
I20260924 16:01:08.471007 5385 rpc-test-base.h:240] got call: sleep_micros: 500 pattern: 4294967295 num_repetitions: 2097152 sidecar_idx: 0
W20260924 16:01:08.473901 5380 connection.cc:196] Error closing socket: Network error: TlsSocket::Close: Broken pipe
W20260924 16:01:08.498522 5380 connection.cc:441] server connection from unix:<unnamed> torn down before Call kudu.rpc.GenericCalculatorService.SleepWithSidecar from unix:<unnamed> (request call id 8) could send its response
W20260924 16:01:08.516803 5380 connection.cc:441] server connection from unix:<unnamed> torn down before Call kudu.rpc.GenericCalculatorService.SleepWithSidecar from unix:<unnamed> (request call id 9) could send its response
[ OK ] Parameters/TestRpc.TestCancellationAsync/SSL_UnixSocket (289 ms)
[ RUN ] Parameters/TestRpc.TestPerformanceBySocketType/SSL_UnixSocket
I20260924 16:01:08.539855 5408 acceptor_pool.cc:254] collecting diagnostics on the listening RPC socket unix:/tmp/dist-test-tasknekIfH/test-tmp/rpc-test-a3153d785de54c19b4be9b9ba6cee64b.sock every 8 connection(s)
I20260924 16:01:08.540082 5409 acceptor_pool.cc:254] collecting diagnostics on the listening RPC socket unix:/tmp/dist-test-tasknekIfH/test-tmp/rpc-test-a3153d785de54c19b4be9b9ba6cee64b.sock every 8 connection(s)
I20260924 16:01:08.541030 4950 rpc-test.cc:1846] Connecting to unix:/tmp/dist-test-tasknekIfH/test-tmp/rpc-test-a3153d785de54c19b4be9b9ba6cee64b.sock
I20260924 16:01:11.727074 4950 rpc-test.cc:1859] Sending 1024MB via ssl-enabled unix socket: real 3.158s user 3.035s sys 2.287s
I20260924 16:01:14.824648 4950 rpc-test.cc:1859] Sending 1024MB via ssl-enabled unix socket: real 3.097s user 2.849s sys 2.352s
I20260924 16:01:17.990590 4950 rpc-test.cc:1859] Sending 1024MB via ssl-enabled unix socket: real 3.166s user 3.031s sys 2.281s
I20260924 16:01:21.147596 4950 rpc-test.cc:1859] Sending 1024MB via ssl-enabled unix socket: real 3.157s user 3.005s sys 2.309s
I20260924 16:01:24.248677 4950 rpc-test.cc:1859] Sending 1024MB via ssl-enabled unix socket: real 3.101s user 2.842s sys 2.363s
W20260924 16:01:24.249735 5405 connection.cc:196] Error closing socket: Network error: TlsSocket::Close: Broken pipe
[ OK ] Parameters/TestRpc.TestPerformanceBySocketType/SSL_UnixSocket (15736 ms)
[----------] 20 tests from Parameters/TestRpc (55066 ms total)
[----------] 1 test from Parameters/TestRpcSocketTxRxQueue
[ RUN ] Parameters/TestRpcSocketTxRxQueue.AcceptorRxQueueSizeMetric/0
I20260924 16:01:24.278285 5433 acceptor_pool.cc:254] collecting diagnostics on the listening RPC socket 0.0.0.0:38273 every 1 connection(s)
I20260924 16:01:24.278561 5434 acceptor_pool.cc:254] collecting diagnostics on the listening RPC socket 0.0.0.0:38273 every 1 connection(s)
W20260924 16:01:24.280198 5429 negotiation.cc:337] Failed RPC negotiation. Trace:
0924 16:01:24.279800 (+ 0us) reactor.cc:625] Submitting negotiation task for server connection from 127.0.0.1:46890 (local address 127.0.0.1:38273)
0924 16:01:24.279962 (+ 162us) server_negotiation.cc:206] Beginning negotiation
0924 16:01:24.279966 (+ 4us) server_negotiation.cc:399] Waiting for connection header
0924 16:01:24.280083 (+ 117us) negotiation.cc:327] Negotiation complete: Network error: Server connection negotiation failed: server connection from 127.0.0.1:46890: BlockingRecv error: recv got EOF from 127.0.0.1:46890 (error 108)
Metrics: {"server-negotiator.queue_time_us":61}
[ OK ] Parameters/TestRpcSocketTxRxQueue.AcceptorRxQueueSizeMetric/0 (27 ms)
[----------] 1 test from Parameters/TestRpcSocketTxRxQueue (27 ms total)
[----------] Global test environment tear-down
[==========] 21 tests from 2 test suites ran. (55094 ms total)
[ PASSED ] 20 tests.
[ FAILED ] 1 test, listed below:
[ FAILED ] Parameters/TestRpc.TestCallWithChainCertAndChainCA/SSL_UnixSocket, where GetParam() = (true, true)
1 FAILED TEST