Diagnosed failure

Parameters/TestRpc.TestCallWithChainCertAndChainCA/SSL_UnixSocket: /data0/somelongdirectorytoavoidrpathissues/src/kudu/src/kudu/rpc/rpc-test.cc:270: Failure
Failed
Bad status: Runtime error: could not verify certificate chain (error with cert: subject=CN = localhost, ST = sadfjas, C = AS, emailAddress = sdflkdsajf, O = lskdfjlsad, OU = sldfkja, issuer=C = AS, ST = ASDfkjdhf, L = lskdjf, O = saldfja, OU = skdjf, CN = localhost, emailAddress = sadjflkadsj): : certificate has expired
Google Test trace:
/data0/somelongdirectorytoavoidrpathissues/src/kudu/src/kudu/rpc/rpc-test.cc:267: Connecting to unix:/tmp/dist-test-taskfpHTpz/test-tmp/rpc-test-7ae448a6956941d9a8d3ac799756b5e7.sock
I20260925 22:40:36.165769  2778 test_util.cc:175] -----------------------------------------------
I20260925 22:40:36.165818  2778 test_util.cc:176] Had fatal failures, leaving test files at /tmp/dist-test-taskfpHTpz/test-tmp/rpc-test.6.Parameters_TestRpc.TestCallWithChainCertAndChainCA_SSL_UnixSocket.1790376036095667-2778-0

Full log

Note: This is test shard 7 of 8.
[==========] Running 21 tests from 2 test suites.
[----------] Global test environment set-up.
[----------] 20 tests from Parameters/TestRpc
[ RUN      ] Parameters/TestRpc.TestMessengerCreateDestroy/SSL_UnixSocket
WARNING: Logging before InitGoogleLogging() is written to STDERR
I20260925 22:40:36.122283  2778 rpc-test.cc:169] started messenger TestCreateDestroy
[       OK ] Parameters/TestRpc.TestMessengerCreateDestroy/SSL_UnixSocket (21 ms)
[ RUN      ] Parameters/TestRpc.TestNegotiationDeadlock/SSL_UnixSocket
I20260925 22:40:36.133980  2798 acceptor_pool.cc:254] collecting diagnostics on the listening RPC socket unix:/tmp/dist-test-taskfpHTpz/test-tmp/rpc-test-74f710e8a8a541f2a3a6ff2e59658dd8.sock every 8 connection(s)
I20260925 22:40:36.134021  2799 acceptor_pool.cc:254] collecting diagnostics on the listening RPC socket unix:/tmp/dist-test-taskfpHTpz/test-tmp/rpc-test-74f710e8a8a541f2a3a6ff2e59658dd8.sock every 8 connection(s)
[       OK ] Parameters/TestRpc.TestNegotiationDeadlock/SSL_UnixSocket (18 ms)
[ RUN      ] Parameters/TestRpc.TestCallWithChainCertAndChainCA/SSL_UnixSocket
I20260925 22:40:36.161509  2814 acceptor_pool.cc:254] collecting diagnostics on the listening RPC socket unix:/tmp/dist-test-taskfpHTpz/test-tmp/rpc-test-7ae448a6956941d9a8d3ac799756b5e7.sock every 8 connection(s)
I20260925 22:40:36.161559  2815 acceptor_pool.cc:254] collecting diagnostics on the listening RPC socket unix:/tmp/dist-test-taskfpHTpz/test-tmp/rpc-test-7ae448a6956941d9a8d3ac799756b5e7.sock every 8 connection(s)
/data0/somelongdirectorytoavoidrpathissues/src/kudu/src/kudu/rpc/rpc-test.cc:270: Failure
Failed
Bad status: Runtime error: could not verify certificate chain (error with cert: subject=CN = localhost, ST = sadfjas, C = AS, emailAddress = sdflkdsajf, O = lskdfjlsad, OU = sldfkja, issuer=C = AS, ST = ASDfkjdhf, L = lskdjf, O = saldfja, OU = skdjf, CN = localhost, emailAddress = sadjflkadsj): : certificate has expired
Google Test trace:
/data0/somelongdirectorytoavoidrpathissues/src/kudu/src/kudu/rpc/rpc-test.cc:267: Connecting to unix:/tmp/dist-test-taskfpHTpz/test-tmp/rpc-test-7ae448a6956941d9a8d3ac799756b5e7.sock
I20260925 22:40:36.165769  2778 test_util.cc:175] -----------------------------------------------
I20260925 22:40:36.165818  2778 test_util.cc:176] Had fatal failures, leaving test files at /tmp/dist-test-taskfpHTpz/test-tmp/rpc-test.6.Parameters_TestRpc.TestCallWithChainCertAndChainCA_SSL_UnixSocket.1790376036095667-2778-0
[  FAILED  ] Parameters/TestRpc.TestCallWithChainCertAndChainCA/SSL_UnixSocket, where GetParam() = (true, true) (23 ms)
[ RUN      ] Parameters/TestRpc.TestCallWithPasswordProtectedKey/SSL_UnixSocket
I20260925 22:40:36.173523  2839 acceptor_pool.cc:254] collecting diagnostics on the listening RPC socket unix:/tmp/dist-test-taskfpHTpz/test-tmp/rpc-test-21b1c28f19304ef3918815faaf0ad53c.sock every 8 connection(s)
I20260925 22:40:36.173543  2840 acceptor_pool.cc:254] collecting diagnostics on the listening RPC socket unix:/tmp/dist-test-taskfpHTpz/test-tmp/rpc-test-21b1c28f19304ef3918815faaf0ad53c.sock every 8 connection(s)
W20260925 22:40:36.185174  2836 connection.cc:196] Error closing socket: Network error: TlsSocket::Close: Broken pipe
[       OK ] Parameters/TestRpc.TestCallWithPasswordProtectedKey/SSL_UnixSocket (20 ms)
[ RUN      ] Parameters/TestRpc.TestCallToBadServer/SSL_UnixSocket
I20260925 22:40:36.192524  2778 rpc-test.cc:394] Status: Network error: Client connection negotiation failed: client connection to 0.0.0.0:0: connect: Connection refused (error 111)
I20260925 22:40:36.192860  2778 rpc-test.cc:394] Status: Network error: Client connection negotiation failed: client connection to 0.0.0.0:0: connect: Connection refused (error 111)
I20260925 22:40:36.193188  2778 rpc-test.cc:394] Status: Network error: Client connection negotiation failed: client connection to 0.0.0.0:0: connect: Connection refused (error 111)
I20260925 22:40:36.193534  2778 rpc-test.cc:394] Status: Network error: Client connection negotiation failed: client connection to 0.0.0.0:0: connect: Connection refused (error 111)
I20260925 22:40:36.193869  2778 rpc-test.cc:394] Status: Network error: Client connection negotiation failed: client connection to 0.0.0.0:0: connect: Connection refused (error 111)
[       OK ] Parameters/TestRpc.TestCallToBadServer/SSL_UnixSocket (7 ms)
[ RUN      ] Parameters/TestRpc.TestWrongService/SSL_UnixSocket
I20260925 22:40:36.210934  2874 acceptor_pool.cc:254] collecting diagnostics on the listening RPC socket unix:/tmp/dist-test-taskfpHTpz/test-tmp/rpc-test-9131e456743b46a787e267b0d4b0cc31.sock every 8 connection(s)
I20260925 22:40:36.210995  2875 acceptor_pool.cc:254] collecting diagnostics on the listening RPC socket unix:/tmp/dist-test-taskfpHTpz/test-tmp/rpc-test-9131e456743b46a787e267b0d4b0cc31.sock every 8 connection(s)
I20260925 22:40:36.230770  2871 messenger.cc:345] service WrongServiceName not registered on TestServer
[       OK ] Parameters/TestRpc.TestWrongService/SSL_UnixSocket (38 ms)
[ RUN      ] Parameters/TestRpc.TestConnectionKeepalive/SSL_UnixSocket
I20260925 22:40:36.237365  2897 acceptor_pool.cc:254] collecting diagnostics on the listening RPC socket unix:/tmp/dist-test-taskfpHTpz/test-tmp/rpc-test-8cb30616f91b49629d34a3d3860a53e9.sock every 8 connection(s)
I20260925 22:40:36.237428  2898 acceptor_pool.cc:254] collecting diagnostics on the listening RPC socket unix:/tmp/dist-test-taskfpHTpz/test-tmp/rpc-test-8cb30616f91b49629d34a3d3860a53e9.sock every 8 connection(s)
I20260925 22:40:36.237614  2778 rpc-test.cc:488] Connecting to unix:/tmp/dist-test-taskfpHTpz/test-tmp/rpc-test-8cb30616f91b49629d34a3d3860a53e9.sock
W20260925 22:40:36.734782  2910 connection.cc:196] Error closing socket: Network error: TlsSocket::Close: Broken pipe
[       OK ] Parameters/TestRpc.TestConnectionKeepalive/SSL_UnixSocket (1034 ms)
[ RUN      ] Parameters/TestRpc.TestClientConnectionMetrics/SSL_UnixSocket
I20260925 22:40:37.275498  2922 acceptor_pool.cc:254] collecting diagnostics on the listening RPC socket unix:/tmp/dist-test-taskfpHTpz/test-tmp/rpc-test-61e46a914cde44f2b604d77a28b2832c.sock every 8 connection(s)
I20260925 22:40:37.275555  2923 acceptor_pool.cc:254] collecting diagnostics on the listening RPC socket unix:/tmp/dist-test-taskfpHTpz/test-tmp/rpc-test-61e46a914cde44f2b604d77a28b2832c.sock every 8 connection(s)
I20260925 22:40:37.275786  2778 rpc-test.cc:569] Connecting to unix:/tmp/dist-test-taskfpHTpz/test-tmp/rpc-test-61e46a914cde44f2b604d77a28b2832c.sock
W20260925 22:40:46.607810  2919 connection.cc:196] Error closing socket: Network error: TlsSocket::Close: Broken pipe
[       OK ] Parameters/TestRpc.TestClientConnectionMetrics/SSL_UnixSocket (9341 ms)
[ RUN      ] Parameters/TestRpc.TestCredentialsPolicy/SSL_UnixSocket
I20260925 22:40:46.647236  2945 acceptor_pool.cc:254] collecting diagnostics on the listening RPC socket unix:/tmp/dist-test-taskfpHTpz/test-tmp/rpc-test-b61e84fd3a264a0294a148ad430ef302.sock every 8 connection(s)
I20260925 22:40:46.647284  2946 acceptor_pool.cc:254] collecting diagnostics on the listening RPC socket unix:/tmp/dist-test-taskfpHTpz/test-tmp/rpc-test-b61e84fd3a264a0294a148ad430ef302.sock every 8 connection(s)
I20260925 22:40:46.647534  2778 rpc-test.cc:700] Connecting to unix:/tmp/dist-test-taskfpHTpz/test-tmp/rpc-test-b61e84fd3a264a0294a148ad430ef302.sock
W20260925 22:40:46.678771  2944 connection.cc:196] Error closing socket: Network error: TlsSocket::Close: Broken pipe
[       OK ] Parameters/TestRpc.TestCredentialsPolicy/SSL_UnixSocket (74 ms)
[ RUN      ] Parameters/TestRpc.TestCallLongerThanKeepalive/SSL_UnixSocket
I20260925 22:40:46.699972  2970 acceptor_pool.cc:254] collecting diagnostics on the listening RPC socket unix:/tmp/dist-test-taskfpHTpz/test-tmp/rpc-test-726cf1b7be424b67b6855a9c4743f749.sock every 8 connection(s)
I20260925 22:40:46.700027  2971 acceptor_pool.cc:254] collecting diagnostics on the listening RPC socket unix:/tmp/dist-test-taskfpHTpz/test-tmp/rpc-test-726cf1b7be424b67b6855a9c4743f749.sock every 8 connection(s)
I20260925 22:40:46.716503  2974 rpc-test-base.h:222] got call: sleep_micros: 3000000 deferred: true
I20260925 22:40:49.717258  2974 rpcz_store.cc:275] Call kudu.rpc.GenericCalculatorService.Sleep from unix:<unnamed> (request call id 0) took 3000 ms. Trace:
I20260925 22:40:49.717366  2974 rpcz_store.cc:276] 0925 22:40:46.716437 (+     0us) service_pool.cc:170] Inserting onto call queue
0925 22:40:46.716479 (+    42us) service_pool.cc:227] Handling call
0925 22:40:49.717240 (+3000761us) inbound_call.cc:173] Queueing success response
Metrics: {}
W20260925 22:40:49.718659  2967 connection.cc:196] Error closing socket: Network error: TlsSocket::Close: Broken pipe
[       OK ] Parameters/TestRpc.TestCallLongerThanKeepalive/SSL_UnixSocket (3036 ms)
[ RUN      ] Parameters/TestRpc.TestRpcSidecar/SSL_UnixSocket
I20260925 22:40:49.737943  2995 acceptor_pool.cc:254] collecting diagnostics on the listening RPC socket unix:/tmp/dist-test-taskfpHTpz/test-tmp/rpc-test-534304af96f142ab9ccc3d4d68c6993d.sock every 8 connection(s)
I20260925 22:40:49.737996  2996 acceptor_pool.cc:254] collecting diagnostics on the listening RPC socket unix:/tmp/dist-test-taskfpHTpz/test-tmp/rpc-test-534304af96f142ab9ccc3d4d68c6993d.sock every 8 connection(s)
W20260925 22:40:49.784108  2992 connection.cc:196] Error closing socket: Network error: TlsSocket::Close: Broken pipe
[       OK ] Parameters/TestRpc.TestRpcSidecar/SSL_UnixSocket (65 ms)
[ RUN      ] Parameters/TestRpc.TestRpcSidecarLimits/SSL_UnixSocket
I20260925 22:40:51.423697  3020 acceptor_pool.cc:254] collecting diagnostics on the listening RPC socket unix:/tmp/dist-test-taskfpHTpz/test-tmp/rpc-test-be0fb469b13a476d88d5003bcbe659e1.sock every 8 connection(s)
I20260925 22:40:51.423732  3021 acceptor_pool.cc:254] collecting diagnostics on the listening RPC socket unix:/tmp/dist-test-taskfpHTpz/test-tmp/rpc-test-be0fb469b13a476d88d5003bcbe659e1.sock every 8 connection(s)
W20260925 22:40:51.441610  2778 serialization.cc:72] Serialized kudu.rpc_test.PushStringsRequestPB (2147483654 bytes) is larger than the maximum configured RPC message size (52428800 bytes). Sending anyway, but peer may reject the data.
W20260925 22:40:51.444734  3017 connection.cc:535] server connection from unix:<unnamed> recv error: Network error: RPC frame had a length of 2147483714, but we only support messages up to 52428800 bytes long.
W20260925 22:40:51.444782  3017 connection.cc:158] shutting down server connection from unix:<unnamed> with pending inbound data: 4/2147483714 bytes received; last active 0 ns ago: status Network error: RPC frame had a length of 2147483714, but we only support messages up to 52428800 bytes long.
W20260925 22:40:51.445000  3033 connection.cc:196] Error closing socket: Network error: TlsSocket::Close: Broken pipe
I20260925 22:40:51.452518  3045 acceptor_pool.cc:254] collecting diagnostics on the listening RPC socket unix:/tmp/dist-test-taskfpHTpz/test-tmp/rpc-test-be0fb469b13a476d88d5003bcbe659e1.sock every 8 connection(s)
I20260925 22:40:51.452550  3046 acceptor_pool.cc:254] collecting diagnostics on the listening RPC socket unix:/tmp/dist-test-taskfpHTpz/test-tmp/rpc-test-be0fb469b13a476d88d5003bcbe659e1.sock every 8 connection(s)
W20260925 22:40:55.874120  3042 connection.cc:577] server connection from unix:<unnamed>: received bad data: 'Corruption: Invalid packet: message had a length of 2147483710, but we only support messages up to 2147483647 bytes
'
W20260925 22:40:55.874462  3058 connection.cc:196] Error closing socket: Network error: TlsSocket::Close: Broken pipe
[       OK ] Parameters/TestRpc.TestRpcSidecarLimits/SSL_UnixSocket (6091 ms)
[ RUN      ] Parameters/TestRpc.TestCallTimeoutDoesntAffectNegotiation/SSL_UnixSocket
I20260925 22:40:55.898852  3070 acceptor_pool.cc:254] collecting diagnostics on the listening RPC socket unix:/tmp/dist-test-taskfpHTpz/test-tmp/rpc-test-17c592fe3c7943c6a3aa4ca761860149.sock every 8 connection(s)
I20260925 22:40:55.898909  3071 acceptor_pool.cc:254] collecting diagnostics on the listening RPC socket unix:/tmp/dist-test-taskfpHTpz/test-tmp/rpc-test-17c592fe3c7943c6a3aa4ca761860149.sock every 8 connection(s)
W20260925 22:40:55.923655  3066 negotiation.cc:266] Injecting 500ms delay in negotiation
I20260925 22:40:55.973945  2778 rpc-test-base.h:595] status: Timed out: connection negotiation to unix:/tmp/dist-test-taskfpHTpz/test-tmp/rpc-test-17c592fe3c7943c6a3aa4ca761860149.sock for RPC Sleep timed out after 0.050s (ON_OUTBOUND_QUEUE), seconds elapsed: 0.0506767
W20260925 22:40:56.428222  3067 connection.cc:196] Error closing socket: Network error: TlsSocket::Close: Broken pipe
[       OK ] Parameters/TestRpc.TestCallTimeoutDoesntAffectNegotiation/SSL_UnixSocket (552 ms)
[ RUN      ] Parameters/TestRpc.TestRpcHandlerLatencyMetric/SSL_UnixSocket
I20260925 22:40:56.454885  3095 acceptor_pool.cc:254] collecting diagnostics on the listening RPC socket unix:/tmp/dist-test-taskfpHTpz/test-tmp/rpc-test-cdf87d95432340b38ce4b4d7074e0b6c.sock every 8 connection(s)
I20260925 22:40:56.454931  3096 acceptor_pool.cc:254] collecting diagnostics on the listening RPC socket unix:/tmp/dist-test-taskfpHTpz/test-tmp/rpc-test-cdf87d95432340b38ce4b4d7074e0b6c.sock every 8 connection(s)
I20260925 22:40:56.493923  2778 rpc-test.cc:1236] Sleep() min lat: 20318
I20260925 22:40:56.493984  2778 rpc-test.cc:1237] Sleep() mean lat: 20318
I20260925 22:40:56.494011  2778 rpc-test.cc:1238] Sleep() max lat: 20318
I20260925 22:40:56.494022  2778 rpc-test.cc:1239] Sleep() #calls: 1
W20260925 22:40:56.494637  3092 connection.cc:196] Error closing socket: Network error: TlsSocket::Close: Broken pipe
[       OK ] Parameters/TestRpc.TestRpcHandlerLatencyMetric/SSL_UnixSocket (66 ms)
[ RUN      ] Parameters/TestRpc.TimedOutOnResponseMetricServiceQueue/SSL_UnixSocket
I20260925 22:40:56.504374  3121 acceptor_pool.cc:254] collecting diagnostics on the listening RPC socket unix:/tmp/dist-test-taskfpHTpz/test-tmp/rpc-test-9d2206df53f241188a7ab10de82746dc.sock every 8 connection(s)
I20260925 22:40:56.504428  3122 acceptor_pool.cc:254] collecting diagnostics on the listening RPC socket unix:/tmp/dist-test-taskfpHTpz/test-tmp/rpc-test-9d2206df53f241188a7ab10de82746dc.sock every 8 connection(s)
W20260925 22:40:56.559144  3123 rpcz_store.cc:267] Call kudu.rpc_test.CalculatorService.Sleep from unix:<unnamed> (request call id 2) took 20 ms (client timeout 20 ms). Trace:
W20260925 22:40:56.559226  3123 rpcz_store.cc:269] 0925 22:40:56.538853 (+     0us) service_pool.cc:170] Inserting onto call queue
0925 22:40:56.559088 (+ 20235us) service_pool.cc:214] Skipping call since client already timed out
0925 22:40:56.559113 (+    25us) inbound_call.cc:173] Queueing failure response
Metrics: {}
[       OK ] Parameters/TestRpc.TimedOutOnResponseMetricServiceQueue/SSL_UnixSocket (64 ms)
[ RUN      ] Parameters/TestRpc.RpcPendingConnectionsMetric/SSL_UnixSocket
I20260925 22:40:56.562680  3144 acceptor_pool.cc:254] collecting diagnostics on the listening RPC socket 0.0.0.0:40935 every 8 connection(s)
I20260925 22:40:56.562741  3145 acceptor_pool.cc:254] collecting diagnostics on the listening RPC socket 0.0.0.0:40935 every 8 connection(s)
W20260925 22:40:56.563681  3140 negotiation.cc:337] Failed RPC negotiation. Trace:
0925 22:40:56.563334 (+     0us) reactor.cc:625] Submitting negotiation task for server connection from 127.0.0.1:37972 (local address 127.0.0.1:40935)
0925 22:40:56.563420 (+    86us) server_negotiation.cc:206] Beginning negotiation
0925 22:40:56.563422 (+     2us) server_negotiation.cc:399] Waiting for connection header
0925 22:40:56.563508 (+    86us) negotiation.cc:327] Negotiation complete: Network error: Server connection negotiation failed: server connection from 127.0.0.1:37972: BlockingRecv error: recv got EOF from 127.0.0.1:37972 (error 108)
Metrics: {"server-negotiator.queue_time_us":28}
[       OK ] Parameters/TestRpc.RpcPendingConnectionsMetric/SSL_UnixSocket (13 ms)
[ RUN      ] Parameters/TestRpc.TestRpcContextClientDeadline/SSL_UnixSocket
I20260925 22:40:56.587793  3160 acceptor_pool.cc:254] collecting diagnostics on the listening RPC socket unix:/tmp/dist-test-taskfpHTpz/test-tmp/rpc-test-35312369e1e04327b95d3fd3c2768ce7.sock every 8 connection(s)
I20260925 22:40:56.587841  3161 acceptor_pool.cc:254] collecting diagnostics on the listening RPC socket unix:/tmp/dist-test-taskfpHTpz/test-tmp/rpc-test-35312369e1e04327b95d3fd3c2768ce7.sock every 8 connection(s)
W20260925 22:40:56.628535  3157 connection.cc:196] Error closing socket: Network error: TlsSocket::Close: Broken pipe
[       OK ] Parameters/TestRpc.TestRpcContextClientDeadline/SSL_UnixSocket (55 ms)
[ RUN      ] Parameters/TestRpc.TestApplicationFeatureFlagUnsupportedServer/SSL_UnixSocket
I20260925 22:40:56.649098  3185 acceptor_pool.cc:254] collecting diagnostics on the listening RPC socket unix:/tmp/dist-test-taskfpHTpz/test-tmp/rpc-test-67c121e3ed9e41ce8cba931c03b7539a.sock every 8 connection(s)
I20260925 22:40:56.649154  3186 acceptor_pool.cc:254] collecting diagnostics on the listening RPC socket unix:/tmp/dist-test-taskfpHTpz/test-tmp/rpc-test-67c121e3ed9e41ce8cba931c03b7539a.sock every 8 connection(s)
W20260925 22:40:56.661017  3182 connection.cc:196] Error closing socket: Network error: TlsSocket::Close: Broken pipe
[       OK ] Parameters/TestRpc.TestApplicationFeatureFlagUnsupportedServer/SSL_UnixSocket (32 ms)
[ RUN      ] Parameters/TestRpc.TestCancellationAsync/SSL_UnixSocket
I20260925 22:40:56.675813  3210 acceptor_pool.cc:254] collecting diagnostics on the listening RPC socket unix:/tmp/dist-test-taskfpHTpz/test-tmp/rpc-test-03098a4e12a045a0a6f42014107d9e65.sock every 8 connection(s)
I20260925 22:40:56.675871  3211 acceptor_pool.cc:254] collecting diagnostics on the listening RPC socket unix:/tmp/dist-test-taskfpHTpz/test-tmp/rpc-test-03098a4e12a045a0a6f42014107d9e65.sock every 8 connection(s)
I20260925 22:40:56.676074  2778 rpc-test.cc:1716] Connecting to unix:/tmp/dist-test-taskfpHTpz/test-tmp/rpc-test-03098a4e12a045a0a6f42014107d9e65.sock
I20260925 22:40:56.686142  2778 test_util.cc:268] Using random seed: 1759479357
I20260925 22:40:56.703699  3214 rpc-test-base.h:240] got call: sleep_micros: 500 pattern: 4294967295 num_repetitions: 2097152 sidecar_idx: 0
I20260925 22:40:56.717679  3213 rpc-test-base.h:240] got call: sleep_micros: 500 pattern: 4294967295 num_repetitions: 2097152 sidecar_idx: 0
I20260925 22:40:56.732745  3214 rpc-test-base.h:240] got call: sleep_micros: 500 pattern: 4294967295 num_repetitions: 2097152 sidecar_idx: 0
I20260925 22:40:56.747035  3213 rpc-test-base.h:240] got call: sleep_micros: 500 pattern: 4294967295 num_repetitions: 2097152 sidecar_idx: 0
I20260925 22:40:56.760882  3214 rpc-test-base.h:240] got call: sleep_micros: 500 pattern: 4294967295 num_repetitions: 2097152 sidecar_idx: 0
I20260925 22:40:56.782570  3213 rpc-test-base.h:240] got call: sleep_micros: 500 pattern: 4294967295 num_repetitions: 2097152 sidecar_idx: 0
I20260925 22:40:56.802453  3214 rpc-test-base.h:240] got call: sleep_micros: 500 pattern: 4294967295 num_repetitions: 2097152 sidecar_idx: 0
I20260925 22:40:56.812160  3212 rpc-test-base.h:240] got call: sleep_micros: 500 pattern: 4294967295 num_repetitions: 2097152 sidecar_idx: 0
W20260925 22:40:56.813094  3207 connection.cc:196] Error closing socket: Network error: TlsSocket::Close: Broken pipe
W20260925 22:40:56.832365  3207 connection.cc:441] server connection from unix:<unnamed> torn down before Call kudu.rpc.GenericCalculatorService.SleepWithSidecar from unix:<unnamed> (request call id 9) could send its response
W20260925 22:40:56.832489  3207 connection.cc:441] server connection from unix:<unnamed> torn down before Call kudu.rpc.GenericCalculatorService.SleepWithSidecar from unix:<unnamed> (request call id 8) could send its response
[       OK ] Parameters/TestRpc.TestCancellationAsync/SSL_UnixSocket (171 ms)
[ RUN      ] Parameters/TestRpc.TestPerformanceBySocketType/SSL_UnixSocket
I20260925 22:40:56.849817  3235 acceptor_pool.cc:254] collecting diagnostics on the listening RPC socket unix:/tmp/dist-test-taskfpHTpz/test-tmp/rpc-test-00e9ef90baa14fba8cc829d0e36e313d.sock every 8 connection(s)
I20260925 22:40:56.849869  3236 acceptor_pool.cc:254] collecting diagnostics on the listening RPC socket unix:/tmp/dist-test-taskfpHTpz/test-tmp/rpc-test-00e9ef90baa14fba8cc829d0e36e313d.sock every 8 connection(s)
I20260925 22:40:56.850099  2778 rpc-test.cc:1846] Connecting to unix:/tmp/dist-test-taskfpHTpz/test-tmp/rpc-test-00e9ef90baa14fba8cc829d0e36e313d.sock
I20260925 22:40:58.170964  2778 rpc-test.cc:1859] Sending 1024MB via ssl-enabled unix socket: real 1.310s	user 1.716s	sys 0.709s
I20260925 22:40:59.486104  2778 rpc-test.cc:1859] Sending 1024MB via ssl-enabled unix socket: real 1.315s	user 1.680s	sys 0.743s
I20260925 22:41:00.844352  2778 rpc-test.cc:1859] Sending 1024MB via ssl-enabled unix socket: real 1.358s	user 1.801s	sys 0.692s
I20260925 22:41:02.188555  2778 rpc-test.cc:1859] Sending 1024MB via ssl-enabled unix socket: real 1.344s	user 1.735s	sys 0.749s
I20260925 22:41:03.493459  2778 rpc-test.cc:1859] Sending 1024MB via ssl-enabled unix socket: real 1.305s	user 1.732s	sys 0.683s
[       OK ] Parameters/TestRpc.TestPerformanceBySocketType/SSL_UnixSocket (6661 ms)
[----------] 20 tests from Parameters/TestRpc (27393 ms total)

[----------] 1 test from Parameters/TestRpcSocketTxRxQueue
[ RUN      ] Parameters/TestRpcSocketTxRxQueue.AcceptorRxQueueSizeMetric/0
I20260925 22:41:03.501996  3260 acceptor_pool.cc:254] collecting diagnostics on the listening RPC socket 0.0.0.0:46235 every 1 connection(s)
I20260925 22:41:03.502233  3261 acceptor_pool.cc:254] collecting diagnostics on the listening RPC socket 0.0.0.0:46235 every 1 connection(s)
W20260925 22:41:03.502895  3256 negotiation.cc:337] Failed RPC negotiation. Trace:
0925 22:41:03.502635 (+     0us) reactor.cc:625] Submitting negotiation task for server connection from 127.0.0.1:58456 (local address 127.0.0.1:46235)
0925 22:41:03.502744 (+   109us) server_negotiation.cc:206] Beginning negotiation
0925 22:41:03.502747 (+     3us) server_negotiation.cc:399] Waiting for connection header
0925 22:41:03.502828 (+    81us) negotiation.cc:327] Negotiation complete: Network error: Server connection negotiation failed: server connection from 127.0.0.1:58456: BlockingRecv error: recv got EOF from 127.0.0.1:58456 (error 108)
Metrics: {"server-negotiator.queue_time_us":43}
[       OK ] Parameters/TestRpcSocketTxRxQueue.AcceptorRxQueueSizeMetric/0 (9 ms)
[----------] 1 test from Parameters/TestRpcSocketTxRxQueue (9 ms total)

[----------] Global test environment tear-down
[==========] 21 tests from 2 test suites ran. (27402 ms total)
[  PASSED  ] 20 tests.
[  FAILED  ] 1 test, listed below:
[  FAILED  ] Parameters/TestRpc.TestCallWithChainCertAndChainCA/SSL_UnixSocket, where GetParam() = (true, true)

 1 FAILED TEST