Diagnosed failure

Parameters/TestRpc.TestCallWithChainCertAndChainCA/SSL_TCP: /data0/somelongdirectorytoavoidrpathissues/src/kudu/src/kudu/rpc/rpc-test.cc:270: Failure
Failed
Bad status: Runtime error: could not verify certificate chain (error with cert: subject=CN = localhost, ST = sadfjas, C = AS, emailAddress = sdflkdsajf, O = lskdfjlsad, OU = sldfkja, issuer=C = AS, ST = ASDfkjdhf, L = lskdjf, O = saldfja, OU = skdjf, CN = localhost, emailAddress = sadjflkadsj): : certificate has expired
Google Test trace:
/data0/somelongdirectorytoavoidrpathissues/src/kudu/src/kudu/rpc/rpc-test.cc:267: Connecting to 0.0.0.0:36731
I20260923 22:07:02.644039   383 test_util.cc:175] -----------------------------------------------
I20260923 22:07:02.644089   383 test_util.cc:176] Had fatal failures, leaving test files at /tmp/dist-test-tasktG9KFE/test-tmp/rpc-test.5.Parameters_TestRpc.TestCallWithChainCertAndChainCA_SSL_TCP.1790201222545132-383-0

Full log

Note: This is test shard 6 of 8.
[==========] Running 21 tests from 2 test suites.
[----------] Global test environment set-up.
[----------] 20 tests from Parameters/TestRpc
[ RUN      ] Parameters/TestRpc.TestMessengerCreateDestroy/SSL_TCP
WARNING: Logging before InitGoogleLogging() is written to STDERR
I20260923 22:07:02.592828   383 rpc-test.cc:169] started messenger TestCreateDestroy
[       OK ] Parameters/TestRpc.TestMessengerCreateDestroy/SSL_TCP (43 ms)
[ RUN      ] Parameters/TestRpc.TestNegotiationDeadlock/SSL_TCP
I20260923 22:07:02.610853   403 acceptor_pool.cc:254] collecting diagnostics on the listening RPC socket 0.0.0.0:40551 every 8 connection(s)
I20260923 22:07:02.610899   404 acceptor_pool.cc:254] collecting diagnostics on the listening RPC socket 0.0.0.0:40551 every 8 connection(s)
[       OK ] Parameters/TestRpc.TestNegotiationDeadlock/SSL_TCP (26 ms)
[ RUN      ] Parameters/TestRpc.TestCallWithChainCertAndChainCA/SSL_TCP
I20260923 22:07:02.639411   419 acceptor_pool.cc:254] collecting diagnostics on the listening RPC socket 0.0.0.0:36731 every 8 connection(s)
I20260923 22:07:02.639463   420 acceptor_pool.cc:254] collecting diagnostics on the listening RPC socket 0.0.0.0:36731 every 8 connection(s)
/data0/somelongdirectorytoavoidrpathissues/src/kudu/src/kudu/rpc/rpc-test.cc:270: Failure
Failed
Bad status: Runtime error: could not verify certificate chain (error with cert: subject=CN = localhost, ST = sadfjas, C = AS, emailAddress = sdflkdsajf, O = lskdfjlsad, OU = sldfkja, issuer=C = AS, ST = ASDfkjdhf, L = lskdjf, O = saldfja, OU = skdjf, CN = localhost, emailAddress = sadjflkadsj): : certificate has expired
Google Test trace:
/data0/somelongdirectorytoavoidrpathissues/src/kudu/src/kudu/rpc/rpc-test.cc:267: Connecting to 0.0.0.0:36731
I20260923 22:07:02.644039   383 test_util.cc:175] -----------------------------------------------
I20260923 22:07:02.644089   383 test_util.cc:176] Had fatal failures, leaving test files at /tmp/dist-test-tasktG9KFE/test-tmp/rpc-test.5.Parameters_TestRpc.TestCallWithChainCertAndChainCA_SSL_TCP.1790201222545132-383-0
[  FAILED  ] Parameters/TestRpc.TestCallWithChainCertAndChainCA/SSL_TCP, where GetParam() = (true, false) (22 ms)
[ RUN      ] Parameters/TestRpc.TestCallWithPasswordProtectedKey/SSL_TCP
I20260923 22:07:02.657792   444 acceptor_pool.cc:254] collecting diagnostics on the listening RPC socket 0.0.0.0:33389 every 8 connection(s)
I20260923 22:07:02.657840   445 acceptor_pool.cc:254] collecting diagnostics on the listening RPC socket 0.0.0.0:33389 every 8 connection(s)
[       OK ] Parameters/TestRpc.TestCallWithPasswordProtectedKey/SSL_TCP (27 ms)
[ RUN      ] Parameters/TestRpc.TestCallToBadServer/SSL_TCP
I20260923 22:07:02.678764   383 rpc-test.cc:394] Status: Network error: Client connection negotiation failed: client connection to 0.0.0.0:0: connect: Connection refused (error 111)
I20260923 22:07:02.679126   383 rpc-test.cc:394] Status: Network error: Client connection negotiation failed: client connection to 0.0.0.0:0: connect: Connection refused (error 111)
I20260923 22:07:02.679538   383 rpc-test.cc:394] Status: Network error: Client connection negotiation failed: client connection to 0.0.0.0:0: connect: Connection refused (error 111)
I20260923 22:07:02.679895   383 rpc-test.cc:394] Status: Network error: Client connection negotiation failed: client connection to 0.0.0.0:0: connect: Connection refused (error 111)
I20260923 22:07:02.680310   383 rpc-test.cc:394] Status: Network error: Client connection negotiation failed: client connection to 0.0.0.0:0: connect: Connection refused (error 111)
[       OK ] Parameters/TestRpc.TestCallToBadServer/SSL_TCP (9 ms)
[ RUN      ] Parameters/TestRpc.TestWrongService/SSL_TCP
I20260923 22:07:02.685865   479 acceptor_pool.cc:254] collecting diagnostics on the listening RPC socket 0.0.0.0:40223 every 8 connection(s)
I20260923 22:07:02.685909   480 acceptor_pool.cc:254] collecting diagnostics on the listening RPC socket 0.0.0.0:40223 every 8 connection(s)
I20260923 22:07:02.694797   477 messenger.cc:345] service WrongServiceName not registered on TestServer
[       OK ] Parameters/TestRpc.TestWrongService/SSL_TCP (16 ms)
[ RUN      ] Parameters/TestRpc.TestConnectionKeepalive/SSL_TCP
I20260923 22:07:02.713035   502 acceptor_pool.cc:254] collecting diagnostics on the listening RPC socket 0.0.0.0:33399 every 8 connection(s)
I20260923 22:07:02.713083   503 acceptor_pool.cc:254] collecting diagnostics on the listening RPC socket 0.0.0.0:33399 every 8 connection(s)
I20260923 22:07:02.713306   383 rpc-test.cc:488] Connecting to 0.0.0.0:33399
[       OK ] Parameters/TestRpc.TestConnectionKeepalive/SSL_TCP (1036 ms)
[ RUN      ] Parameters/TestRpc.TestClientConnectionMetrics/SSL_TCP
I20260923 22:07:03.745759   527 acceptor_pool.cc:254] collecting diagnostics on the listening RPC socket 0.0.0.0:36659 every 8 connection(s)
I20260923 22:07:03.745833   528 acceptor_pool.cc:254] collecting diagnostics on the listening RPC socket 0.0.0.0:36659 every 8 connection(s)
I20260923 22:07:03.746035   383 rpc-test.cc:569] Connecting to 0.0.0.0:36659
[       OK ] Parameters/TestRpc.TestClientConnectionMetrics/SSL_TCP (13340 ms)
[ RUN      ] Parameters/TestRpc.TestCredentialsPolicy/SSL_TCP
I20260923 22:07:17.089110   550 acceptor_pool.cc:254] collecting diagnostics on the listening RPC socket 0.0.0.0:39627 every 8 connection(s)
I20260923 22:07:17.089201   551 acceptor_pool.cc:254] collecting diagnostics on the listening RPC socket 0.0.0.0:39627 every 8 connection(s)
I20260923 22:07:17.089419   383 rpc-test.cc:700] Connecting to 0.0.0.0:39627
[       OK ] Parameters/TestRpc.TestCredentialsPolicy/SSL_TCP (46 ms)
[ RUN      ] Parameters/TestRpc.TestCallLongerThanKeepalive/SSL_TCP
I20260923 22:07:17.128962   575 acceptor_pool.cc:254] collecting diagnostics on the listening RPC socket 0.0.0.0:36109 every 8 connection(s)
I20260923 22:07:17.128993   576 acceptor_pool.cc:254] collecting diagnostics on the listening RPC socket 0.0.0.0:36109 every 8 connection(s)
I20260923 22:07:17.137302   579 rpc-test-base.h:222] got call: sleep_micros: 3000000 deferred: true
I20260923 22:07:20.138113   579 rpcz_store.cc:275] Call kudu.rpc.GenericCalculatorService.Sleep from 127.0.0.1:46146 (request call id 0) took 3000 ms. Trace:
I20260923 22:07:20.138232   579 rpcz_store.cc:276] 0923 22:07:17.137226 (+     0us) service_pool.cc:170] Inserting onto call queue
0923 22:07:17.137282 (+    56us) service_pool.cc:227] Handling call
0923 22:07:20.138092 (+3000810us) inbound_call.cc:173] Queueing success response
Metrics: {}
[       OK ] Parameters/TestRpc.TestCallLongerThanKeepalive/SSL_TCP (3020 ms)
[ RUN      ] Parameters/TestRpc.TestRpcSidecar/SSL_TCP
I20260923 22:07:20.152673   600 acceptor_pool.cc:254] collecting diagnostics on the listening RPC socket 0.0.0.0:35495 every 8 connection(s)
I20260923 22:07:20.152755   601 acceptor_pool.cc:254] collecting diagnostics on the listening RPC socket 0.0.0.0:35495 every 8 connection(s)
[       OK ] Parameters/TestRpc.TestRpcSidecar/SSL_TCP (68 ms)
[ RUN      ] Parameters/TestRpc.TestRpcSidecarLimits/SSL_TCP
I20260923 22:07:21.871912   625 acceptor_pool.cc:254] collecting diagnostics on the listening RPC socket 0.0.0.0:33217 every 8 connection(s)
I20260923 22:07:21.871944   626 acceptor_pool.cc:254] collecting diagnostics on the listening RPC socket 0.0.0.0:33217 every 8 connection(s)
W20260923 22:07:21.878765   383 serialization.cc:72] Serialized kudu.rpc_test.PushStringsRequestPB (2147483654 bytes) is larger than the maximum configured RPC message size (52428800 bytes). Sending anyway, but peer may reject the data.
W20260923 22:07:21.882611   624 connection.cc:535] server connection from 127.0.0.1:39326 recv error: Network error: RPC frame had a length of 2147483714, but we only support messages up to 52428800 bytes long.
W20260923 22:07:21.882694   624 connection.cc:158] shutting down server connection from 127.0.0.1:39326 with pending inbound data: 4/2147483714 bytes received; last active 0 ns ago: status Network error: RPC frame had a length of 2147483714, but we only support messages up to 52428800 bytes long.
W20260923 22:07:21.883028   638 connection.cc:196] Error closing socket: Network error: TlsSocket::Close: Connection reset by peer
I20260923 22:07:21.906769   651 acceptor_pool.cc:254] collecting diagnostics on the listening RPC socket 0.0.0.0:39039 every 8 connection(s)
I20260923 22:07:21.906929   650 acceptor_pool.cc:254] collecting diagnostics on the listening RPC socket 0.0.0.0:39039 every 8 connection(s)
W20260923 22:07:26.067775   649 connection.cc:577] server connection from 127.0.0.1:34462: received bad data: 'Corruption: Invalid packet: message had a length of 2147483710, but we only support messages up to 2147483647 bytes
'
[       OK ] Parameters/TestRpc.TestRpcSidecarLimits/SSL_TCP (5860 ms)
[ RUN      ] Parameters/TestRpc.TestCallTimeoutDoesntAffectNegotiation/SSL_TCP
I20260923 22:07:26.100909   675 acceptor_pool.cc:254] collecting diagnostics on the listening RPC socket 0.0.0.0:37325 every 8 connection(s)
I20260923 22:07:26.100927   676 acceptor_pool.cc:254] collecting diagnostics on the listening RPC socket 0.0.0.0:37325 every 8 connection(s)
W20260923 22:07:26.111716   671 negotiation.cc:266] Injecting 500ms delay in negotiation
I20260923 22:07:26.162115   383 rpc-test-base.h:595] status: Timed out: connection negotiation to 0.0.0.0:37325 for RPC Sleep timed out after 0.050s (ON_OUTBOUND_QUEUE), seconds elapsed: 0.0508483
[       OK ] Parameters/TestRpc.TestCallTimeoutDoesntAffectNegotiation/SSL_TCP (547 ms)
[ RUN      ] Parameters/TestRpc.TestRpcHandlerLatencyMetric/SSL_TCP
I20260923 22:07:26.642676   700 acceptor_pool.cc:254] collecting diagnostics on the listening RPC socket 0.0.0.0:42559 every 8 connection(s)
I20260923 22:07:26.642681   701 acceptor_pool.cc:254] collecting diagnostics on the listening RPC socket 0.0.0.0:42559 every 8 connection(s)
I20260923 22:07:26.681505   383 rpc-test.cc:1236] Sleep() min lat: 20403
I20260923 22:07:26.681581   383 rpc-test.cc:1237] Sleep() mean lat: 20403
I20260923 22:07:26.681607   383 rpc-test.cc:1238] Sleep() max lat: 20403
I20260923 22:07:26.681617   383 rpc-test.cc:1239] Sleep() #calls: 1
[       OK ] Parameters/TestRpc.TestRpcHandlerLatencyMetric/SSL_TCP (65 ms)
[ RUN      ] Parameters/TestRpc.TimedOutOnResponseMetricServiceQueue/SSL_TCP
I20260923 22:07:26.693348   726 acceptor_pool.cc:254] collecting diagnostics on the listening RPC socket 0.0.0.0:40677 every 8 connection(s)
I20260923 22:07:26.693396   727 acceptor_pool.cc:254] collecting diagnostics on the listening RPC socket 0.0.0.0:40677 every 8 connection(s)
W20260923 22:07:26.750607   728 rpcz_store.cc:267] Call kudu.rpc_test.CalculatorService.Sleep from 127.0.0.1:60036 (request call id 2) took 20 ms (client timeout 20 ms). Trace:
W20260923 22:07:26.750696   728 rpcz_store.cc:269] 0923 22:07:26.730245 (+     0us) service_pool.cc:170] Inserting onto call queue
0923 22:07:26.750565 (+ 20320us) service_pool.cc:214] Skipping call since client already timed out
0923 22:07:26.750593 (+    28us) inbound_call.cc:173] Queueing failure response
Metrics: {}
[       OK ] Parameters/TestRpc.TimedOutOnResponseMetricServiceQueue/SSL_TCP (69 ms)
[ RUN      ] Parameters/TestRpc.RpcPendingConnectionsMetric/SSL_TCP
I20260923 22:07:26.754733   749 acceptor_pool.cc:254] collecting diagnostics on the listening RPC socket 0.0.0.0:35503 every 8 connection(s)
I20260923 22:07:26.754808   750 acceptor_pool.cc:254] collecting diagnostics on the listening RPC socket 0.0.0.0:35503 every 8 connection(s)
W20260923 22:07:26.763141   745 negotiation.cc:337] Failed RPC negotiation. Trace:
0923 22:07:26.762579 (+     0us) reactor.cc:625] Submitting negotiation task for server connection from 127.0.0.1:50012 (local address 127.0.0.1:35503)
0923 22:07:26.762728 (+   149us) server_negotiation.cc:206] Beginning negotiation
0923 22:07:26.762733 (+     5us) server_negotiation.cc:399] Waiting for connection header
0923 22:07:26.762871 (+   138us) negotiation.cc:327] Negotiation complete: Network error: Server connection negotiation failed: server connection from 127.0.0.1:50012: BlockingRecv error: recv got EOF from 127.0.0.1:50012 (error 108)
Metrics: {"server-negotiator.queue_time_us":50}
[       OK ] Parameters/TestRpc.RpcPendingConnectionsMetric/SSL_TCP (21 ms)
[ RUN      ] Parameters/TestRpc.TestRpcContextClientDeadline/SSL_TCP
I20260923 22:07:26.784221   765 acceptor_pool.cc:254] collecting diagnostics on the listening RPC socket 0.0.0.0:36331 every 8 connection(s)
I20260923 22:07:26.784245   766 acceptor_pool.cc:254] collecting diagnostics on the listening RPC socket 0.0.0.0:36331 every 8 connection(s)
[       OK ] Parameters/TestRpc.TestRpcContextClientDeadline/SSL_TCP (45 ms)
[ RUN      ] Parameters/TestRpc.TestApplicationFeatureFlagUnsupportedServer/SSL_TCP
I20260923 22:07:26.827924   790 acceptor_pool.cc:254] collecting diagnostics on the listening RPC socket 0.0.0.0:39397 every 8 connection(s)
I20260923 22:07:26.827955   791 acceptor_pool.cc:254] collecting diagnostics on the listening RPC socket 0.0.0.0:39397 every 8 connection(s)
[       OK ] Parameters/TestRpc.TestApplicationFeatureFlagUnsupportedServer/SSL_TCP (28 ms)
[ RUN      ] Parameters/TestRpc.TestCancellationAsync/SSL_TCP
I20260923 22:07:26.856757   815 acceptor_pool.cc:254] collecting diagnostics on the listening RPC socket 0.0.0.0:38205 every 8 connection(s)
I20260923 22:07:26.856796   816 acceptor_pool.cc:254] collecting diagnostics on the listening RPC socket 0.0.0.0:38205 every 8 connection(s)
I20260923 22:07:26.857015   383 rpc-test.cc:1716] Connecting to 0.0.0.0:38205
I20260923 22:07:26.864383   383 test_util.cc:268] Using random seed: -1251650562
I20260923 22:07:26.887909   819 rpc-test-base.h:240] got call: sleep_micros: 500 pattern: 4294967295 num_repetitions: 2097152 sidecar_idx: 0
I20260923 22:07:26.907586   819 rpc-test-base.h:240] got call: sleep_micros: 500 pattern: 4294967295 num_repetitions: 2097152 sidecar_idx: 0
I20260923 22:07:26.927207   819 rpc-test-base.h:240] got call: sleep_micros: 500 pattern: 4294967295 num_repetitions: 2097152 sidecar_idx: 0
I20260923 22:07:26.947546   819 rpc-test-base.h:240] got call: sleep_micros: 500 pattern: 4294967295 num_repetitions: 2097152 sidecar_idx: 0
I20260923 22:07:26.967698   818 rpc-test-base.h:240] got call: sleep_micros: 500 pattern: 4294967295 num_repetitions: 2097152 sidecar_idx: 0
I20260923 22:07:26.989621   818 rpc-test-base.h:240] got call: sleep_micros: 500 pattern: 4294967295 num_repetitions: 2097152 sidecar_idx: 0
I20260923 22:07:27.013185   818 rpc-test-base.h:240] got call: sleep_micros: 500 pattern: 4294967295 num_repetitions: 2097152 sidecar_idx: 0
I20260923 22:07:27.038365   818 rpc-test-base.h:240] got call: sleep_micros: 500 pattern: 4294967295 num_repetitions: 2097152 sidecar_idx: 0
W20260923 22:07:27.056141   814 connection.cc:441] server connection from 127.0.0.1:55372 torn down before Call kudu.rpc.GenericCalculatorService.SleepWithSidecar from 127.0.0.1:55372 (request call id 9) could send its response
[       OK ] Parameters/TestRpc.TestCancellationAsync/SSL_TCP (210 ms)
[ RUN      ] Parameters/TestRpc.TestPerformanceBySocketType/SSL_TCP
I20260923 22:07:27.089466   840 acceptor_pool.cc:254] collecting diagnostics on the listening RPC socket 0.0.0.0:32891 every 8 connection(s)
I20260923 22:07:27.089509   841 acceptor_pool.cc:254] collecting diagnostics on the listening RPC socket 0.0.0.0:32891 every 8 connection(s)
I20260923 22:07:27.089704   383 rpc-test.cc:1846] Connecting to 0.0.0.0:32891
I20260923 22:07:29.093014   383 rpc-test.cc:1859] Sending 1024MB via ssl-enabled tcp socket: real 1.984s	user 2.199s	sys 1.301s
I20260923 22:07:31.047876   383 rpc-test.cc:1859] Sending 1024MB via ssl-enabled tcp socket: real 1.955s	user 2.100s	sys 1.357s
I20260923 22:07:33.102921   383 rpc-test.cc:1859] Sending 1024MB via ssl-enabled tcp socket: real 2.055s	user 2.159s	sys 1.472s
I20260923 22:07:35.074693   383 rpc-test.cc:1859] Sending 1024MB via ssl-enabled tcp socket: real 1.972s	user 2.137s	sys 1.334s
I20260923 22:07:37.085601   383 rpc-test.cc:1859] Sending 1024MB via ssl-enabled tcp socket: real 2.011s	user 2.130s	sys 1.421s
[       OK ] Parameters/TestRpc.TestPerformanceBySocketType/SSL_TCP (10029 ms)
[----------] 20 tests from Parameters/TestRpc (34536 ms total)

[----------] 1 test from Parameters/TestRpcSocketTxRxQueue
[ RUN      ] Parameters/TestRpcSocketTxRxQueue.OverCapacity/0
W20260923 22:07:37.361851   875 negotiation.cc:337] Failed RPC negotiation. Trace:
0923 22:07:37.097331 (+     0us) reactor.cc:625] Submitting negotiation task for client connection to 0.0.0.0:33203 (local address 127.0.0.1:34096)
0923 22:07:37.097407 (+    76us) negotiation.cc:107] Waiting for socket to connect
0923 22:07:37.097417 (+    10us) client_negotiation.cc:174] Beginning negotiation
0923 22:07:37.097489 (+    72us) client_negotiation.cc:252] Sending NEGOTIATE NegotiatePB request
0923 22:07:37.361674 (+264185us) negotiation.cc:327] Negotiation complete: Network error: Client connection negotiation failed: client connection to 0.0.0.0:33203: BlockingRecv error: recv error from unknown peer: Transport endpoint is not connected (error 107)
Metrics: {"client-negotiator.queue_time_us":23}
W20260923 22:07:37.361950   856 negotiation.cc:337] Failed RPC negotiation. Trace:
0923 22:07:37.095317 (+     0us) reactor.cc:625] Submitting negotiation task for client connection to 0.0.0.0:33203 (local address 127.0.0.1:34074)
0923 22:07:37.095424 (+   107us) negotiation.cc:107] Waiting for socket to connect
0923 22:07:37.095438 (+    14us) client_negotiation.cc:174] Beginning negotiation
0923 22:07:37.095518 (+    80us) client_negotiation.cc:252] Sending NEGOTIATE NegotiatePB request
0923 22:07:37.361670 (+266152us) negotiation.cc:327] Negotiation complete: Network error: Client connection negotiation failed: client connection to 0.0.0.0:33203: BlockingRecv error: recv error from unknown peer: Transport endpoint is not connected (error 107)
Metrics: {"client-negotiator.queue_time_us":43}
W20260923 22:07:37.361851   892 negotiation.cc:337] Failed RPC negotiation. Trace:
0923 22:07:37.099420 (+     0us) reactor.cc:625] Submitting negotiation task for client connection to 0.0.0.0:33203 (local address 127.0.0.1:34118)
0923 22:07:37.099525 (+   105us) negotiation.cc:107] Waiting for socket to connect
0923 22:07:37.099537 (+    12us) client_negotiation.cc:174] Beginning negotiation
0923 22:07:37.099611 (+    74us) client_negotiation.cc:252] Sending NEGOTIATE NegotiatePB request
0923 22:07:37.361777 (+262166us) negotiation.cc:327] Negotiation complete: Network error: Client connection negotiation failed: client connection to 0.0.0.0:33203: BlockingRecv error: recv error from unknown peer: Transport endpoint is not connected (error 107)
Metrics: {"client-negotiator.queue_time_us":39}
W20260923 22:07:37.362164   884 negotiation.cc:337] Failed RPC negotiation. Trace:
0923 22:07:37.098333 (+     0us) reactor.cc:625] Submitting negotiation task for client connection to 0.0.0.0:33203 (local address 127.0.0.1:34102)
0923 22:07:37.098420 (+    87us) negotiation.cc:107] Waiting for socket to connect
0923 22:07:37.098430 (+    10us) client_negotiation.cc:174] Beginning negotiation
0923 22:07:37.098488 (+    58us) client_negotiation.cc:252] Sending NEGOTIATE NegotiatePB request
0923 22:07:37.361670 (+263182us) negotiation.cc:327] Negotiation complete: Network error: Client connection negotiation failed: client connection to 0.0.0.0:33203: BlockingRecv error: recv error from unknown peer: Transport endpoint is not connected (error 107)
Metrics: {"client-negotiator.queue_time_us":35}
W20260923 22:07:37.362269   866 negotiation.cc:337] Failed RPC negotiation. Trace:
0923 22:07:37.096349 (+     0us) reactor.cc:625] Submitting negotiation task for client connection to 0.0.0.0:33203 (local address 127.0.0.1:34086)
0923 22:07:37.096462 (+   113us) negotiation.cc:107] Waiting for socket to connect
0923 22:07:37.096475 (+    13us) client_negotiation.cc:174] Beginning negotiation
0923 22:07:37.096555 (+    80us) client_negotiation.cc:252] Sending NEGOTIATE NegotiatePB request
0923 22:07:37.361674 (+265119us) negotiation.cc:327] Negotiation complete: Network error: Client connection negotiation failed: client connection to 0.0.0.0:33203: BlockingRecv error: recv error from unknown peer: Transport endpoint is not connected (error 107)
Metrics: {"client-negotiator.queue_time_us":34}
W20260923 22:07:37.361896   902 negotiation.cc:337] Failed RPC negotiation. Trace:
0923 22:07:37.100536 (+     0us) reactor.cc:625] Submitting negotiation task for client connection to 0.0.0.0:33203 (local address 127.0.0.1:34134)
0923 22:07:37.100619 (+    83us) negotiation.cc:107] Waiting for socket to connect
0923 22:07:37.100629 (+    10us) client_negotiation.cc:174] Beginning negotiation
0923 22:07:37.100695 (+    66us) client_negotiation.cc:252] Sending NEGOTIATE NegotiatePB request
0923 22:07:37.361818 (+261123us) negotiation.cc:327] Negotiation complete: Network error: Client connection negotiation failed: client connection to 0.0.0.0:33203: BlockingRecv error: recv error from unknown peer: Transport endpoint is not connected (error 107)
Metrics: {"client-negotiator.queue_time_us":25}
[       OK ] Parameters/TestRpcSocketTxRxQueue.OverCapacity/0 (1052 ms)
[----------] 1 test from Parameters/TestRpcSocketTxRxQueue (1052 ms total)

[----------] Global test environment tear-down
[==========] 21 tests from 2 test suites ran. (35588 ms total)
[  PASSED  ] 20 tests.
[  FAILED  ] 1 test, listed below:
[  FAILED  ] Parameters/TestRpc.TestCallWithChainCertAndChainCA/SSL_TCP, where GetParam() = (true, false)

 1 FAILED TEST