Diagnosed failure
Parameters/TestRpc.TestCallWithChainCertAndChainCA/SSL_TCP: /data0/somelongdirectorytoavoidrpathissues/src/kudu/src/kudu/rpc/rpc-test.cc:270: Failure
Failed
Bad status: Runtime error: could not verify certificate chain (error with cert: subject=CN = localhost, ST = sadfjas, C = AS, emailAddress = sdflkdsajf, O = lskdfjlsad, OU = sldfkja, issuer=C = AS, ST = ASDfkjdhf, L = lskdjf, O = saldfja, OU = skdjf, CN = localhost, emailAddress = sadjflkadsj): : certificate has expired
Google Test trace:
/data0/somelongdirectorytoavoidrpathissues/src/kudu/src/kudu/rpc/rpc-test.cc:267: Connecting to 0.0.0.0:44639
I20260928 14:51:08.062868 25587 test_util.cc:175] -----------------------------------------------
I20260928 14:51:08.062979 25587 test_util.cc:176] Had fatal failures, leaving test files at /tmp/dist-test-taskYEhvhm/test-tmp/rpc-test.5.Parameters_TestRpc.TestCallWithChainCertAndChainCA_SSL_TCP.1790607067883432-25587-0
Full log
Note: This is test shard 6 of 8.
[==========] Running 21 tests from 2 test suites.
[----------] Global test environment set-up.
[----------] 20 tests from Parameters/TestRpc
[ RUN ] Parameters/TestRpc.TestMessengerCreateDestroy/SSL_TCP
WARNING: Logging before InitGoogleLogging() is written to STDERR
I20260928 14:51:07.946812 25587 rpc-test.cc:169] started messenger TestCreateDestroy
[ OK ] Parameters/TestRpc.TestMessengerCreateDestroy/SSL_TCP (44 ms)
[ RUN ] Parameters/TestRpc.TestNegotiationDeadlock/SSL_TCP
I20260928 14:51:07.995306 25607 acceptor_pool.cc:254] collecting diagnostics on the listening RPC socket 0.0.0.0:38721 every 8 connection(s)
I20260928 14:51:07.995687 25608 acceptor_pool.cc:254] collecting diagnostics on the listening RPC socket 0.0.0.0:38721 every 8 connection(s)
[ OK ] Parameters/TestRpc.TestNegotiationDeadlock/SSL_TCP (71 ms)
[ RUN ] Parameters/TestRpc.TestCallWithChainCertAndChainCA/SSL_TCP
I20260928 14:51:08.047698 25623 acceptor_pool.cc:254] collecting diagnostics on the listening RPC socket 0.0.0.0:44639 every 8 connection(s)
I20260928 14:51:08.048105 25624 acceptor_pool.cc:254] collecting diagnostics on the listening RPC socket 0.0.0.0:44639 every 8 connection(s)
/data0/somelongdirectorytoavoidrpathissues/src/kudu/src/kudu/rpc/rpc-test.cc:270: Failure
Failed
Bad status: Runtime error: could not verify certificate chain (error with cert: subject=CN = localhost, ST = sadfjas, C = AS, emailAddress = sdflkdsajf, O = lskdfjlsad, OU = sldfkja, issuer=C = AS, ST = ASDfkjdhf, L = lskdjf, O = saldfja, OU = skdjf, CN = localhost, emailAddress = sadjflkadsj): : certificate has expired
Google Test trace:
/data0/somelongdirectorytoavoidrpathissues/src/kudu/src/kudu/rpc/rpc-test.cc:267: Connecting to 0.0.0.0:44639
I20260928 14:51:08.062868 25587 test_util.cc:175] -----------------------------------------------
I20260928 14:51:08.062979 25587 test_util.cc:176] Had fatal failures, leaving test files at /tmp/dist-test-taskYEhvhm/test-tmp/rpc-test.5.Parameters_TestRpc.TestCallWithChainCertAndChainCA_SSL_TCP.1790607067883432-25587-0
[ FAILED ] Parameters/TestRpc.TestCallWithChainCertAndChainCA/SSL_TCP, where GetParam() = (true, false) (39 ms)
[ RUN ] Parameters/TestRpc.TestCallWithPasswordProtectedKey/SSL_TCP
I20260928 14:51:08.097947 25648 acceptor_pool.cc:254] collecting diagnostics on the listening RPC socket 0.0.0.0:41119 every 8 connection(s)
I20260928 14:51:08.098302 25649 acceptor_pool.cc:254] collecting diagnostics on the listening RPC socket 0.0.0.0:41119 every 8 connection(s)
[ OK ] Parameters/TestRpc.TestCallWithPasswordProtectedKey/SSL_TCP (81 ms)
[ RUN ] Parameters/TestRpc.TestCallToBadServer/SSL_TCP
I20260928 14:51:08.175773 25587 rpc-test.cc:394] Status: Network error: Client connection negotiation failed: client connection to 0.0.0.0:0: connect: Connection refused (error 111)
I20260928 14:51:08.177059 25587 rpc-test.cc:394] Status: Network error: Client connection negotiation failed: client connection to 0.0.0.0:0: connect: Connection refused (error 111)
I20260928 14:51:08.178161 25587 rpc-test.cc:394] Status: Network error: Client connection negotiation failed: client connection to 0.0.0.0:0: connect: Connection refused (error 111)
I20260928 14:51:08.179472 25587 rpc-test.cc:394] Status: Network error: Client connection negotiation failed: client connection to 0.0.0.0:0: connect: Connection refused (error 111)
I20260928 14:51:08.180527 25587 rpc-test.cc:394] Status: Network error: Client connection negotiation failed: client connection to 0.0.0.0:0: connect: Connection refused (error 111)
[ OK ] Parameters/TestRpc.TestCallToBadServer/SSL_TCP (39 ms)
[ RUN ] Parameters/TestRpc.TestWrongService/SSL_TCP
I20260928 14:51:08.207957 25683 acceptor_pool.cc:254] collecting diagnostics on the listening RPC socket 0.0.0.0:42769 every 8 connection(s)
I20260928 14:51:08.208228 25684 acceptor_pool.cc:254] collecting diagnostics on the listening RPC socket 0.0.0.0:42769 every 8 connection(s)
I20260928 14:51:08.236562 25681 messenger.cc:345] service WrongServiceName not registered on TestServer
[ OK ] Parameters/TestRpc.TestWrongService/SSL_TCP (59 ms)
[ RUN ] Parameters/TestRpc.TestConnectionKeepalive/SSL_TCP
I20260928 14:51:08.260951 25706 acceptor_pool.cc:254] collecting diagnostics on the listening RPC socket 0.0.0.0:35573 every 8 connection(s)
I20260928 14:51:08.261277 25707 acceptor_pool.cc:254] collecting diagnostics on the listening RPC socket 0.0.0.0:35573 every 8 connection(s)
I20260928 14:51:08.262600 25587 rpc-test.cc:488] Connecting to 0.0.0.0:35573
[ OK ] Parameters/TestRpc.TestConnectionKeepalive/SSL_TCP (1055 ms)
[ RUN ] Parameters/TestRpc.TestClientConnectionMetrics/SSL_TCP
I20260928 14:51:09.314136 25731 acceptor_pool.cc:254] collecting diagnostics on the listening RPC socket 0.0.0.0:37733 every 8 connection(s)
I20260928 14:51:09.314477 25732 acceptor_pool.cc:254] collecting diagnostics on the listening RPC socket 0.0.0.0:37733 every 8 connection(s)
I20260928 14:51:09.315739 25587 rpc-test.cc:569] Connecting to 0.0.0.0:37733
[ OK ] Parameters/TestRpc.TestClientConnectionMetrics/SSL_TCP (23585 ms)
[ RUN ] Parameters/TestRpc.TestCredentialsPolicy/SSL_TCP
I20260928 14:51:32.897912 25754 acceptor_pool.cc:254] collecting diagnostics on the listening RPC socket 0.0.0.0:35291 every 8 connection(s)
I20260928 14:51:32.898284 25755 acceptor_pool.cc:254] collecting diagnostics on the listening RPC socket 0.0.0.0:35291 every 8 connection(s)
I20260928 14:51:32.899655 25587 rpc-test.cc:700] Connecting to 0.0.0.0:35291
[ OK ] Parameters/TestRpc.TestCredentialsPolicy/SSL_TCP (60 ms)
[ RUN ] Parameters/TestRpc.TestCallLongerThanKeepalive/SSL_TCP
I20260928 14:51:32.968572 25779 acceptor_pool.cc:254] collecting diagnostics on the listening RPC socket 0.0.0.0:33589 every 8 connection(s)
I20260928 14:51:32.968905 25780 acceptor_pool.cc:254] collecting diagnostics on the listening RPC socket 0.0.0.0:33589 every 8 connection(s)
I20260928 14:51:32.989940 25783 rpc-test-base.h:222] got call: sleep_micros: 3000000 deferred: true
I20260928 14:51:35.992311 25783 rpcz_store.cc:275] Call kudu.rpc.GenericCalculatorService.Sleep from 127.0.0.1:44210 (request call id 0) took 3002 ms. Trace:
I20260928 14:51:35.992571 25783 rpcz_store.cc:276] 0928 14:51:32.989762 (+ 0us) service_pool.cc:170] Inserting onto call queue
0928 14:51:32.989859 (+ 97us) service_pool.cc:227] Handling call
0928 14:51:35.992230 (+3002371us) inbound_call.cc:173] Queueing success response
Metrics: {}
[ OK ] Parameters/TestRpc.TestCallLongerThanKeepalive/SSL_TCP (3055 ms)
[ RUN ] Parameters/TestRpc.TestRpcSidecar/SSL_TCP
I20260928 14:51:36.019737 25804 acceptor_pool.cc:254] collecting diagnostics on the listening RPC socket 0.0.0.0:45249 every 8 connection(s)
I20260928 14:51:36.020053 25805 acceptor_pool.cc:254] collecting diagnostics on the listening RPC socket 0.0.0.0:45249 every 8 connection(s)
[ OK ] Parameters/TestRpc.TestRpcSidecar/SSL_TCP (149 ms)
[ RUN ] Parameters/TestRpc.TestRpcSidecarLimits/SSL_TCP
I20260928 14:51:39.526888 25829 acceptor_pool.cc:254] collecting diagnostics on the listening RPC socket 0.0.0.0:38167 every 8 connection(s)
I20260928 14:51:39.527202 25830 acceptor_pool.cc:254] collecting diagnostics on the listening RPC socket 0.0.0.0:38167 every 8 connection(s)
W20260928 14:51:39.543779 25587 serialization.cc:72] Serialized kudu.rpc_test.PushStringsRequestPB (2147483654 bytes) is larger than the maximum configured RPC message size (52428800 bytes). Sending anyway, but peer may reject the data.
W20260928 14:51:39.551717 25826 connection.cc:535] server connection from 127.0.0.1:54908 recv error: Network error: RPC frame had a length of 2147483714, but we only support messages up to 52428800 bytes long.
W20260928 14:51:39.551865 25826 connection.cc:158] shutting down server connection from 127.0.0.1:54908 with pending inbound data: 4/2147483714 bytes received; last active 0 ns ago: status Network error: RPC frame had a length of 2147483714, but we only support messages up to 52428800 bytes long.
W20260928 14:51:39.552443 25842 connection.cc:196] Error closing socket: Network error: TlsSocket::Close: Connection reset by peer
I20260928 14:51:39.602840 25854 acceptor_pool.cc:254] collecting diagnostics on the listening RPC socket 0.0.0.0:38797 every 8 connection(s)
I20260928 14:51:39.603071 25855 acceptor_pool.cc:254] collecting diagnostics on the listening RPC socket 0.0.0.0:38797 every 8 connection(s)
W20260928 14:51:47.397128 25851 connection.cc:577] server connection from 127.0.0.1:58362: received bad data: 'Corruption: Invalid packet: message had a length of 2147483710, but we only support messages up to 2147483647 bytes
'
[ OK ] Parameters/TestRpc.TestRpcSidecarLimits/SSL_TCP (11753 ms)
[ RUN ] Parameters/TestRpc.TestCallTimeoutDoesntAffectNegotiation/SSL_TCP
I20260928 14:51:47.948208 25879 acceptor_pool.cc:254] collecting diagnostics on the listening RPC socket 0.0.0.0:41119 every 8 connection(s)
I20260928 14:51:47.948647 25880 acceptor_pool.cc:254] collecting diagnostics on the listening RPC socket 0.0.0.0:41119 every 8 connection(s)
W20260928 14:51:47.976063 25875 negotiation.cc:266] Injecting 500ms delay in negotiation
I20260928 14:51:48.026664 25587 rpc-test-base.h:595] status: Timed out: connection negotiation to 0.0.0.0:41119 for RPC Sleep timed out after 0.050s (ON_OUTBOUND_QUEUE), seconds elapsed: 0.0516066
[ OK ] Parameters/TestRpc.TestCallTimeoutDoesntAffectNegotiation/SSL_TCP (586 ms)
[ RUN ] Parameters/TestRpc.TestRpcHandlerLatencyMetric/SSL_TCP
I20260928 14:51:48.504765 25904 acceptor_pool.cc:254] collecting diagnostics on the listening RPC socket 0.0.0.0:41325 every 8 connection(s)
I20260928 14:51:48.505261 25905 acceptor_pool.cc:254] collecting diagnostics on the listening RPC socket 0.0.0.0:41325 every 8 connection(s)
I20260928 14:51:48.555307 25587 rpc-test.cc:1236] Sleep() min lat: 20864
I20260928 14:51:48.555428 25587 rpc-test.cc:1237] Sleep() mean lat: 20864
I20260928 14:51:48.555475 25587 rpc-test.cc:1238] Sleep() max lat: 20864
I20260928 14:51:48.555497 25587 rpc-test.cc:1239] Sleep() #calls: 1
[ OK ] Parameters/TestRpc.TestRpcHandlerLatencyMetric/SSL_TCP (73 ms)
[ RUN ] Parameters/TestRpc.TimedOutOnResponseMetricServiceQueue/SSL_TCP
I20260928 14:51:48.593482 25930 acceptor_pool.cc:254] collecting diagnostics on the listening RPC socket 0.0.0.0:33783 every 8 connection(s)
I20260928 14:51:48.593760 25931 acceptor_pool.cc:254] collecting diagnostics on the listening RPC socket 0.0.0.0:33783 every 8 connection(s)
W20260928 14:51:48.664460 25932 rpcz_store.cc:267] Call kudu.rpc_test.CalculatorService.Sleep from 127.0.0.1:50632 (request call id 2) took 20 ms (client timeout 20 ms). Trace:
W20260928 14:51:48.664667 25932 rpcz_store.cc:269] 0928 14:51:48.644037 (+ 0us) service_pool.cc:170] Inserting onto call queue
0928 14:51:48.664394 (+ 20357us) service_pool.cc:214] Skipping call since client already timed out
0928 14:51:48.664439 (+ 45us) inbound_call.cc:173] Queueing failure response
Metrics: {}
[ OK ] Parameters/TestRpc.TimedOutOnResponseMetricServiceQueue/SSL_TCP (107 ms)
[ RUN ] Parameters/TestRpc.RpcPendingConnectionsMetric/SSL_TCP
I20260928 14:51:48.676789 25953 acceptor_pool.cc:254] collecting diagnostics on the listening RPC socket 0.0.0.0:44803 every 8 connection(s)
I20260928 14:51:48.677053 25954 acceptor_pool.cc:254] collecting diagnostics on the listening RPC socket 0.0.0.0:44803 every 8 connection(s)
W20260928 14:51:48.679879 25949 negotiation.cc:337] Failed RPC negotiation. Trace:
0928 14:51:48.679125 (+ 0us) reactor.cc:625] Submitting negotiation task for server connection from 127.0.0.1:44718 (local address 127.0.0.1:44803)
0928 14:51:48.679346 (+ 221us) server_negotiation.cc:206] Beginning negotiation
0928 14:51:48.679350 (+ 4us) server_negotiation.cc:399] Waiting for connection header
0928 14:51:48.679519 (+ 169us) negotiation.cc:327] Negotiation complete: Network error: Server connection negotiation failed: server connection from 127.0.0.1:44718: BlockingRecv error: recv got EOF from 127.0.0.1:44718 (error 108)
Metrics: {"server-negotiator.queue_time_us":74}
[ OK ] Parameters/TestRpc.RpcPendingConnectionsMetric/SSL_TCP (22 ms)
[ RUN ] Parameters/TestRpc.TestRpcContextClientDeadline/SSL_TCP
I20260928 14:51:48.712826 25969 acceptor_pool.cc:254] collecting diagnostics on the listening RPC socket 0.0.0.0:40285 every 8 connection(s)
I20260928 14:51:48.713089 25970 acceptor_pool.cc:254] collecting diagnostics on the listening RPC socket 0.0.0.0:40285 every 8 connection(s)
[ OK ] Parameters/TestRpc.TestRpcContextClientDeadline/SSL_TCP (80 ms)
[ RUN ] Parameters/TestRpc.TestApplicationFeatureFlagUnsupportedServer/SSL_TCP
I20260928 14:51:48.800552 25994 acceptor_pool.cc:254] collecting diagnostics on the listening RPC socket 0.0.0.0:34025 every 8 connection(s)
I20260928 14:51:48.800801 25995 acceptor_pool.cc:254] collecting diagnostics on the listening RPC socket 0.0.0.0:34025 every 8 connection(s)
[ OK ] Parameters/TestRpc.TestApplicationFeatureFlagUnsupportedServer/SSL_TCP (56 ms)
[ RUN ] Parameters/TestRpc.TestCancellationAsync/SSL_TCP
I20260928 14:51:48.845518 26019 acceptor_pool.cc:254] collecting diagnostics on the listening RPC socket 0.0.0.0:35347 every 8 connection(s)
I20260928 14:51:48.845851 26020 acceptor_pool.cc:254] collecting diagnostics on the listening RPC socket 0.0.0.0:35347 every 8 connection(s)
I20260928 14:51:48.846913 25587 rpc-test.cc:1716] Connecting to 0.0.0.0:35347
I20260928 14:51:48.867152 25587 test_util.cc:268] Using random seed: 883426333
I20260928 14:51:48.919962 26023 rpc-test-base.h:240] got call: sleep_micros: 500 pattern: 4294967295 num_repetitions: 2097152 sidecar_idx: 0
I20260928 14:51:48.956368 26023 rpc-test-base.h:240] got call: sleep_micros: 500 pattern: 4294967295 num_repetitions: 2097152 sidecar_idx: 0
I20260928 14:51:48.992569 26023 rpc-test-base.h:240] got call: sleep_micros: 500 pattern: 4294967295 num_repetitions: 2097152 sidecar_idx: 0
I20260928 14:51:49.028082 26022 rpc-test-base.h:240] got call: sleep_micros: 500 pattern: 4294967295 num_repetitions: 2097152 sidecar_idx: 0
I20260928 14:51:49.061609 26023 rpc-test-base.h:240] got call: sleep_micros: 500 pattern: 4294967295 num_repetitions: 2097152 sidecar_idx: 0
I20260928 14:51:49.090018 26022 rpc-test-base.h:240] got call: sleep_micros: 500 pattern: 4294967295 num_repetitions: 2097152 sidecar_idx: 0
I20260928 14:51:49.126677 26023 rpc-test-base.h:240] got call: sleep_micros: 500 pattern: 4294967295 num_repetitions: 2097152 sidecar_idx: 0
W20260928 14:51:49.157938 26016 connection.cc:698] server connection from 127.0.0.1:40092 send error: Network error: failed to write to TLS socket: Broken pipe
W20260928 14:51:49.158216 26016 connection.cc:441] server connection from 127.0.0.1:40092 torn down before Call kudu.rpc.GenericCalculatorService.SleepWithSidecar from 127.0.0.1:40092 (request call id 9) could send its response
W20260928 14:51:49.159160 26016 connection.cc:196] Error closing socket: Network error: TlsSocket::Close: Success
W20260928 14:51:49.168948 26016 connection.cc:441] server connection from 127.0.0.1:40092 torn down before Call kudu.rpc.GenericCalculatorService.SleepWithSidecar from 127.0.0.1:40092 (request call id 8) could send its response
[ OK ] Parameters/TestRpc.TestCancellationAsync/SSL_TCP (342 ms)
[ RUN ] Parameters/TestRpc.TestPerformanceBySocketType/SSL_TCP
I20260928 14:51:49.203645 26044 acceptor_pool.cc:254] collecting diagnostics on the listening RPC socket 0.0.0.0:46299 every 8 connection(s)
I20260928 14:51:49.203969 26045 acceptor_pool.cc:254] collecting diagnostics on the listening RPC socket 0.0.0.0:46299 every 8 connection(s)
I20260928 14:51:49.205344 25587 rpc-test.cc:1846] Connecting to 0.0.0.0:46299
I20260928 14:51:53.293144 25587 rpc-test.cc:1859] Sending 1024MB via ssl-enabled tcp socket: real 4.068s user 3.429s sys 3.213s
I20260928 14:51:57.180768 25587 rpc-test.cc:1859] Sending 1024MB via ssl-enabled tcp socket: real 3.887s user 3.356s sys 3.144s
I20260928 14:52:01.133621 25587 rpc-test.cc:1859] Sending 1024MB via ssl-enabled tcp socket: real 3.953s user 3.395s sys 3.140s
I20260928 14:52:05.338932 25587 rpc-test.cc:1859] Sending 1024MB via ssl-enabled tcp socket: real 4.205s user 3.723s sys 3.187s
I20260928 14:52:09.530961 25587 rpc-test.cc:1859] Sending 1024MB via ssl-enabled tcp socket: real 4.192s user 3.532s sys 3.270s
[ OK ] Parameters/TestRpc.TestPerformanceBySocketType/SSL_TCP (20373 ms)
[----------] 20 tests from Parameters/TestRpc (61638 ms total)
[----------] 1 test from Parameters/TestRpcSocketTxRxQueue
[ RUN ] Parameters/TestRpcSocketTxRxQueue.OverCapacity/0
W20260928 14:52:09.871413 26070 negotiation.cc:337] Failed RPC negotiation. Trace:
0928 14:52:09.561179 (+ 0us) reactor.cc:625] Submitting negotiation task for client connection to 0.0.0.0:39697 (local address 127.0.0.1:35794)
0928 14:52:09.561546 (+ 367us) negotiation.cc:107] Waiting for socket to connect
0928 14:52:09.561572 (+ 26us) client_negotiation.cc:174] Beginning negotiation
0928 14:52:09.561914 (+ 342us) client_negotiation.cc:252] Sending NEGOTIATE NegotiatePB request
0928 14:52:09.870048 (+308134us) negotiation.cc:327] Negotiation complete: Network error: Client connection negotiation failed: client connection to 0.0.0.0:39697: BlockingRecv error: recv error from unknown peer: Transport endpoint is not connected (error 107)
Metrics: {"client-negotiator.queue_time_us":128}
W20260928 14:52:09.871559 26097 negotiation.cc:337] Failed RPC negotiation. Trace:
0928 14:52:09.573891 (+ 0us) reactor.cc:625] Submitting negotiation task for client connection to 0.0.0.0:39697 (local address 127.0.0.1:35828)
0928 14:52:09.574240 (+ 349us) negotiation.cc:107] Waiting for socket to connect
0928 14:52:09.574264 (+ 24us) client_negotiation.cc:174] Beginning negotiation
0928 14:52:09.574446 (+ 182us) client_negotiation.cc:252] Sending NEGOTIATE NegotiatePB request
0928 14:52:09.870388 (+295942us) negotiation.cc:327] Negotiation complete: Network error: Client connection negotiation failed: client connection to 0.0.0.0:39697: BlockingRecv error: recv error from unknown peer: Transport endpoint is not connected (error 107)
Metrics: {"client-negotiator.queue_time_us":82}
W20260928 14:52:09.871634 26079 negotiation.cc:337] Failed RPC negotiation. Trace:
0928 14:52:09.565578 (+ 0us) reactor.cc:625] Submitting negotiation task for client connection to 0.0.0.0:39697 (local address 127.0.0.1:35808)
0928 14:52:09.565852 (+ 274us) negotiation.cc:107] Waiting for socket to connect
0928 14:52:09.565883 (+ 31us) client_negotiation.cc:174] Beginning negotiation
0928 14:52:09.566029 (+ 146us) client_negotiation.cc:252] Sending NEGOTIATE NegotiatePB request
0928 14:52:09.870037 (+304008us) negotiation.cc:327] Negotiation complete: Network error: Client connection negotiation failed: client connection to 0.0.0.0:39697: BlockingRecv error: recv error from unknown peer: Transport endpoint is not connected (error 107)
Metrics: {"client-negotiator.queue_time_us":75}
W20260928 14:52:09.872255 26106 negotiation.cc:337] Failed RPC negotiation. Trace:
0928 14:52:09.577929 (+ 0us) reactor.cc:625] Submitting negotiation task for client connection to 0.0.0.0:39697 (local address 127.0.0.1:35840)
0928 14:52:09.578264 (+ 335us) negotiation.cc:107] Waiting for socket to connect
0928 14:52:09.578288 (+ 24us) client_negotiation.cc:174] Beginning negotiation
0928 14:52:09.578475 (+ 187us) client_negotiation.cc:252] Sending NEGOTIATE NegotiatePB request
0928 14:52:09.870546 (+292071us) negotiation.cc:327] Negotiation complete: Network error: Client connection negotiation failed: client connection to 0.0.0.0:39697: BlockingRecv error: recv error from unknown peer: Transport endpoint is not connected (error 107)
Metrics: {"client-negotiator.queue_time_us":130}
W20260928 14:52:09.872568 26061 negotiation.cc:337] Failed RPC negotiation. Trace:
0928 14:52:09.556615 (+ 0us) reactor.cc:625] Submitting negotiation task for client connection to 0.0.0.0:39697 (local address 127.0.0.1:35792)
0928 14:52:09.556882 (+ 267us) negotiation.cc:107] Waiting for socket to connect
0928 14:52:09.556907 (+ 25us) client_negotiation.cc:174] Beginning negotiation
0928 14:52:09.557087 (+ 180us) client_negotiation.cc:252] Sending NEGOTIATE NegotiatePB request
0928 14:52:09.870037 (+312950us) negotiation.cc:327] Negotiation complete: Network error: Client connection negotiation failed: client connection to 0.0.0.0:39697: BlockingRecv error: recv error from unknown peer: Transport endpoint is not connected (error 107)
Metrics: {"client-negotiator.queue_time_us":80}
W20260928 14:52:09.872668 26088 negotiation.cc:337] Failed RPC negotiation. Trace:
0928 14:52:09.569831 (+ 0us) reactor.cc:625] Submitting negotiation task for client connection to 0.0.0.0:39697 (local address 127.0.0.1:35814)
0928 14:52:09.570139 (+ 308us) negotiation.cc:107] Waiting for socket to connect
0928 14:52:09.570162 (+ 23us) client_negotiation.cc:174] Beginning negotiation
0928 14:52:09.570338 (+ 176us) client_negotiation.cc:252] Sending NEGOTIATE NegotiatePB request
0928 14:52:09.871577 (+301239us) negotiation.cc:327] Negotiation complete: Network error: Client connection negotiation failed: client connection to 0.0.0.0:39697: BlockingRecv error: recv error from unknown peer: Transport endpoint is not connected (error 107)
Metrics: {"client-negotiator.queue_time_us":106}
[ OK ] Parameters/TestRpcSocketTxRxQueue.OverCapacity/0 (1088 ms)
[----------] 1 test from Parameters/TestRpcSocketTxRxQueue (1088 ms total)
[----------] Global test environment tear-down
[==========] 21 tests from 2 test suites ran. (62729 ms total)
[ PASSED ] 20 tests.
[ FAILED ] 1 test, listed below:
[ FAILED ] Parameters/TestRpc.TestCallWithChainCertAndChainCA/SSL_TCP, where GetParam() = (true, false)
1 FAILED TEST