Diagnosed failure
Parameters/TestRpc.TestCallWithChainCertAndChainCA/SSL_UnixSocket: /data0/somelongdirectorytoavoidrpathissues/src/kudu/src/kudu/rpc/rpc-test.cc:270: Failure
Failed
Bad status: Runtime error: could not verify certificate chain (error with cert: subject=CN = localhost, ST = sadfjas, C = AS, emailAddress = sdflkdsajf, O = lskdfjlsad, OU = sldfkja, issuer=C = AS, ST = ASDfkjdhf, L = lskdjf, O = saldfja, OU = skdjf, CN = localhost, emailAddress = sadjflkadsj): : certificate has expired
Google Test trace:
/data0/somelongdirectorytoavoidrpathissues/src/kudu/src/kudu/rpc/rpc-test.cc:267: Connecting to unix:/tmp/dist-test-taskIDaoPx/test-tmp/rpc-test-778892dedcc14bdfa311433cb397049f.sock
I20260929 20:19:21.151547 5965 test_util.cc:175] -----------------------------------------------
I20260929 20:19:21.151654 5965 test_util.cc:176] Had fatal failures, leaving test files at /tmp/dist-test-taskIDaoPx/test-tmp/rpc-test.6.Parameters_TestRpc.TestCallWithChainCertAndChainCA_SSL_UnixSocket.1790713161031454-5965-0
Full log
Note: This is test shard 7 of 8.
[==========] Running 21 tests from 2 test suites.
[----------] Global test environment set-up.
[----------] 20 tests from Parameters/TestRpc
[ RUN ] Parameters/TestRpc.TestMessengerCreateDestroy/SSL_UnixSocket
WARNING: Logging before InitGoogleLogging() is written to STDERR
I20260929 20:19:21.081797 5965 rpc-test.cc:169] started messenger TestCreateDestroy
[ OK ] Parameters/TestRpc.TestMessengerCreateDestroy/SSL_UnixSocket (31 ms)
[ RUN ] Parameters/TestRpc.TestNegotiationDeadlock/SSL_UnixSocket
I20260929 20:19:21.099627 5985 acceptor_pool.cc:254] collecting diagnostics on the listening RPC socket unix:/tmp/dist-test-taskIDaoPx/test-tmp/rpc-test-8823b86fa7a94171973717f151184258.sock every 8 connection(s)
I20260929 20:19:21.099895 5986 acceptor_pool.cc:254] collecting diagnostics on the listening RPC socket unix:/tmp/dist-test-taskIDaoPx/test-tmp/rpc-test-8823b86fa7a94171973717f151184258.sock every 8 connection(s)
[ OK ] Parameters/TestRpc.TestNegotiationDeadlock/SSL_UnixSocket (34 ms)
[ RUN ] Parameters/TestRpc.TestCallWithChainCertAndChainCA/SSL_UnixSocket
I20260929 20:19:21.139618 6001 acceptor_pool.cc:254] collecting diagnostics on the listening RPC socket unix:/tmp/dist-test-taskIDaoPx/test-tmp/rpc-test-778892dedcc14bdfa311433cb397049f.sock every 8 connection(s)
I20260929 20:19:21.139955 6002 acceptor_pool.cc:254] collecting diagnostics on the listening RPC socket unix:/tmp/dist-test-taskIDaoPx/test-tmp/rpc-test-778892dedcc14bdfa311433cb397049f.sock every 8 connection(s)
/data0/somelongdirectorytoavoidrpathissues/src/kudu/src/kudu/rpc/rpc-test.cc:270: Failure
Failed
Bad status: Runtime error: could not verify certificate chain (error with cert: subject=CN = localhost, ST = sadfjas, C = AS, emailAddress = sdflkdsajf, O = lskdfjlsad, OU = sldfkja, issuer=C = AS, ST = ASDfkjdhf, L = lskdjf, O = saldfja, OU = skdjf, CN = localhost, emailAddress = sadjflkadsj): : certificate has expired
Google Test trace:
/data0/somelongdirectorytoavoidrpathissues/src/kudu/src/kudu/rpc/rpc-test.cc:267: Connecting to unix:/tmp/dist-test-taskIDaoPx/test-tmp/rpc-test-778892dedcc14bdfa311433cb397049f.sock
I20260929 20:19:21.151547 5965 test_util.cc:175] -----------------------------------------------
I20260929 20:19:21.151654 5965 test_util.cc:176] Had fatal failures, leaving test files at /tmp/dist-test-taskIDaoPx/test-tmp/rpc-test.6.Parameters_TestRpc.TestCallWithChainCertAndChainCA_SSL_UnixSocket.1790713161031454-5965-0
[ FAILED ] Parameters/TestRpc.TestCallWithChainCertAndChainCA/SSL_UnixSocket, where GetParam() = (true, true) (31 ms)
[ RUN ] Parameters/TestRpc.TestCallWithPasswordProtectedKey/SSL_UnixSocket
I20260929 20:19:21.167920 6026 acceptor_pool.cc:254] collecting diagnostics on the listening RPC socket unix:/tmp/dist-test-taskIDaoPx/test-tmp/rpc-test-246fdf2b3de645518100facc859148ad.sock every 8 connection(s)
I20260929 20:19:21.168198 6027 acceptor_pool.cc:254] collecting diagnostics on the listening RPC socket unix:/tmp/dist-test-taskIDaoPx/test-tmp/rpc-test-246fdf2b3de645518100facc859148ad.sock every 8 connection(s)
[ OK ] Parameters/TestRpc.TestCallWithPasswordProtectedKey/SSL_UnixSocket (54 ms)
[ RUN ] Parameters/TestRpc.TestCallToBadServer/SSL_UnixSocket
I20260929 20:19:21.227653 5965 rpc-test.cc:394] Status: Network error: Client connection negotiation failed: client connection to 0.0.0.0:0: connect: Connection refused (error 111)
I20260929 20:19:21.228423 5965 rpc-test.cc:394] Status: Network error: Client connection negotiation failed: client connection to 0.0.0.0:0: connect: Connection refused (error 111)
I20260929 20:19:21.229164 5965 rpc-test.cc:394] Status: Network error: Client connection negotiation failed: client connection to 0.0.0.0:0: connect: Connection refused (error 111)
I20260929 20:19:21.229931 5965 rpc-test.cc:394] Status: Network error: Client connection negotiation failed: client connection to 0.0.0.0:0: connect: Connection refused (error 111)
I20260929 20:19:21.230621 5965 rpc-test.cc:394] Status: Network error: Client connection negotiation failed: client connection to 0.0.0.0:0: connect: Connection refused (error 111)
[ OK ] Parameters/TestRpc.TestCallToBadServer/SSL_UnixSocket (26 ms)
[ RUN ] Parameters/TestRpc.TestWrongService/SSL_UnixSocket
I20260929 20:19:21.245054 6061 acceptor_pool.cc:254] collecting diagnostics on the listening RPC socket unix:/tmp/dist-test-taskIDaoPx/test-tmp/rpc-test-1a84641ad16c4a2e9174c7a91131beb8.sock every 8 connection(s)
I20260929 20:19:21.245318 6062 acceptor_pool.cc:254] collecting diagnostics on the listening RPC socket unix:/tmp/dist-test-taskIDaoPx/test-tmp/rpc-test-1a84641ad16c4a2e9174c7a91131beb8.sock every 8 connection(s)
I20260929 20:19:21.273758 6058 messenger.cc:345] service WrongServiceName not registered on TestServer
[ OK ] Parameters/TestRpc.TestWrongService/SSL_UnixSocket (46 ms)
[ RUN ] Parameters/TestRpc.TestConnectionKeepalive/SSL_UnixSocket
I20260929 20:19:21.301865 6084 acceptor_pool.cc:254] collecting diagnostics on the listening RPC socket unix:/tmp/dist-test-taskIDaoPx/test-tmp/rpc-test-d28504c05ced4a168d001de5dedc2165.sock every 8 connection(s)
I20260929 20:19:21.302104 6085 acceptor_pool.cc:254] collecting diagnostics on the listening RPC socket unix:/tmp/dist-test-taskIDaoPx/test-tmp/rpc-test-d28504c05ced4a168d001de5dedc2165.sock every 8 connection(s)
I20260929 20:19:21.303012 5965 rpc-test.cc:488] Connecting to unix:/tmp/dist-test-taskIDaoPx/test-tmp/rpc-test-d28504c05ced4a168d001de5dedc2165.sock
W20260929 20:19:21.782042 6097 connection.cc:196] Error closing socket: Network error: TlsSocket::Close: Broken pipe
[ OK ] Parameters/TestRpc.TestConnectionKeepalive/SSL_UnixSocket (1060 ms)
[ RUN ] Parameters/TestRpc.TestClientConnectionMetrics/SSL_UnixSocket
I20260929 20:19:22.357273 6109 acceptor_pool.cc:254] collecting diagnostics on the listening RPC socket unix:/tmp/dist-test-taskIDaoPx/test-tmp/rpc-test-39ea7a8550464d1690dc78289bec0ff1.sock every 8 connection(s)
I20260929 20:19:22.357544 6110 acceptor_pool.cc:254] collecting diagnostics on the listening RPC socket unix:/tmp/dist-test-taskIDaoPx/test-tmp/rpc-test-39ea7a8550464d1690dc78289bec0ff1.sock every 8 connection(s)
I20260929 20:19:22.358496 5965 rpc-test.cc:569] Connecting to unix:/tmp/dist-test-taskIDaoPx/test-tmp/rpc-test-39ea7a8550464d1690dc78289bec0ff1.sock
W20260929 20:19:43.958204 6106 connection.cc:196] Error closing socket: Network error: TlsSocket::Close: Broken pipe
[ OK ] Parameters/TestRpc.TestClientConnectionMetrics/SSL_UnixSocket (21626 ms)
[ RUN ] Parameters/TestRpc.TestCredentialsPolicy/SSL_UnixSocket
I20260929 20:19:43.983417 6132 acceptor_pool.cc:254] collecting diagnostics on the listening RPC socket unix:/tmp/dist-test-taskIDaoPx/test-tmp/rpc-test-4463f236a0494c48bed2fda15799446e.sock every 8 connection(s)
I20260929 20:19:43.983646 6133 acceptor_pool.cc:254] collecting diagnostics on the listening RPC socket unix:/tmp/dist-test-taskIDaoPx/test-tmp/rpc-test-4463f236a0494c48bed2fda15799446e.sock every 8 connection(s)
I20260929 20:19:43.984665 5965 rpc-test.cc:700] Connecting to unix:/tmp/dist-test-taskIDaoPx/test-tmp/rpc-test-4463f236a0494c48bed2fda15799446e.sock
W20260929 20:19:44.032099 6131 connection.cc:196] Error closing socket: Network error: TlsSocket::Close: Broken pipe
[ OK ] Parameters/TestRpc.TestCredentialsPolicy/SSL_UnixSocket (77 ms)
[ RUN ] Parameters/TestRpc.TestCallLongerThanKeepalive/SSL_UnixSocket
I20260929 20:19:44.057924 6157 acceptor_pool.cc:254] collecting diagnostics on the listening RPC socket unix:/tmp/dist-test-taskIDaoPx/test-tmp/rpc-test-2cf4c686bf5440189dee716e8866b61d.sock every 8 connection(s)
I20260929 20:19:44.058138 6158 acceptor_pool.cc:254] collecting diagnostics on the listening RPC socket unix:/tmp/dist-test-taskIDaoPx/test-tmp/rpc-test-2cf4c686bf5440189dee716e8866b61d.sock every 8 connection(s)
I20260929 20:19:44.079860 6161 rpc-test-base.h:222] got call: sleep_micros: 3000000 deferred: true
I20260929 20:19:47.081645 6161 rpcz_store.cc:275] Call kudu.rpc.GenericCalculatorService.Sleep from unix:<unnamed> (request call id 0) took 3001 ms. Trace:
I20260929 20:19:47.081789 6161 rpcz_store.cc:276] 0929 20:19:44.079733 (+ 0us) service_pool.cc:170] Inserting onto call queue
0929 20:19:44.079803 (+ 70us) service_pool.cc:227] Handling call
0929 20:19:47.081593 (+3001790us) inbound_call.cc:173] Queueing success response
Metrics: {}
[ OK ] Parameters/TestRpc.TestCallLongerThanKeepalive/SSL_UnixSocket (3045 ms)
[ RUN ] Parameters/TestRpc.TestRpcSidecar/SSL_UnixSocket
I20260929 20:19:47.108141 6182 acceptor_pool.cc:254] collecting diagnostics on the listening RPC socket unix:/tmp/dist-test-taskIDaoPx/test-tmp/rpc-test-fdb70a858e0b49529d803d4ce6c99991.sock every 8 connection(s)
I20260929 20:19:47.108385 6183 acceptor_pool.cc:254] collecting diagnostics on the listening RPC socket unix:/tmp/dist-test-taskIDaoPx/test-tmp/rpc-test-fdb70a858e0b49529d803d4ce6c99991.sock every 8 connection(s)
W20260929 20:19:47.204871 6179 connection.cc:196] Error closing socket: Network error: TlsSocket::Close: Broken pipe
[ OK ] Parameters/TestRpc.TestRpcSidecar/SSL_UnixSocket (120 ms)
[ RUN ] Parameters/TestRpc.TestRpcSidecarLimits/SSL_UnixSocket
I20260929 20:19:49.548462 6207 acceptor_pool.cc:254] collecting diagnostics on the listening RPC socket unix:/tmp/dist-test-taskIDaoPx/test-tmp/rpc-test-1c0479f518e248ecbc6f4032a1dda491.sock every 8 connection(s)
I20260929 20:19:49.548784 6208 acceptor_pool.cc:254] collecting diagnostics on the listening RPC socket unix:/tmp/dist-test-taskIDaoPx/test-tmp/rpc-test-1c0479f518e248ecbc6f4032a1dda491.sock every 8 connection(s)
W20260929 20:19:49.572048 5965 serialization.cc:72] Serialized kudu.rpc_test.PushStringsRequestPB (2147483654 bytes) is larger than the maximum configured RPC message size (52428800 bytes). Sending anyway, but peer may reject the data.
W20260929 20:19:49.578223 6204 connection.cc:535] server connection from unix:<unnamed> recv error: Network error: RPC frame had a length of 2147483714, but we only support messages up to 52428800 bytes long.
W20260929 20:19:49.578385 6204 connection.cc:158] shutting down server connection from unix:<unnamed> with pending inbound data: 4/2147483714 bytes received; last active 0 ns ago: status Network error: RPC frame had a length of 2147483714, but we only support messages up to 52428800 bytes long.
W20260929 20:19:49.578900 6220 connection.cc:196] Error closing socket: Network error: TlsSocket::Close: Broken pipe
I20260929 20:19:49.597373 6232 acceptor_pool.cc:254] collecting diagnostics on the listening RPC socket unix:/tmp/dist-test-taskIDaoPx/test-tmp/rpc-test-1c0479f518e248ecbc6f4032a1dda491.sock every 8 connection(s)
I20260929 20:19:49.597527 6233 acceptor_pool.cc:254] collecting diagnostics on the listening RPC socket unix:/tmp/dist-test-taskIDaoPx/test-tmp/rpc-test-1c0479f518e248ecbc6f4032a1dda491.sock every 8 connection(s)
W20260929 20:19:55.854951 6229 connection.cc:577] server connection from unix:<unnamed>: received bad data: 'Corruption: Invalid packet: message had a length of 2147483710, but we only support messages up to 2147483647 bytes
'
W20260929 20:19:55.855685 6245 connection.cc:196] Error closing socket: Network error: TlsSocket::Close: Broken pipe
[ OK ] Parameters/TestRpc.TestRpcSidecarLimits/SSL_UnixSocket (9126 ms)
[ RUN ] Parameters/TestRpc.TestCallTimeoutDoesntAffectNegotiation/SSL_UnixSocket
I20260929 20:19:56.353365 6257 acceptor_pool.cc:254] collecting diagnostics on the listening RPC socket unix:/tmp/dist-test-taskIDaoPx/test-tmp/rpc-test-b0fd5a0004d1468ca58a18df58a4222a.sock every 8 connection(s)
I20260929 20:19:56.353663 6258 acceptor_pool.cc:254] collecting diagnostics on the listening RPC socket unix:/tmp/dist-test-taskIDaoPx/test-tmp/rpc-test-b0fd5a0004d1468ca58a18df58a4222a.sock every 8 connection(s)
W20260929 20:19:56.370699 6253 negotiation.cc:266] Injecting 500ms delay in negotiation
I20260929 20:19:56.421134 5965 rpc-test-base.h:595] status: Timed out: connection negotiation to unix:/tmp/dist-test-taskIDaoPx/test-tmp/rpc-test-b0fd5a0004d1468ca58a18df58a4222a.sock for RPC Sleep timed out after 0.050s (ON_OUTBOUND_QUEUE), seconds elapsed: 0.0510425
[ OK ] Parameters/TestRpc.TestCallTimeoutDoesntAffectNegotiation/SSL_UnixSocket (546 ms)
[ RUN ] Parameters/TestRpc.TestRpcHandlerLatencyMetric/SSL_UnixSocket
I20260929 20:19:56.911821 6282 acceptor_pool.cc:254] collecting diagnostics on the listening RPC socket unix:/tmp/dist-test-taskIDaoPx/test-tmp/rpc-test-0f8b5c40224242478bc047f0ffcd58fb.sock every 8 connection(s)
I20260929 20:19:56.912091 6283 acceptor_pool.cc:254] collecting diagnostics on the listening RPC socket unix:/tmp/dist-test-taskIDaoPx/test-tmp/rpc-test-0f8b5c40224242478bc047f0ffcd58fb.sock every 8 connection(s)
I20260929 20:19:56.982403 5965 rpc-test.cc:1236] Sleep() min lat: 20678
I20260929 20:19:56.982510 5965 rpc-test.cc:1237] Sleep() mean lat: 20678
I20260929 20:19:56.982553 5965 rpc-test.cc:1238] Sleep() max lat: 20678
I20260929 20:19:56.982573 5965 rpc-test.cc:1239] Sleep() #calls: 1
[ OK ] Parameters/TestRpc.TestRpcHandlerLatencyMetric/SSL_UnixSocket (105 ms)
[ RUN ] Parameters/TestRpc.TimedOutOnResponseMetricServiceQueue/SSL_UnixSocket
I20260929 20:19:57.006124 6308 acceptor_pool.cc:254] collecting diagnostics on the listening RPC socket unix:/tmp/dist-test-taskIDaoPx/test-tmp/rpc-test-7e082f98fd6e49c2b8763e6bd3b5eab2.sock every 8 connection(s)
I20260929 20:19:57.006347 6309 acceptor_pool.cc:254] collecting diagnostics on the listening RPC socket unix:/tmp/dist-test-taskIDaoPx/test-tmp/rpc-test-7e082f98fd6e49c2b8763e6bd3b5eab2.sock every 8 connection(s)
W20260929 20:19:57.064210 6310 rpcz_store.cc:267] Call kudu.rpc_test.CalculatorService.Sleep from unix:<unnamed> (request call id 2) took 20 ms (client timeout 20 ms). Trace:
W20260929 20:19:57.064397 6310 rpcz_store.cc:269] 0929 20:19:57.043587 (+ 0us) service_pool.cc:170] Inserting onto call queue
0929 20:19:57.064106 (+ 20519us) service_pool.cc:214] Skipping call since client already timed out
0929 20:19:57.064160 (+ 54us) inbound_call.cc:173] Queueing failure response
Metrics: {}
[ OK ] Parameters/TestRpc.TimedOutOnResponseMetricServiceQueue/SSL_UnixSocket (81 ms)
[ RUN ] Parameters/TestRpc.RpcPendingConnectionsMetric/SSL_UnixSocket
I20260929 20:19:57.074174 6331 acceptor_pool.cc:254] collecting diagnostics on the listening RPC socket 0.0.0.0:40511 every 8 connection(s)
I20260929 20:19:57.074393 6332 acceptor_pool.cc:254] collecting diagnostics on the listening RPC socket 0.0.0.0:40511 every 8 connection(s)
W20260929 20:19:57.076414 6327 negotiation.cc:337] Failed RPC negotiation. Trace:
0929 20:19:57.075792 (+ 0us) reactor.cc:625] Submitting negotiation task for server connection from 127.0.0.1:51552 (local address 127.0.0.1:40511)
0929 20:19:57.075970 (+ 178us) server_negotiation.cc:206] Beginning negotiation
0929 20:19:57.075973 (+ 3us) server_negotiation.cc:399] Waiting for connection header
0929 20:19:57.076113 (+ 140us) negotiation.cc:327] Negotiation complete: Network error: Server connection negotiation failed: server connection from 127.0.0.1:51552: BlockingRecv error: recv got EOF from 127.0.0.1:51552 (error 108)
Metrics: {"server-negotiator.queue_time_us":56}
[ OK ] Parameters/TestRpc.RpcPendingConnectionsMetric/SSL_UnixSocket (20 ms)
[ RUN ] Parameters/TestRpc.TestRpcContextClientDeadline/SSL_UnixSocket
I20260929 20:19:57.110430 6347 acceptor_pool.cc:254] collecting diagnostics on the listening RPC socket unix:/tmp/dist-test-taskIDaoPx/test-tmp/rpc-test-165dee2d27b94560bc779fe2b7391c0b.sock every 8 connection(s)
I20260929 20:19:57.110656 6348 acceptor_pool.cc:254] collecting diagnostics on the listening RPC socket unix:/tmp/dist-test-taskIDaoPx/test-tmp/rpc-test-165dee2d27b94560bc779fe2b7391c0b.sock every 8 connection(s)
[ OK ] Parameters/TestRpc.TestRpcContextClientDeadline/SSL_UnixSocket (101 ms)
[ RUN ] Parameters/TestRpc.TestApplicationFeatureFlagUnsupportedServer/SSL_UnixSocket
I20260929 20:19:57.215142 6372 acceptor_pool.cc:254] collecting diagnostics on the listening RPC socket unix:/tmp/dist-test-taskIDaoPx/test-tmp/rpc-test-d9bf4f2d98f24e5ca4aa37a9ab6ac985.sock every 8 connection(s)
I20260929 20:19:57.215368 6373 acceptor_pool.cc:254] collecting diagnostics on the listening RPC socket unix:/tmp/dist-test-taskIDaoPx/test-tmp/rpc-test-d9bf4f2d98f24e5ca4aa37a9ab6ac985.sock every 8 connection(s)
[ OK ] Parameters/TestRpc.TestApplicationFeatureFlagUnsupportedServer/SSL_UnixSocket (52 ms)
[ RUN ] Parameters/TestRpc.TestCancellationAsync/SSL_UnixSocket
I20260929 20:19:57.267480 6397 acceptor_pool.cc:254] collecting diagnostics on the listening RPC socket unix:/tmp/dist-test-taskIDaoPx/test-tmp/rpc-test-e2f1e51f4b7446f987efb50ae27c3086.sock every 8 connection(s)
I20260929 20:19:57.267745 6398 acceptor_pool.cc:254] collecting diagnostics on the listening RPC socket unix:/tmp/dist-test-taskIDaoPx/test-tmp/rpc-test-e2f1e51f4b7446f987efb50ae27c3086.sock every 8 connection(s)
I20260929 20:19:57.268704 5965 rpc-test.cc:1716] Connecting to unix:/tmp/dist-test-taskIDaoPx/test-tmp/rpc-test-e2f1e51f4b7446f987efb50ae27c3086.sock
I20260929 20:19:57.278144 5965 test_util.cc:268] Using random seed: -402345042
I20260929 20:19:57.313771 6401 rpc-test-base.h:240] got call: sleep_micros: 500 pattern: 4294967295 num_repetitions: 2097152 sidecar_idx: 0
I20260929 20:19:57.343303 6400 rpc-test-base.h:240] got call: sleep_micros: 500 pattern: 4294967295 num_repetitions: 2097152 sidecar_idx: 0
I20260929 20:19:57.377277 6401 rpc-test-base.h:240] got call: sleep_micros: 500 pattern: 4294967295 num_repetitions: 2097152 sidecar_idx: 0
I20260929 20:19:57.409965 6400 rpc-test-base.h:240] got call: sleep_micros: 500 pattern: 4294967295 num_repetitions: 2097152 sidecar_idx: 0
I20260929 20:19:57.444554 6401 rpc-test-base.h:240] got call: sleep_micros: 500 pattern: 4294967295 num_repetitions: 2097152 sidecar_idx: 0
I20260929 20:19:57.481402 6400 rpc-test-base.h:240] got call: sleep_micros: 500 pattern: 4294967295 num_repetitions: 2097152 sidecar_idx: 0
I20260929 20:19:57.519086 6400 rpc-test-base.h:240] got call: sleep_micros: 500 pattern: 4294967295 num_repetitions: 2097152 sidecar_idx: 0
W20260929 20:19:57.521147 6394 connection.cc:196] Error closing socket: Network error: TlsSocket::Close: Broken pipe
W20260929 20:19:57.552441 6394 connection.cc:441] server connection from unix:<unnamed> torn down before Call kudu.rpc.GenericCalculatorService.SleepWithSidecar from unix:<unnamed> (request call id 9) could send its response
[ OK ] Parameters/TestRpc.TestCancellationAsync/SSL_UnixSocket (312 ms)
[ RUN ] Parameters/TestRpc.TestPerformanceBySocketType/SSL_UnixSocket
I20260929 20:19:57.575469 6422 acceptor_pool.cc:254] collecting diagnostics on the listening RPC socket unix:/tmp/dist-test-taskIDaoPx/test-tmp/rpc-test-bddff9c493484dc3afb15407e25be853.sock every 8 connection(s)
I20260929 20:19:57.575701 6423 acceptor_pool.cc:254] collecting diagnostics on the listening RPC socket unix:/tmp/dist-test-taskIDaoPx/test-tmp/rpc-test-bddff9c493484dc3afb15407e25be853.sock every 8 connection(s)
I20260929 20:19:57.576586 5965 rpc-test.cc:1846] Connecting to unix:/tmp/dist-test-taskIDaoPx/test-tmp/rpc-test-bddff9c493484dc3afb15407e25be853.sock
I20260929 20:20:00.801945 5965 rpc-test.cc:1859] Sending 1024MB via ssl-enabled unix socket: real 3.216s user 3.142s sys 2.290s
I20260929 20:20:04.067047 5965 rpc-test.cc:1859] Sending 1024MB via ssl-enabled unix socket: real 3.265s user 3.186s sys 2.304s
I20260929 20:20:07.176381 5965 rpc-test.cc:1859] Sending 1024MB via ssl-enabled unix socket: real 3.109s user 3.020s sys 2.196s
I20260929 20:20:10.467154 5965 rpc-test.cc:1859] Sending 1024MB via ssl-enabled unix socket: real 3.291s user 3.217s sys 2.345s
I20260929 20:20:13.684789 5965 rpc-test.cc:1859] Sending 1024MB via ssl-enabled unix socket: real 3.217s user 3.159s sys 2.269s
[ OK ] Parameters/TestRpc.TestPerformanceBySocketType/SSL_UnixSocket (16139 ms)
[----------] 20 tests from Parameters/TestRpc (52641 ms total)
[----------] 1 test from Parameters/TestRpcSocketTxRxQueue
[ RUN ] Parameters/TestRpcSocketTxRxQueue.AcceptorRxQueueSizeMetric/0
I20260929 20:20:13.700287 6447 acceptor_pool.cc:254] collecting diagnostics on the listening RPC socket 0.0.0.0:46293 every 1 connection(s)
I20260929 20:20:13.700507 6448 acceptor_pool.cc:254] collecting diagnostics on the listening RPC socket 0.0.0.0:46293 every 1 connection(s)
W20260929 20:20:13.702301 6443 negotiation.cc:337] Failed RPC negotiation. Trace:
0929 20:20:13.701898 (+ 0us) reactor.cc:625] Submitting negotiation task for server connection from 127.0.0.1:57956 (local address 127.0.0.1:46293)
0929 20:20:13.702053 (+ 155us) server_negotiation.cc:206] Beginning negotiation
0929 20:20:13.702057 (+ 4us) server_negotiation.cc:399] Waiting for connection header
0929 20:20:13.702172 (+ 115us) negotiation.cc:327] Negotiation complete: Network error: Server connection negotiation failed: server connection from 127.0.0.1:57956: BlockingRecv error: recv got EOF from 127.0.0.1:57956 (error 108)
Metrics: {"server-negotiator.queue_time_us":57}
[ OK ] Parameters/TestRpcSocketTxRxQueue.AcceptorRxQueueSizeMetric/0 (10 ms)
[----------] 1 test from Parameters/TestRpcSocketTxRxQueue (11 ms total)
[----------] Global test environment tear-down
[==========] 21 tests from 2 test suites ran. (52652 ms total)
[ PASSED ] 20 tests.
[ FAILED ] 1 test, listed below:
[ FAILED ] Parameters/TestRpc.TestCallWithChainCertAndChainCA/SSL_UnixSocket, where GetParam() = (true, true)
1 FAILED TEST