Diagnosed failure

Parameters/TestRpc.TestCallWithChainCertAndChainCA/SSL_TCP: /data0/somelongdirectorytoavoidrpathissues/src/kudu/src/kudu/rpc/rpc-test.cc:270: Failure
Failed
Bad status: Runtime error: could not verify certificate chain (error with cert: subject=CN = localhost, ST = sadfjas, C = AS, emailAddress = sdflkdsajf, O = lskdfjlsad, OU = sldfkja, issuer=C = AS, ST = ASDfkjdhf, L = lskdjf, O = saldfja, OU = skdjf, CN = localhost, emailAddress = sadjflkadsj): : certificate has expired
Google Test trace:
/data0/somelongdirectorytoavoidrpathissues/src/kudu/src/kudu/rpc/rpc-test.cc:267: Connecting to 0.0.0.0:35091
I20260927 03:54:16.013780  9061 test_util.cc:175] -----------------------------------------------
I20260927 03:54:16.013851  9061 test_util.cc:176] Had fatal failures, leaving test files at /tmp/dist-test-task3WKG9c/test-tmp/rpc-test.5.Parameters_TestRpc.TestCallWithChainCertAndChainCA_SSL_TCP.1790481255970093-9061-0

Full log

Note: This is test shard 6 of 8.
[==========] Running 21 tests from 2 test suites.
[----------] Global test environment set-up.
[----------] 20 tests from Parameters/TestRpc
[ RUN      ] Parameters/TestRpc.TestMessengerCreateDestroy/SSL_TCP
WARNING: Logging before InitGoogleLogging() is written to STDERR
I20260927 03:54:15.988314  9061 rpc-test.cc:169] started messenger TestCreateDestroy
[       OK ] Parameters/TestRpc.TestMessengerCreateDestroy/SSL_TCP (16 ms)
[ RUN      ] Parameters/TestRpc.TestNegotiationDeadlock/SSL_TCP
I20260927 03:54:15.994153  9081 acceptor_pool.cc:254] collecting diagnostics on the listening RPC socket 0.0.0.0:33947 every 8 connection(s)
I20260927 03:54:15.994179  9082 acceptor_pool.cc:254] collecting diagnostics on the listening RPC socket 0.0.0.0:33947 every 8 connection(s)
[       OK ] Parameters/TestRpc.TestNegotiationDeadlock/SSL_TCP (11 ms)
[ RUN      ] Parameters/TestRpc.TestCallWithChainCertAndChainCA/SSL_TCP
I20260927 03:54:16.009958  9097 acceptor_pool.cc:254] collecting diagnostics on the listening RPC socket 0.0.0.0:35091 every 8 connection(s)
I20260927 03:54:16.009987  9098 acceptor_pool.cc:254] collecting diagnostics on the listening RPC socket 0.0.0.0:35091 every 8 connection(s)
/data0/somelongdirectorytoavoidrpathissues/src/kudu/src/kudu/rpc/rpc-test.cc:270: Failure
Failed
Bad status: Runtime error: could not verify certificate chain (error with cert: subject=CN = localhost, ST = sadfjas, C = AS, emailAddress = sdflkdsajf, O = lskdfjlsad, OU = sldfkja, issuer=C = AS, ST = ASDfkjdhf, L = lskdjf, O = saldfja, OU = skdjf, CN = localhost, emailAddress = sadjflkadsj): : certificate has expired
Google Test trace:
/data0/somelongdirectorytoavoidrpathissues/src/kudu/src/kudu/rpc/rpc-test.cc:267: Connecting to 0.0.0.0:35091
I20260927 03:54:16.013780  9061 test_util.cc:175] -----------------------------------------------
I20260927 03:54:16.013851  9061 test_util.cc:176] Had fatal failures, leaving test files at /tmp/dist-test-task3WKG9c/test-tmp/rpc-test.5.Parameters_TestRpc.TestCallWithChainCertAndChainCA_SSL_TCP.1790481255970093-9061-0
[  FAILED  ] Parameters/TestRpc.TestCallWithChainCertAndChainCA/SSL_TCP, where GetParam() = (true, false) (12 ms)
[ RUN      ] Parameters/TestRpc.TestCallWithPasswordProtectedKey/SSL_TCP
I20260927 03:54:16.025784  9122 acceptor_pool.cc:254] collecting diagnostics on the listening RPC socket 0.0.0.0:38445 every 8 connection(s)
I20260927 03:54:16.025831  9123 acceptor_pool.cc:254] collecting diagnostics on the listening RPC socket 0.0.0.0:38445 every 8 connection(s)
[       OK ] Parameters/TestRpc.TestCallWithPasswordProtectedKey/SSL_TCP (24 ms)
[ RUN      ] Parameters/TestRpc.TestCallToBadServer/SSL_TCP
I20260927 03:54:16.048588  9061 rpc-test.cc:394] Status: Network error: Client connection negotiation failed: client connection to 0.0.0.0:0: connect: Connection refused (error 111)
I20260927 03:54:16.048918  9061 rpc-test.cc:394] Status: Network error: Client connection negotiation failed: client connection to 0.0.0.0:0: connect: Connection refused (error 111)
I20260927 03:54:16.049126  9061 rpc-test.cc:394] Status: Network error: Client connection negotiation failed: client connection to 0.0.0.0:0: connect: Connection refused (error 111)
I20260927 03:54:16.049309  9061 rpc-test.cc:394] Status: Network error: Client connection negotiation failed: client connection to 0.0.0.0:0: connect: Connection refused (error 111)
I20260927 03:54:16.049489  9061 rpc-test.cc:394] Status: Network error: Client connection negotiation failed: client connection to 0.0.0.0:0: connect: Connection refused (error 111)
[       OK ] Parameters/TestRpc.TestCallToBadServer/SSL_TCP (11 ms)
[ RUN      ] Parameters/TestRpc.TestWrongService/SSL_TCP
I20260927 03:54:16.063472  9157 acceptor_pool.cc:254] collecting diagnostics on the listening RPC socket 0.0.0.0:38743 every 8 connection(s)
I20260927 03:54:16.063509  9158 acceptor_pool.cc:254] collecting diagnostics on the listening RPC socket 0.0.0.0:38743 every 8 connection(s)
I20260927 03:54:16.091533  9154 messenger.cc:345] service WrongServiceName not registered on TestServer
[       OK ] Parameters/TestRpc.TestWrongService/SSL_TCP (43 ms)
[ RUN      ] Parameters/TestRpc.TestConnectionKeepalive/SSL_TCP
I20260927 03:54:16.111732  9180 acceptor_pool.cc:254] collecting diagnostics on the listening RPC socket 0.0.0.0:34731 every 8 connection(s)
I20260927 03:54:16.111773  9181 acceptor_pool.cc:254] collecting diagnostics on the listening RPC socket 0.0.0.0:34731 every 8 connection(s)
I20260927 03:54:16.111951  9061 rpc-test.cc:488] Connecting to 0.0.0.0:34731
[       OK ] Parameters/TestRpc.TestConnectionKeepalive/SSL_TCP (1047 ms)
[ RUN      ] Parameters/TestRpc.TestClientConnectionMetrics/SSL_TCP
I20260927 03:54:17.159694  9205 acceptor_pool.cc:254] collecting diagnostics on the listening RPC socket 0.0.0.0:34559 every 8 connection(s)
I20260927 03:54:17.159719  9206 acceptor_pool.cc:254] collecting diagnostics on the listening RPC socket 0.0.0.0:34559 every 8 connection(s)
I20260927 03:54:17.159875  9061 rpc-test.cc:569] Connecting to 0.0.0.0:34559
[       OK ] Parameters/TestRpc.TestClientConnectionMetrics/SSL_TCP (8650 ms)
[ RUN      ] Parameters/TestRpc.TestCredentialsPolicy/SSL_TCP
I20260927 03:54:25.802837  9228 acceptor_pool.cc:254] collecting diagnostics on the listening RPC socket 0.0.0.0:40815 every 8 connection(s)
I20260927 03:54:25.802953  9229 acceptor_pool.cc:254] collecting diagnostics on the listening RPC socket 0.0.0.0:40815 every 8 connection(s)
I20260927 03:54:25.803125  9061 rpc-test.cc:700] Connecting to 0.0.0.0:40815
[       OK ] Parameters/TestRpc.TestCredentialsPolicy/SSL_TCP (33 ms)
[ RUN      ] Parameters/TestRpc.TestCallLongerThanKeepalive/SSL_TCP
I20260927 03:54:25.837947  9253 acceptor_pool.cc:254] collecting diagnostics on the listening RPC socket 0.0.0.0:33047 every 8 connection(s)
I20260927 03:54:25.837996  9254 acceptor_pool.cc:254] collecting diagnostics on the listening RPC socket 0.0.0.0:33047 every 8 connection(s)
I20260927 03:54:25.847179  9257 rpc-test-base.h:222] got call: sleep_micros: 3000000 deferred: true
I20260927 03:54:28.847831  9257 rpcz_store.cc:275] Call kudu.rpc.GenericCalculatorService.Sleep from 127.0.0.1:52132 (request call id 0) took 3000 ms. Trace:
I20260927 03:54:28.847935  9257 rpcz_store.cc:276] 0927 03:54:25.847123 (+     0us) service_pool.cc:170] Inserting onto call queue
0927 03:54:25.847155 (+    32us) service_pool.cc:227] Handling call
0927 03:54:28.847814 (+3000659us) inbound_call.cc:173] Queueing success response
Metrics: {}
[       OK ] Parameters/TestRpc.TestCallLongerThanKeepalive/SSL_TCP (3024 ms)
[ RUN      ] Parameters/TestRpc.TestRpcSidecar/SSL_TCP
I20260927 03:54:28.868217  9278 acceptor_pool.cc:254] collecting diagnostics on the listening RPC socket 0.0.0.0:36021 every 8 connection(s)
I20260927 03:54:28.868248  9279 acceptor_pool.cc:254] collecting diagnostics on the listening RPC socket 0.0.0.0:36021 every 8 connection(s)
[       OK ] Parameters/TestRpc.TestRpcSidecar/SSL_TCP (64 ms)
[ RUN      ] Parameters/TestRpc.TestRpcSidecarLimits/SSL_TCP
I20260927 03:54:30.652237  9303 acceptor_pool.cc:254] collecting diagnostics on the listening RPC socket 0.0.0.0:37033 every 8 connection(s)
I20260927 03:54:30.652277  9304 acceptor_pool.cc:254] collecting diagnostics on the listening RPC socket 0.0.0.0:37033 every 8 connection(s)
W20260927 03:54:30.659029  9061 serialization.cc:72] Serialized kudu.rpc_test.PushStringsRequestPB (2147483654 bytes) is larger than the maximum configured RPC message size (52428800 bytes). Sending anyway, but peer may reject the data.
W20260927 03:54:30.662320  9300 connection.cc:535] server connection from 127.0.0.1:48524 recv error: Network error: RPC frame had a length of 2147483714, but we only support messages up to 52428800 bytes long.
W20260927 03:54:30.662405  9300 connection.cc:158] shutting down server connection from 127.0.0.1:48524 with pending inbound data: 4/2147483714 bytes received; last active 0 ns ago: status Network error: RPC frame had a length of 2147483714, but we only support messages up to 52428800 bytes long.
W20260927 03:54:30.662612  9316 connection.cc:196] Error closing socket: Network error: TlsSocket::Close: Connection reset by peer
I20260927 03:54:30.680893  9328 acceptor_pool.cc:254] collecting diagnostics on the listening RPC socket 0.0.0.0:40137 every 8 connection(s)
I20260927 03:54:30.680903  9329 acceptor_pool.cc:254] collecting diagnostics on the listening RPC socket 0.0.0.0:40137 every 8 connection(s)
W20260927 03:54:34.487107  9327 connection.cc:577] server connection from 127.0.0.1:39746: received bad data: 'Corruption: Invalid packet: message had a length of 2147483710, but we only support messages up to 2147483647 bytes
'
[       OK ] Parameters/TestRpc.TestRpcSidecarLimits/SSL_TCP (5574 ms)
[ RUN      ] Parameters/TestRpc.TestCallTimeoutDoesntAffectNegotiation/SSL_TCP
I20260927 03:54:34.521499  9353 acceptor_pool.cc:254] collecting diagnostics on the listening RPC socket 0.0.0.0:43233 every 8 connection(s)
I20260927 03:54:34.521555  9354 acceptor_pool.cc:254] collecting diagnostics on the listening RPC socket 0.0.0.0:43233 every 8 connection(s)
W20260927 03:54:34.532142  9349 negotiation.cc:266] Injecting 500ms delay in negotiation
I20260927 03:54:34.582399  9061 rpc-test-base.h:595] status: Timed out: connection negotiation to 0.0.0.0:43233 for RPC Sleep timed out after 0.050s (ON_OUTBOUND_QUEUE), seconds elapsed: 0.0506518
[       OK ] Parameters/TestRpc.TestCallTimeoutDoesntAffectNegotiation/SSL_TCP (547 ms)
[ RUN      ] Parameters/TestRpc.TestRpcHandlerLatencyMetric/SSL_TCP
I20260927 03:54:35.046964  9378 acceptor_pool.cc:254] collecting diagnostics on the listening RPC socket 0.0.0.0:38675 every 8 connection(s)
I20260927 03:54:35.046983  9379 acceptor_pool.cc:254] collecting diagnostics on the listening RPC socket 0.0.0.0:38675 every 8 connection(s)
I20260927 03:54:35.088240  9061 rpc-test.cc:1236] Sleep() min lat: 20259
I20260927 03:54:35.088307  9061 rpc-test.cc:1237] Sleep() mean lat: 20259
I20260927 03:54:35.088333  9061 rpc-test.cc:1238] Sleep() max lat: 20259
I20260927 03:54:35.088347  9061 rpc-test.cc:1239] Sleep() #calls: 1
[       OK ] Parameters/TestRpc.TestRpcHandlerLatencyMetric/SSL_TCP (52 ms)
[ RUN      ] Parameters/TestRpc.TimedOutOnResponseMetricServiceQueue/SSL_TCP
I20260927 03:54:35.111670  9404 acceptor_pool.cc:254] collecting diagnostics on the listening RPC socket 0.0.0.0:34673 every 8 connection(s)
I20260927 03:54:35.111692  9405 acceptor_pool.cc:254] collecting diagnostics on the listening RPC socket 0.0.0.0:34673 every 8 connection(s)
W20260927 03:54:35.171187  9406 rpcz_store.cc:267] Call kudu.rpc_test.CalculatorService.Sleep from 127.0.0.1:55118 (request call id 2) took 20 ms (client timeout 20 ms). Trace:
W20260927 03:54:35.171305  9406 rpcz_store.cc:269] 0927 03:54:35.150933 (+     0us) service_pool.cc:170] Inserting onto call queue
0927 03:54:35.171138 (+ 20205us) service_pool.cc:214] Skipping call since client already timed out
0927 03:54:35.171150 (+    12us) inbound_call.cc:173] Queueing failure response
Metrics: {}
[       OK ] Parameters/TestRpc.TimedOutOnResponseMetricServiceQueue/SSL_TCP (82 ms)
[ RUN      ] Parameters/TestRpc.RpcPendingConnectionsMetric/SSL_TCP
I20260927 03:54:35.174525  9427 acceptor_pool.cc:254] collecting diagnostics on the listening RPC socket 0.0.0.0:45161 every 8 connection(s)
I20260927 03:54:35.174592  9428 acceptor_pool.cc:254] collecting diagnostics on the listening RPC socket 0.0.0.0:45161 every 8 connection(s)
W20260927 03:54:35.175137  9423 negotiation.cc:337] Failed RPC negotiation. Trace:
0927 03:54:35.174977 (+     0us) reactor.cc:625] Submitting negotiation task for server connection from 127.0.0.1:41938 (local address 127.0.0.1:45161)
0927 03:54:35.175017 (+    40us) server_negotiation.cc:206] Beginning negotiation
0927 03:54:35.175019 (+     2us) server_negotiation.cc:399] Waiting for connection header
0927 03:54:35.175091 (+    72us) negotiation.cc:327] Negotiation complete: Network error: Server connection negotiation failed: server connection from 127.0.0.1:41938: BlockingRecv error: recv got EOF from 127.0.0.1:41938 (error 108)
Metrics: {"server-negotiator.queue_time_us":15}
[       OK ] Parameters/TestRpc.RpcPendingConnectionsMetric/SSL_TCP (13 ms)
[ RUN      ] Parameters/TestRpc.TestRpcContextClientDeadline/SSL_TCP
I20260927 03:54:35.193831  9444 acceptor_pool.cc:254] collecting diagnostics on the listening RPC socket 0.0.0.0:45897 every 8 connection(s)
I20260927 03:54:35.193887  9443 acceptor_pool.cc:254] collecting diagnostics on the listening RPC socket 0.0.0.0:45897 every 8 connection(s)
[       OK ] Parameters/TestRpc.TestRpcContextClientDeadline/SSL_TCP (40 ms)
[ RUN      ] Parameters/TestRpc.TestApplicationFeatureFlagUnsupportedServer/SSL_TCP
I20260927 03:54:35.239007  9469 acceptor_pool.cc:254] collecting diagnostics on the listening RPC socket 0.0.0.0:42429 every 8 connection(s)
I20260927 03:54:35.239046  9468 acceptor_pool.cc:254] collecting diagnostics on the listening RPC socket 0.0.0.0:42429 every 8 connection(s)
[       OK ] Parameters/TestRpc.TestApplicationFeatureFlagUnsupportedServer/SSL_TCP (26 ms)
[ RUN      ] Parameters/TestRpc.TestCancellationAsync/SSL_TCP
I20260927 03:54:35.267354  9494 acceptor_pool.cc:254] collecting diagnostics on the listening RPC socket 0.0.0.0:40707 every 8 connection(s)
I20260927 03:54:35.267514  9061 rpc-test.cc:1716] Connecting to 0.0.0.0:40707
I20260927 03:54:35.267403  9493 acceptor_pool.cc:254] collecting diagnostics on the listening RPC socket 0.0.0.0:40707 every 8 connection(s)
I20260927 03:54:35.279697  9061 test_util.cc:268] Using random seed: -396109491
I20260927 03:54:35.299211  9497 rpc-test-base.h:240] got call: sleep_micros: 500 pattern: 4294967295 num_repetitions: 2097152 sidecar_idx: 0
I20260927 03:54:35.315904  9497 rpc-test-base.h:240] got call: sleep_micros: 500 pattern: 4294967295 num_repetitions: 2097152 sidecar_idx: 0
I20260927 03:54:35.330184  9497 rpc-test-base.h:240] got call: sleep_micros: 500 pattern: 4294967295 num_repetitions: 2097152 sidecar_idx: 0
I20260927 03:54:35.341688  9497 rpc-test-base.h:240] got call: sleep_micros: 500 pattern: 4294967295 num_repetitions: 2097152 sidecar_idx: 0
I20260927 03:54:35.352710  9497 rpc-test-base.h:240] got call: sleep_micros: 500 pattern: 4294967295 num_repetitions: 2097152 sidecar_idx: 0
I20260927 03:54:35.364228  9497 rpc-test-base.h:240] got call: sleep_micros: 500 pattern: 4294967295 num_repetitions: 2097152 sidecar_idx: 0
I20260927 03:54:35.377451  9497 rpc-test-base.h:240] got call: sleep_micros: 500 pattern: 4294967295 num_repetitions: 2097152 sidecar_idx: 0
W20260927 03:54:35.380517  9492 connection.cc:441] server connection from 127.0.0.1:56746 torn down before Call kudu.rpc.GenericCalculatorService.SleepWithSidecar from 127.0.0.1:56746 (request call id 9) could send its response
[       OK ] Parameters/TestRpc.TestCancellationAsync/SSL_TCP (128 ms)
[ RUN      ] Parameters/TestRpc.TestPerformanceBySocketType/SSL_TCP
I20260927 03:54:35.412354  9518 acceptor_pool.cc:254] collecting diagnostics on the listening RPC socket 0.0.0.0:34389 every 8 connection(s)
I20260927 03:54:35.412401  9519 acceptor_pool.cc:254] collecting diagnostics on the listening RPC socket 0.0.0.0:34389 every 8 connection(s)
I20260927 03:54:35.412537  9061 rpc-test.cc:1846] Connecting to 0.0.0.0:34389
I20260927 03:54:37.005597  9061 rpc-test.cc:1859] Sending 1024MB via ssl-enabled tcp socket: real 1.585s	user 1.413s	sys 1.398s
I20260927 03:54:38.617722  9061 rpc-test.cc:1859] Sending 1024MB via ssl-enabled tcp socket: real 1.612s	user 1.411s	sys 1.471s
I20260927 03:54:40.316695  9061 rpc-test.cc:1859] Sending 1024MB via ssl-enabled tcp socket: real 1.699s	user 1.590s	sys 1.430s
I20260927 03:54:41.982878  9061 rpc-test.cc:1859] Sending 1024MB via ssl-enabled tcp socket: real 1.666s	user 1.532s	sys 1.438s
I20260927 03:54:43.554795  9061 rpc-test.cc:1859] Sending 1024MB via ssl-enabled tcp socket: real 1.572s	user 1.412s	sys 1.392s
[       OK ] Parameters/TestRpc.TestPerformanceBySocketType/SSL_TCP (8174 ms)
[----------] 20 tests from Parameters/TestRpc (27584 ms total)

[----------] 1 test from Parameters/TestRpcSocketTxRxQueue
[ RUN      ] Parameters/TestRpcSocketTxRxQueue.OverCapacity/0
W20260927 03:54:43.827792  9535 negotiation.cc:337] Failed RPC negotiation. Trace:
0927 03:54:43.563625 (+     0us) reactor.cc:625] Submitting negotiation task for client connection to 0.0.0.0:35847 (local address 127.0.0.1:49572)
0927 03:54:43.563667 (+    42us) negotiation.cc:107] Waiting for socket to connect
0927 03:54:43.563677 (+    10us) client_negotiation.cc:174] Beginning negotiation
0927 03:54:43.563728 (+    51us) client_negotiation.cc:252] Sending NEGOTIATE NegotiatePB request
0927 03:54:43.827648 (+263920us) negotiation.cc:327] Negotiation complete: Network error: Client connection negotiation failed: client connection to 0.0.0.0:35847: BlockingRecv error: recv error from unknown peer: Transport endpoint is not connected (error 107)
Metrics: {"client-negotiator.queue_time_us":16}
W20260927 03:54:43.827800  9544 negotiation.cc:337] Failed RPC negotiation. Trace:
0927 03:54:43.564501 (+     0us) reactor.cc:625] Submitting negotiation task for client connection to 0.0.0.0:35847 (local address 127.0.0.1:49578)
0927 03:54:43.564564 (+    63us) negotiation.cc:107] Waiting for socket to connect
0927 03:54:43.564574 (+    10us) client_negotiation.cc:174] Beginning negotiation
0927 03:54:43.564621 (+    47us) client_negotiation.cc:252] Sending NEGOTIATE NegotiatePB request
0927 03:54:43.827693 (+263072us) negotiation.cc:327] Negotiation complete: Network error: Client connection negotiation failed: client connection to 0.0.0.0:35847: BlockingRecv error: recv error from unknown peer: Transport endpoint is not connected (error 107)
Metrics: {"client-negotiator.queue_time_us":38}
W20260927 03:54:43.827879  9580 negotiation.cc:337] Failed RPC negotiation. Trace:
0927 03:54:43.568338 (+     0us) reactor.cc:625] Submitting negotiation task for client connection to 0.0.0.0:35847 (local address 127.0.0.1:49626)
0927 03:54:43.568391 (+    53us) negotiation.cc:107] Waiting for socket to connect
0927 03:54:43.568410 (+    19us) client_negotiation.cc:174] Beginning negotiation
0927 03:54:43.568454 (+    44us) client_negotiation.cc:252] Sending NEGOTIATE NegotiatePB request
0927 03:54:43.827833 (+259379us) negotiation.cc:327] Negotiation complete: Network error: Client connection negotiation failed: client connection to 0.0.0.0:35847: BlockingRecv error: recv error from unknown peer: Transport endpoint is not connected (error 107)
Metrics: {"client-negotiator.queue_time_us":33}
W20260927 03:54:43.828042  9562 negotiation.cc:337] Failed RPC negotiation. Trace:
0927 03:54:43.566447 (+     0us) reactor.cc:625] Submitting negotiation task for client connection to 0.0.0.0:35847 (local address 127.0.0.1:49598)
0927 03:54:43.566501 (+    54us) negotiation.cc:107] Waiting for socket to connect
0927 03:54:43.566510 (+     9us) client_negotiation.cc:174] Beginning negotiation
0927 03:54:43.566549 (+    39us) client_negotiation.cc:252] Sending NEGOTIATE NegotiatePB request
0927 03:54:43.827665 (+261116us) negotiation.cc:327] Negotiation complete: Network error: Client connection negotiation failed: client connection to 0.0.0.0:35847: BlockingRecv error: recv error from unknown peer: Transport endpoint is not connected (error 107)
Metrics: {"client-negotiator.queue_time_us":34}
W20260927 03:54:43.828097  9553 negotiation.cc:337] Failed RPC negotiation. Trace:
0927 03:54:43.565503 (+     0us) reactor.cc:625] Submitting negotiation task for client connection to 0.0.0.0:35847 (local address 127.0.0.1:49582)
0927 03:54:43.565558 (+    55us) negotiation.cc:107] Waiting for socket to connect
0927 03:54:43.565567 (+     9us) client_negotiation.cc:174] Beginning negotiation
0927 03:54:43.565608 (+    41us) client_negotiation.cc:252] Sending NEGOTIATE NegotiatePB request
0927 03:54:43.827693 (+262085us) negotiation.cc:327] Negotiation complete: Network error: Client connection negotiation failed: client connection to 0.0.0.0:35847: BlockingRecv error: recv error from unknown peer: Transport endpoint is not connected (error 107)
Metrics: {"client-negotiator.queue_time_us":35}
W20260927 03:54:43.827800  9571 negotiation.cc:337] Failed RPC negotiation. Trace:
0927 03:54:43.567419 (+     0us) reactor.cc:625] Submitting negotiation task for client connection to 0.0.0.0:35847 (local address 127.0.0.1:49612)
0927 03:54:43.567472 (+    53us) negotiation.cc:107] Waiting for socket to connect
0927 03:54:43.567481 (+     9us) client_negotiation.cc:174] Beginning negotiation
0927 03:54:43.567519 (+    38us) client_negotiation.cc:252] Sending NEGOTIATE NegotiatePB request
0927 03:54:43.827738 (+260219us) negotiation.cc:327] Negotiation complete: Network error: Client connection negotiation failed: client connection to 0.0.0.0:35847: BlockingRecv error: recv error from unknown peer: Transport endpoint is not connected (error 107)
Metrics: {"client-negotiator.queue_time_us":34}
[       OK ] Parameters/TestRpcSocketTxRxQueue.OverCapacity/0 (1050 ms)
[----------] 1 test from Parameters/TestRpcSocketTxRxQueue (1050 ms total)

[----------] Global test environment tear-down
[==========] 21 tests from 2 test suites ran. (28634 ms total)
[  PASSED  ] 20 tests.
[  FAILED  ] 1 test, listed below:
[  FAILED  ] Parameters/TestRpc.TestCallWithChainCertAndChainCA/SSL_TCP, where GetParam() = (true, false)

 1 FAILED TEST