Diagnosed failure
Parameters/TestRpc.TestCallWithChainCertAndChainCA/SSL_UnixSocket: /data0/somelongdirectorytoavoidrpathissues/src/kudu/src/kudu/rpc/rpc-test.cc:270: Failure
Failed
Bad status: Runtime error: could not verify certificate chain (error with cert: subject=CN = localhost, ST = sadfjas, C = AS, emailAddress = sdflkdsajf, O = lskdfjlsad, OU = sldfkja, issuer=C = AS, ST = ASDfkjdhf, L = lskdjf, O = saldfja, OU = skdjf, CN = localhost, emailAddress = sadjflkadsj): : certificate has expired
Google Test trace:
/data0/somelongdirectorytoavoidrpathissues/src/kudu/src/kudu/rpc/rpc-test.cc:267: Connecting to unix:/tmp/dist-test-taskzD7_VT/test-tmp/rpc-test-c38411e90f744f95a673ec9d4db26b58.sock
I20260927 10:42:13.700212 383 test_util.cc:175] -----------------------------------------------
I20260927 10:42:13.700274 383 test_util.cc:176] Had fatal failures, leaving test files at /tmp/dist-test-taskzD7_VT/test-tmp/rpc-test.6.Parameters_TestRpc.TestCallWithChainCertAndChainCA_SSL_UnixSocket.1790505733620744-383-0
Full log
Note: This is test shard 7 of 8.
[==========] Running 21 tests from 2 test suites.
[----------] Global test environment set-up.
[----------] 20 tests from Parameters/TestRpc
[ RUN ] Parameters/TestRpc.TestMessengerCreateDestroy/SSL_UnixSocket
WARNING: Logging before InitGoogleLogging() is written to STDERR
I20260927 10:42:13.645275 383 rpc-test.cc:169] started messenger TestCreateDestroy
[ OK ] Parameters/TestRpc.TestMessengerCreateDestroy/SSL_UnixSocket (18 ms)
[ RUN ] Parameters/TestRpc.TestNegotiationDeadlock/SSL_UnixSocket
I20260927 10:42:13.665297 404 acceptor_pool.cc:254] collecting diagnostics on the listening RPC socket unix:/tmp/dist-test-taskzD7_VT/test-tmp/rpc-test-e7eab84ffc8448109467cc1609586273.sock every 8 connection(s)
I20260927 10:42:13.665297 403 acceptor_pool.cc:254] collecting diagnostics on the listening RPC socket unix:/tmp/dist-test-taskzD7_VT/test-tmp/rpc-test-e7eab84ffc8448109467cc1609586273.sock every 8 connection(s)
[ OK ] Parameters/TestRpc.TestNegotiationDeadlock/SSL_UnixSocket (29 ms)
[ RUN ] Parameters/TestRpc.TestCallWithChainCertAndChainCA/SSL_UnixSocket
I20260927 10:42:13.694972 420 acceptor_pool.cc:254] collecting diagnostics on the listening RPC socket unix:/tmp/dist-test-taskzD7_VT/test-tmp/rpc-test-c38411e90f744f95a673ec9d4db26b58.sock every 8 connection(s)
I20260927 10:42:13.694974 419 acceptor_pool.cc:254] collecting diagnostics on the listening RPC socket unix:/tmp/dist-test-taskzD7_VT/test-tmp/rpc-test-c38411e90f744f95a673ec9d4db26b58.sock every 8 connection(s)
/data0/somelongdirectorytoavoidrpathissues/src/kudu/src/kudu/rpc/rpc-test.cc:270: Failure
Failed
Bad status: Runtime error: could not verify certificate chain (error with cert: subject=CN = localhost, ST = sadfjas, C = AS, emailAddress = sdflkdsajf, O = lskdfjlsad, OU = sldfkja, issuer=C = AS, ST = ASDfkjdhf, L = lskdjf, O = saldfja, OU = skdjf, CN = localhost, emailAddress = sadjflkadsj): : certificate has expired
Google Test trace:
/data0/somelongdirectorytoavoidrpathissues/src/kudu/src/kudu/rpc/rpc-test.cc:267: Connecting to unix:/tmp/dist-test-taskzD7_VT/test-tmp/rpc-test-c38411e90f744f95a673ec9d4db26b58.sock
I20260927 10:42:13.700212 383 test_util.cc:175] -----------------------------------------------
I20260927 10:42:13.700274 383 test_util.cc:176] Had fatal failures, leaving test files at /tmp/dist-test-taskzD7_VT/test-tmp/rpc-test.6.Parameters_TestRpc.TestCallWithChainCertAndChainCA_SSL_UnixSocket.1790505733620744-383-0
[ FAILED ] Parameters/TestRpc.TestCallWithChainCertAndChainCA/SSL_UnixSocket, where GetParam() = (true, true) (23 ms)
[ RUN ] Parameters/TestRpc.TestCallWithPasswordProtectedKey/SSL_UnixSocket
I20260927 10:42:13.714887 444 acceptor_pool.cc:254] collecting diagnostics on the listening RPC socket unix:/tmp/dist-test-taskzD7_VT/test-tmp/rpc-test-6aa29e95ebe64dc6b23ad39cfaf7bdd6.sock every 8 connection(s)
I20260927 10:42:13.714922 445 acceptor_pool.cc:254] collecting diagnostics on the listening RPC socket unix:/tmp/dist-test-taskzD7_VT/test-tmp/rpc-test-6aa29e95ebe64dc6b23ad39cfaf7bdd6.sock every 8 connection(s)
W20260927 10:42:13.729264 441 connection.cc:196] Error closing socket: Network error: TlsSocket::Close: Broken pipe
[ OK ] Parameters/TestRpc.TestCallWithPasswordProtectedKey/SSL_UnixSocket (31 ms)
[ RUN ] Parameters/TestRpc.TestCallToBadServer/SSL_UnixSocket
I20260927 10:42:13.755125 383 rpc-test.cc:394] Status: Network error: Client connection negotiation failed: client connection to 0.0.0.0:0: connect: Connection refused (error 111)
I20260927 10:42:13.755677 383 rpc-test.cc:394] Status: Network error: Client connection negotiation failed: client connection to 0.0.0.0:0: connect: Connection refused (error 111)
I20260927 10:42:13.756129 383 rpc-test.cc:394] Status: Network error: Client connection negotiation failed: client connection to 0.0.0.0:0: connect: Connection refused (error 111)
I20260927 10:42:13.756567 383 rpc-test.cc:394] Status: Network error: Client connection negotiation failed: client connection to 0.0.0.0:0: connect: Connection refused (error 111)
I20260927 10:42:13.756994 383 rpc-test.cc:394] Status: Network error: Client connection negotiation failed: client connection to 0.0.0.0:0: connect: Connection refused (error 111)
[ OK ] Parameters/TestRpc.TestCallToBadServer/SSL_UnixSocket (26 ms)
[ RUN ] Parameters/TestRpc.TestWrongService/SSL_UnixSocket
I20260927 10:42:13.796795 479 acceptor_pool.cc:254] collecting diagnostics on the listening RPC socket unix:/tmp/dist-test-taskzD7_VT/test-tmp/rpc-test-8aaecde082d14f5cbee0587b25532e8a.sock every 8 connection(s)
I20260927 10:42:13.796823 480 acceptor_pool.cc:254] collecting diagnostics on the listening RPC socket unix:/tmp/dist-test-taskzD7_VT/test-tmp/rpc-test-8aaecde082d14f5cbee0587b25532e8a.sock every 8 connection(s)
I20260927 10:42:13.821519 476 messenger.cc:345] service WrongServiceName not registered on TestServer
W20260927 10:42:13.822539 476 connection.cc:196] Error closing socket: Network error: TlsSocket::Close: Broken pipe
[ OK ] Parameters/TestRpc.TestWrongService/SSL_UnixSocket (66 ms)
[ RUN ] Parameters/TestRpc.TestConnectionKeepalive/SSL_UnixSocket
I20260927 10:42:13.833091 502 acceptor_pool.cc:254] collecting diagnostics on the listening RPC socket unix:/tmp/dist-test-taskzD7_VT/test-tmp/rpc-test-043362a676a841e98b162a50f1524dc1.sock every 8 connection(s)
I20260927 10:42:13.833112 503 acceptor_pool.cc:254] collecting diagnostics on the listening RPC socket unix:/tmp/dist-test-taskzD7_VT/test-tmp/rpc-test-043362a676a841e98b162a50f1524dc1.sock every 8 connection(s)
I20260927 10:42:13.833379 383 rpc-test.cc:488] Connecting to unix:/tmp/dist-test-taskzD7_VT/test-tmp/rpc-test-043362a676a841e98b162a50f1524dc1.sock
W20260927 10:42:14.326388 515 connection.cc:196] Error closing socket: Network error: TlsSocket::Close: Broken pipe
[ OK ] Parameters/TestRpc.TestConnectionKeepalive/SSL_UnixSocket (1037 ms)
[ RUN ] Parameters/TestRpc.TestClientConnectionMetrics/SSL_UnixSocket
I20260927 10:42:14.873612 527 acceptor_pool.cc:254] collecting diagnostics on the listening RPC socket unix:/tmp/dist-test-taskzD7_VT/test-tmp/rpc-test-970f030ed508457097c0c4d8eda053ff.sock every 8 connection(s)
I20260927 10:42:14.873737 528 acceptor_pool.cc:254] collecting diagnostics on the listening RPC socket unix:/tmp/dist-test-taskzD7_VT/test-tmp/rpc-test-970f030ed508457097c0c4d8eda053ff.sock every 8 connection(s)
I20260927 10:42:14.873982 383 rpc-test.cc:569] Connecting to unix:/tmp/dist-test-taskzD7_VT/test-tmp/rpc-test-970f030ed508457097c0c4d8eda053ff.sock
W20260927 10:42:26.093691 524 connection.cc:196] Error closing socket: Network error: TlsSocket::Close: Broken pipe
[ OK ] Parameters/TestRpc.TestClientConnectionMetrics/SSL_UnixSocket (11232 ms)
[ RUN ] Parameters/TestRpc.TestCredentialsPolicy/SSL_UnixSocket
I20260927 10:42:26.113180 550 acceptor_pool.cc:254] collecting diagnostics on the listening RPC socket unix:/tmp/dist-test-taskzD7_VT/test-tmp/rpc-test-bc046c4e7b044210bf022fb27acadf34.sock every 8 connection(s)
I20260927 10:42:26.113242 551 acceptor_pool.cc:254] collecting diagnostics on the listening RPC socket unix:/tmp/dist-test-taskzD7_VT/test-tmp/rpc-test-bc046c4e7b044210bf022fb27acadf34.sock every 8 connection(s)
I20260927 10:42:26.113581 383 rpc-test.cc:700] Connecting to unix:/tmp/dist-test-taskzD7_VT/test-tmp/rpc-test-bc046c4e7b044210bf022fb27acadf34.sock
W20260927 10:42:26.132709 549 connection.cc:196] Error closing socket: Network error: TlsSocket::Close: Broken pipe
[ OK ] Parameters/TestRpc.TestCredentialsPolicy/SSL_UnixSocket (44 ms)
[ RUN ] Parameters/TestRpc.TestCallLongerThanKeepalive/SSL_UnixSocket
I20260927 10:42:26.156869 575 acceptor_pool.cc:254] collecting diagnostics on the listening RPC socket unix:/tmp/dist-test-taskzD7_VT/test-tmp/rpc-test-ed05c75898534f8599503b266dde0b3e.sock every 8 connection(s)
I20260927 10:42:26.156951 576 acceptor_pool.cc:254] collecting diagnostics on the listening RPC socket unix:/tmp/dist-test-taskzD7_VT/test-tmp/rpc-test-ed05c75898534f8599503b266dde0b3e.sock every 8 connection(s)
I20260927 10:42:26.172787 579 rpc-test-base.h:222] got call: sleep_micros: 3000000 deferred: true
I20260927 10:42:29.173656 579 rpcz_store.cc:275] Call kudu.rpc.GenericCalculatorService.Sleep from unix:<unnamed> (request call id 0) took 3000 ms. Trace:
I20260927 10:42:29.173804 579 rpcz_store.cc:276] 0927 10:42:26.172696 (+ 0us) service_pool.cc:170] Inserting onto call queue
0927 10:42:26.172764 (+ 68us) service_pool.cc:227] Handling call
0927 10:42:29.173619 (+3000855us) inbound_call.cc:173] Queueing success response
Metrics: {}
W20260927 10:42:29.175781 572 connection.cc:196] Error closing socket: Network error: TlsSocket::Close: Broken pipe
[ OK ] Parameters/TestRpc.TestCallLongerThanKeepalive/SSL_UnixSocket (3038 ms)
[ RUN ] Parameters/TestRpc.TestRpcSidecar/SSL_UnixSocket
I20260927 10:42:29.199834 600 acceptor_pool.cc:254] collecting diagnostics on the listening RPC socket unix:/tmp/dist-test-taskzD7_VT/test-tmp/rpc-test-838691ada350435c8202bb1773182ce8.sock every 8 connection(s)
I20260927 10:42:29.199864 601 acceptor_pool.cc:254] collecting diagnostics on the listening RPC socket unix:/tmp/dist-test-taskzD7_VT/test-tmp/rpc-test-838691ada350435c8202bb1773182ce8.sock every 8 connection(s)
W20260927 10:42:29.263680 597 connection.cc:196] Error closing socket: Network error: TlsSocket::Close: Broken pipe
[ OK ] Parameters/TestRpc.TestRpcSidecar/SSL_UnixSocket (87 ms)
[ RUN ] Parameters/TestRpc.TestRpcSidecarLimits/SSL_UnixSocket
I20260927 10:42:31.087790 625 acceptor_pool.cc:254] collecting diagnostics on the listening RPC socket unix:/tmp/dist-test-taskzD7_VT/test-tmp/rpc-test-a53c9cd65f4c4c3a9810986ec60ee312.sock every 8 connection(s)
I20260927 10:42:31.087826 626 acceptor_pool.cc:254] collecting diagnostics on the listening RPC socket unix:/tmp/dist-test-taskzD7_VT/test-tmp/rpc-test-a53c9cd65f4c4c3a9810986ec60ee312.sock every 8 connection(s)
W20260927 10:42:31.110126 383 serialization.cc:72] Serialized kudu.rpc_test.PushStringsRequestPB (2147483654 bytes) is larger than the maximum configured RPC message size (52428800 bytes). Sending anyway, but peer may reject the data.
W20260927 10:42:31.114885 622 connection.cc:535] server connection from unix:<unnamed> recv error: Network error: RPC frame had a length of 2147483714, but we only support messages up to 52428800 bytes long.
W20260927 10:42:31.114992 622 connection.cc:158] shutting down server connection from unix:<unnamed> with pending inbound data: 4/2147483714 bytes received; last active 0 ns ago: status Network error: RPC frame had a length of 2147483714, but we only support messages up to 52428800 bytes long.
W20260927 10:42:31.115281 638 connection.cc:196] Error closing socket: Network error: TlsSocket::Close: Broken pipe
I20260927 10:42:31.153684 650 acceptor_pool.cc:254] collecting diagnostics on the listening RPC socket unix:/tmp/dist-test-taskzD7_VT/test-tmp/rpc-test-a53c9cd65f4c4c3a9810986ec60ee312.sock every 8 connection(s)
I20260927 10:42:31.153934 651 acceptor_pool.cc:254] collecting diagnostics on the listening RPC socket unix:/tmp/dist-test-taskzD7_VT/test-tmp/rpc-test-a53c9cd65f4c4c3a9810986ec60ee312.sock every 8 connection(s)
W20260927 10:42:36.224982 647 connection.cc:577] server connection from unix:<unnamed>: received bad data: 'Corruption: Invalid packet: message had a length of 2147483710, but we only support messages up to 2147483647 bytes
'
W20260927 10:42:36.225334 663 connection.cc:196] Error closing socket: Network error: TlsSocket::Close: Broken pipe
[ OK ] Parameters/TestRpc.TestRpcSidecarLimits/SSL_UnixSocket (6962 ms)
[ RUN ] Parameters/TestRpc.TestCallTimeoutDoesntAffectNegotiation/SSL_UnixSocket
I20260927 10:42:36.239599 675 acceptor_pool.cc:254] collecting diagnostics on the listening RPC socket unix:/tmp/dist-test-taskzD7_VT/test-tmp/rpc-test-d95cbe072b8b4de6aa5349b9f50e0661.sock every 8 connection(s)
I20260927 10:42:36.239725 676 acceptor_pool.cc:254] collecting diagnostics on the listening RPC socket unix:/tmp/dist-test-taskzD7_VT/test-tmp/rpc-test-d95cbe072b8b4de6aa5349b9f50e0661.sock every 8 connection(s)
W20260927 10:42:36.245350 668 negotiation.cc:266] Injecting 500ms delay in negotiation
I20260927 10:42:36.295814 383 rpc-test-base.h:595] status: Timed out: connection negotiation to unix:/tmp/dist-test-taskzD7_VT/test-tmp/rpc-test-d95cbe072b8b4de6aa5349b9f50e0661.sock for RPC Sleep timed out after 0.050s (ON_OUTBOUND_QUEUE), seconds elapsed: 0.0508897
[ OK ] Parameters/TestRpc.TestCallTimeoutDoesntAffectNegotiation/SSL_UnixSocket (524 ms)
[ RUN ] Parameters/TestRpc.TestRpcHandlerLatencyMetric/SSL_UnixSocket
I20260927 10:42:36.766916 700 acceptor_pool.cc:254] collecting diagnostics on the listening RPC socket unix:/tmp/dist-test-taskzD7_VT/test-tmp/rpc-test-5f4ee04942094642b9747b13060b16ad.sock every 8 connection(s)
I20260927 10:42:36.766942 701 acceptor_pool.cc:254] collecting diagnostics on the listening RPC socket unix:/tmp/dist-test-taskzD7_VT/test-tmp/rpc-test-5f4ee04942094642b9747b13060b16ad.sock every 8 connection(s)
I20260927 10:42:36.809176 383 rpc-test.cc:1236] Sleep() min lat: 20409
I20260927 10:42:36.809306 383 rpc-test.cc:1237] Sleep() mean lat: 20409
I20260927 10:42:36.809362 383 rpc-test.cc:1238] Sleep() max lat: 20409
I20260927 10:42:36.809407 383 rpc-test.cc:1239] Sleep() #calls: 1
W20260927 10:42:36.810286 697 connection.cc:196] Error closing socket: Network error: TlsSocket::Close: Broken pipe
[ OK ] Parameters/TestRpc.TestRpcHandlerLatencyMetric/SSL_UnixSocket (59 ms)
[ RUN ] Parameters/TestRpc.TimedOutOnResponseMetricServiceQueue/SSL_UnixSocket
I20260927 10:42:36.828029 727 acceptor_pool.cc:254] collecting diagnostics on the listening RPC socket unix:/tmp/dist-test-taskzD7_VT/test-tmp/rpc-test-7dd180855e9f49b2a603771c8bbf348f.sock every 8 connection(s)
I20260927 10:42:36.828040 726 acceptor_pool.cc:254] collecting diagnostics on the listening RPC socket unix:/tmp/dist-test-taskzD7_VT/test-tmp/rpc-test-7dd180855e9f49b2a603771c8bbf348f.sock every 8 connection(s)
W20260927 10:42:36.883033 728 rpcz_store.cc:267] Call kudu.rpc_test.CalculatorService.Sleep from unix:<unnamed> (request call id 2) took 20 ms (client timeout 20 ms). Trace:
W20260927 10:42:36.883162 728 rpcz_store.cc:269] 0927 10:42:36.862762 (+ 0us) service_pool.cc:170] Inserting onto call queue
0927 10:42:36.882986 (+ 20224us) service_pool.cc:214] Skipping call since client already timed out
0927 10:42:36.883012 (+ 26us) inbound_call.cc:173] Queueing failure response
Metrics: {}
[ OK ] Parameters/TestRpc.TimedOutOnResponseMetricServiceQueue/SSL_UnixSocket (73 ms)
[ RUN ] Parameters/TestRpc.RpcPendingConnectionsMetric/SSL_UnixSocket
I20260927 10:42:36.887889 749 acceptor_pool.cc:254] collecting diagnostics on the listening RPC socket 0.0.0.0:45723 every 8 connection(s)
I20260927 10:42:36.887955 750 acceptor_pool.cc:254] collecting diagnostics on the listening RPC socket 0.0.0.0:45723 every 8 connection(s)
W20260927 10:42:36.899471 745 negotiation.cc:337] Failed RPC negotiation. Trace:
0927 10:42:36.898771 (+ 0us) reactor.cc:625] Submitting negotiation task for server connection from 127.0.0.1:58094 (local address 127.0.0.1:45723)
0927 10:42:36.898972 (+ 201us) server_negotiation.cc:206] Beginning negotiation
0927 10:42:36.898980 (+ 8us) server_negotiation.cc:399] Waiting for connection header
0927 10:42:36.899161 (+ 181us) negotiation.cc:327] Negotiation complete: Network error: Server connection negotiation failed: server connection from 127.0.0.1:58094: BlockingRecv error: recv got EOF from 127.0.0.1:58094 (error 108)
Metrics: {"server-negotiator.queue_time_us":70}
[ OK ] Parameters/TestRpc.RpcPendingConnectionsMetric/SSL_UnixSocket (25 ms)
[ RUN ] Parameters/TestRpc.TestRpcContextClientDeadline/SSL_UnixSocket
I20260927 10:42:36.922456 765 acceptor_pool.cc:254] collecting diagnostics on the listening RPC socket unix:/tmp/dist-test-taskzD7_VT/test-tmp/rpc-test-00f099cf29cd45e398dec0603f901f69.sock every 8 connection(s)
I20260927 10:42:36.922498 766 acceptor_pool.cc:254] collecting diagnostics on the listening RPC socket unix:/tmp/dist-test-taskzD7_VT/test-tmp/rpc-test-00f099cf29cd45e398dec0603f901f69.sock every 8 connection(s)
[ OK ] Parameters/TestRpc.TestRpcContextClientDeadline/SSL_UnixSocket (67 ms)
[ RUN ] Parameters/TestRpc.TestApplicationFeatureFlagUnsupportedServer/SSL_UnixSocket
I20260927 10:42:36.994906 790 acceptor_pool.cc:254] collecting diagnostics on the listening RPC socket unix:/tmp/dist-test-taskzD7_VT/test-tmp/rpc-test-07c14a2739e2494d8e7adb6bcd14508a.sock every 8 connection(s)
I20260927 10:42:36.994936 791 acceptor_pool.cc:254] collecting diagnostics on the listening RPC socket unix:/tmp/dist-test-taskzD7_VT/test-tmp/rpc-test-07c14a2739e2494d8e7adb6bcd14508a.sock every 8 connection(s)
[ OK ] Parameters/TestRpc.TestApplicationFeatureFlagUnsupportedServer/SSL_UnixSocket (39 ms)
[ RUN ] Parameters/TestRpc.TestCancellationAsync/SSL_UnixSocket
I20260927 10:42:37.027005 815 acceptor_pool.cc:254] collecting diagnostics on the listening RPC socket unix:/tmp/dist-test-taskzD7_VT/test-tmp/rpc-test-df6db066e27c47a6b81df4f66fdade5e.sock every 8 connection(s)
I20260927 10:42:37.027041 816 acceptor_pool.cc:254] collecting diagnostics on the listening RPC socket unix:/tmp/dist-test-taskzD7_VT/test-tmp/rpc-test-df6db066e27c47a6b81df4f66fdade5e.sock every 8 connection(s)
I20260927 10:42:37.027364 383 rpc-test.cc:1716] Connecting to unix:/tmp/dist-test-taskzD7_VT/test-tmp/rpc-test-df6db066e27c47a6b81df4f66fdade5e.sock
I20260927 10:42:37.048686 383 test_util.cc:268] Using random seed: -1684144277
I20260927 10:42:37.065418 819 rpc-test-base.h:240] got call: sleep_micros: 500 pattern: 4294967295 num_repetitions: 2097152 sidecar_idx: 0
I20260927 10:42:37.083755 818 rpc-test-base.h:240] got call: sleep_micros: 500 pattern: 4294967295 num_repetitions: 2097152 sidecar_idx: 0
I20260927 10:42:37.101199 819 rpc-test-base.h:240] got call: sleep_micros: 500 pattern: 4294967295 num_repetitions: 2097152 sidecar_idx: 0
I20260927 10:42:37.119912 818 rpc-test-base.h:240] got call: sleep_micros: 500 pattern: 4294967295 num_repetitions: 2097152 sidecar_idx: 0
I20260927 10:42:37.137509 819 rpc-test-base.h:240] got call: sleep_micros: 500 pattern: 4294967295 num_repetitions: 2097152 sidecar_idx: 0
I20260927 10:42:37.155226 818 rpc-test-base.h:240] got call: sleep_micros: 500 pattern: 4294967295 num_repetitions: 2097152 sidecar_idx: 0
I20260927 10:42:37.172847 819 rpc-test-base.h:240] got call: sleep_micros: 500 pattern: 4294967295 num_repetitions: 2097152 sidecar_idx: 0
I20260927 10:42:37.190412 818 rpc-test-base.h:240] got call: sleep_micros: 500 pattern: 4294967295 num_repetitions: 2097152 sidecar_idx: 0
W20260927 10:42:37.192229 812 connection.cc:196] Error closing socket: Network error: TlsSocket::Close: Broken pipe
W20260927 10:42:37.198684 812 connection.cc:441] server connection from unix:<unnamed> torn down before Call kudu.rpc.GenericCalculatorService.SleepWithSidecar from unix:<unnamed> (request call id 8) could send its response
W20260927 10:42:37.209026 812 connection.cc:441] server connection from unix:<unnamed> torn down before Call kudu.rpc.GenericCalculatorService.SleepWithSidecar from unix:<unnamed> (request call id 9) could send its response
[ OK ] Parameters/TestRpc.TestCancellationAsync/SSL_UnixSocket (193 ms)
[ RUN ] Parameters/TestRpc.TestPerformanceBySocketType/SSL_UnixSocket
I20260927 10:42:37.246116 840 acceptor_pool.cc:254] collecting diagnostics on the listening RPC socket unix:/tmp/dist-test-taskzD7_VT/test-tmp/rpc-test-5befcfabf3494c7cbc0e2fd1ebd5ca12.sock every 8 connection(s)
I20260927 10:42:37.246120 841 acceptor_pool.cc:254] collecting diagnostics on the listening RPC socket unix:/tmp/dist-test-taskzD7_VT/test-tmp/rpc-test-5befcfabf3494c7cbc0e2fd1ebd5ca12.sock every 8 connection(s)
I20260927 10:42:37.246480 383 rpc-test.cc:1846] Connecting to unix:/tmp/dist-test-taskzD7_VT/test-tmp/rpc-test-5befcfabf3494c7cbc0e2fd1ebd5ca12.sock
I20260927 10:42:38.975214 383 rpc-test.cc:1859] Sending 1024MB via ssl-enabled unix socket: real 1.716s user 2.146s sys 0.919s
I20260927 10:42:40.776441 383 rpc-test.cc:1859] Sending 1024MB via ssl-enabled unix socket: real 1.801s user 2.175s sys 1.035s
I20260927 10:42:42.427052 383 rpc-test.cc:1859] Sending 1024MB via ssl-enabled unix socket: real 1.651s user 1.985s sys 0.959s
I20260927 10:42:44.111160 383 rpc-test.cc:1859] Sending 1024MB via ssl-enabled unix socket: real 1.684s user 2.024s sys 0.982s
I20260927 10:42:45.782071 383 rpc-test.cc:1859] Sending 1024MB via ssl-enabled unix socket: real 1.671s user 2.160s sys 0.850s
[ OK ] Parameters/TestRpc.TestPerformanceBySocketType/SSL_UnixSocket (8573 ms)
[----------] 20 tests from Parameters/TestRpc (32155 ms total)
[----------] 1 test from Parameters/TestRpcSocketTxRxQueue
[ RUN ] Parameters/TestRpcSocketTxRxQueue.AcceptorRxQueueSizeMetric/0
I20260927 10:42:45.792253 865 acceptor_pool.cc:254] collecting diagnostics on the listening RPC socket 0.0.0.0:40177 every 1 connection(s)
I20260927 10:42:45.792328 866 acceptor_pool.cc:254] collecting diagnostics on the listening RPC socket 0.0.0.0:40177 every 1 connection(s)
W20260927 10:42:45.793174 861 negotiation.cc:337] Failed RPC negotiation. Trace:
0927 10:42:45.792918 (+ 0us) reactor.cc:625] Submitting negotiation task for server connection from 127.0.0.1:44550 (local address 127.0.0.1:40177)
0927 10:42:45.793013 (+ 95us) server_negotiation.cc:206] Beginning negotiation
0927 10:42:45.793017 (+ 4us) server_negotiation.cc:399] Waiting for connection header
0927 10:42:45.793099 (+ 82us) negotiation.cc:327] Negotiation complete: Network error: Server connection negotiation failed: server connection from 127.0.0.1:44550: BlockingRecv error: recv got EOF from 127.0.0.1:44550 (error 108)
Metrics: {"server-negotiator.queue_time_us":31}
[ OK ] Parameters/TestRpcSocketTxRxQueue.AcceptorRxQueueSizeMetric/0 (11 ms)
[----------] 1 test from Parameters/TestRpcSocketTxRxQueue (11 ms total)
[----------] Global test environment tear-down
[==========] 21 tests from 2 test suites ran. (32167 ms total)
[ PASSED ] 20 tests.
[ FAILED ] 1 test, listed below:
[ FAILED ] Parameters/TestRpc.TestCallWithChainCertAndChainCA/SSL_UnixSocket, where GetParam() = (true, true)
1 FAILED TEST