Parameters/TestRpc.TestCallWithChainCertAndRootCA/SSL_UnixSocket: /data0/somelongdirectorytoavoidrpathissues/src/kudu/src/kudu/rpc/rpc-test.cc:303: Failure
Failed
Bad status: Runtime error: could not verify certificate chain (error with cert: subject=CN = localhost, ST = sadfjas, C = AS, emailAddress = sdflkdsajf, O = lskdfjlsad, OU = sldfkja, issuer=C = AS, ST = ASDfkjdhf, L = lskdjf, O = saldfja, OU = skdjf, CN = localhost, emailAddress = sadjflkadsj): : certificate has expired
Google Test trace:
/data0/somelongdirectorytoavoidrpathissues/src/kudu/src/kudu/rpc/rpc-test.cc:300: Connecting to unix:/tmp/dist-test-taskYPfJfR/test-tmp/rpc-test-af4c40f624b5405195ec91fbe19f6301.sock
I20260928 11:45:19.015686 3087 test_util.cc:175] -----------------------------------------------
I20260928 11:45:19.015937 3087 test_util.cc:176] Had fatal failures, leaving test files at /tmp/dist-test-taskYPfJfR/test-tmp/rpc-test.2.Parameters_TestRpc.TestCallWithChainCertAndRootCA_SSL_UnixSocket.1790595915426046-3087-0
Note: This is test shard 3 of 8.
[==========] Running 21 tests from 2 test suites.
[----------] Global test environment set-up.
[----------] 1 test from TestRpc
[ RUN ] TestRpc.TestNegotiationTimeout
WARNING: Logging before InitGoogleLogging() is written to STDERR
I20260928 11:45:15.617403 3087 rpc-test-base.h:595] status: Timed out: connection negotiation to 0.0.0.0:44023 for RPC Sleep timed out after 0.100s (ON_OUTBOUND_QUEUE), seconds elapsed: 0.101789
W20260928 11:45:18.723624 3097 negotiation.cc:337] Failed RPC negotiation. Trace:
0928 11:45:15.516431 (+ 0us) reactor.cc:625] Submitting negotiation task for client connection to 0.0.0.0:44023 (local address 127.0.0.1:57010)
0928 11:45:15.517235 (+ 804us) negotiation.cc:107] Waiting for socket to connect
0928 11:45:15.517285 (+ 50us) client_negotiation.cc:174] Beginning negotiation
0928 11:45:15.529341 (+ 12056us) client_negotiation.cc:252] Sending NEGOTIATE NegotiatePB request
0928 11:45:18.722480 (+3193139us) negotiation.cc:327] Negotiation complete: Timed out: Client connection negotiation failed: client connection to 0.0.0.0:44023: received 0 of 4 requested bytes
Metrics: {"client-negotiator.queue_time_us":229}
[ OK ] TestRpc.TestNegotiationTimeout (3249 ms)
[----------] 1 test from TestRpc (3249 ms total)
[----------] 20 tests from Parameters/TestRpc
[ RUN ] Parameters/TestRpc.TestAcceptorPoolStartStop/SSL_UnixSocket
I20260928 11:45:18.762231 3113 acceptor_pool.cc:254] collecting diagnostics on the listening RPC socket unix:/tmp/dist-test-taskYPfJfR/test-tmp/rpc-test-468bb590886a4e3886ff282a8a420387.sock every 8 connection(s)
I20260928 11:45:18.764000 3114 acceptor_pool.cc:254] collecting diagnostics on the listening RPC socket unix:/tmp/dist-test-taskYPfJfR/test-tmp/rpc-test-468bb590886a4e3886ff282a8a420387.sock every 8 connection(s)
I20260928 11:45:18.796411 3124 acceptor_pool.cc:254] collecting diagnostics on the listening RPC socket unix:/tmp/dist-test-taskYPfJfR/test-tmp/rpc-test-468bb590886a4e3886ff282a8a420387.sock every 8 connection(s)
I20260928 11:45:18.797928 3125 acceptor_pool.cc:254] collecting diagnostics on the listening RPC socket unix:/tmp/dist-test-taskYPfJfR/test-tmp/rpc-test-468bb590886a4e3886ff282a8a420387.sock every 8 connection(s)
I20260928 11:45:18.824446 3135 acceptor_pool.cc:254] collecting diagnostics on the listening RPC socket unix:/tmp/dist-test-taskYPfJfR/test-tmp/rpc-test-468bb590886a4e3886ff282a8a420387.sock every 8 connection(s)
I20260928 11:45:18.825145 3136 acceptor_pool.cc:254] collecting diagnostics on the listening RPC socket unix:/tmp/dist-test-taskYPfJfR/test-tmp/rpc-test-468bb590886a4e3886ff282a8a420387.sock every 8 connection(s)
I20260928 11:45:18.847553 3146 acceptor_pool.cc:254] collecting diagnostics on the listening RPC socket unix:/tmp/dist-test-taskYPfJfR/test-tmp/rpc-test-468bb590886a4e3886ff282a8a420387.sock every 8 connection(s)
I20260928 11:45:18.848301 3147 acceptor_pool.cc:254] collecting diagnostics on the listening RPC socket unix:/tmp/dist-test-taskYPfJfR/test-tmp/rpc-test-468bb590886a4e3886ff282a8a420387.sock every 8 connection(s)
I20260928 11:45:18.870913 3157 acceptor_pool.cc:254] collecting diagnostics on the listening RPC socket unix:/tmp/dist-test-taskYPfJfR/test-tmp/rpc-test-468bb590886a4e3886ff282a8a420387.sock every 8 connection(s)
I20260928 11:45:18.871784 3158 acceptor_pool.cc:254] collecting diagnostics on the listening RPC socket unix:/tmp/dist-test-taskYPfJfR/test-tmp/rpc-test-468bb590886a4e3886ff282a8a420387.sock every 8 connection(s)
[ OK ] Parameters/TestRpc.TestAcceptorPoolStartStop/SSL_UnixSocket (148 ms)
[ RUN ] Parameters/TestRpc.TestCall/SSL_UnixSocket
I20260928 11:45:18.904467 3170 acceptor_pool.cc:254] collecting diagnostics on the listening RPC socket unix:/tmp/dist-test-taskYPfJfR/test-tmp/rpc-test-5e7dd75e34ef4a06888c4986815f8986.sock every 8 connection(s)
I20260928 11:45:18.906713 3171 acceptor_pool.cc:254] collecting diagnostics on the listening RPC socket unix:/tmp/dist-test-taskYPfJfR/test-tmp/rpc-test-5e7dd75e34ef4a06888c4986815f8986.sock every 8 connection(s)
I20260928 11:45:18.911680 3087 rpc-test.cc:234] Connecting to unix:/tmp/dist-test-taskYPfJfR/test-tmp/rpc-test-5e7dd75e34ef4a06888c4986815f8986.sock
W20260928 11:45:18.962945 3167 connection.cc:196] Error closing socket: Network error: TlsSocket::Close: Broken pipe
[ OK ] Parameters/TestRpc.TestCall/SSL_UnixSocket (92 ms)
[ RUN ] Parameters/TestRpc.TestCallWithChainCertAndRootCA/SSL_UnixSocket
I20260928 11:45:18.994804 3195 acceptor_pool.cc:254] collecting diagnostics on the listening RPC socket unix:/tmp/dist-test-taskYPfJfR/test-tmp/rpc-test-af4c40f624b5405195ec91fbe19f6301.sock every 8 connection(s)
I20260928 11:45:18.995527 3196 acceptor_pool.cc:254] collecting diagnostics on the listening RPC socket unix:/tmp/dist-test-taskYPfJfR/test-tmp/rpc-test-af4c40f624b5405195ec91fbe19f6301.sock every 8 connection(s)
/data0/somelongdirectorytoavoidrpathissues/src/kudu/src/kudu/rpc/rpc-test.cc:303: Failure
Failed
Bad status: Runtime error: could not verify certificate chain (error with cert: subject=CN = localhost, ST = sadfjas, C = AS, emailAddress = sdflkdsajf, O = lskdfjlsad, OU = sldfkja, issuer=C = AS, ST = ASDfkjdhf, L = lskdjf, O = saldfja, OU = skdjf, CN = localhost, emailAddress = sadjflkadsj): : certificate has expired
Google Test trace:
/data0/somelongdirectorytoavoidrpathissues/src/kudu/src/kudu/rpc/rpc-test.cc:300: Connecting to unix:/tmp/dist-test-taskYPfJfR/test-tmp/rpc-test-af4c40f624b5405195ec91fbe19f6301.sock
I20260928 11:45:19.015686 3087 test_util.cc:175] -----------------------------------------------
I20260928 11:45:19.015937 3087 test_util.cc:176] Had fatal failures, leaving test files at /tmp/dist-test-taskYPfJfR/test-tmp/rpc-test.2.Parameters_TestRpc.TestCallWithChainCertAndRootCA_SSL_UnixSocket.1790595915426046-3087-0
[ FAILED ] Parameters/TestRpc.TestCallWithChainCertAndRootCA/SSL_UnixSocket, where GetParam() = (true, true) (47 ms)
[ RUN ] Parameters/TestRpc.TestCallWithBadPasswordProtectedKey/SSL_UnixSocket
[ OK ] Parameters/TestRpc.TestCallWithBadPasswordProtectedKey/SSL_UnixSocket (32 ms)
[ RUN ] Parameters/TestRpc.TestInvalidMethodCall/SSL_UnixSocket
I20260928 11:45:19.095043 3232 acceptor_pool.cc:254] collecting diagnostics on the listening RPC socket unix:/tmp/dist-test-taskYPfJfR/test-tmp/rpc-test-ea7c2a4c158f4a71ac53813db663a226.sock every 8 connection(s)
I20260928 11:45:19.095886 3233 acceptor_pool.cc:254] collecting diagnostics on the listening RPC socket unix:/tmp/dist-test-taskYPfJfR/test-tmp/rpc-test-ea7c2a4c158f4a71ac53813db663a226.sock every 8 connection(s)
I20260928 11:45:19.099480 3087 rpc-test.cc:406] Connecting to unix:/tmp/dist-test-taskYPfJfR/test-tmp/rpc-test-ea7c2a4c158f4a71ac53813db663a226.sock
[ OK ] Parameters/TestRpc.TestInvalidMethodCall/SSL_UnixSocket (108 ms)
[ RUN ] Parameters/TestRpc.TestHighFDs/SSL_UnixSocket
I20260928 11:45:19.361956 3257 acceptor_pool.cc:254] collecting diagnostics on the listening RPC socket unix:/tmp/dist-test-taskYPfJfR/test-tmp/rpc-test-2f6e91fd2d5341a3941a679aae5b9f12.sock every 8 connection(s)
I20260928 11:45:19.362717 3258 acceptor_pool.cc:254] collecting diagnostics on the listening RPC socket unix:/tmp/dist-test-taskYPfJfR/test-tmp/rpc-test-2f6e91fd2d5341a3941a679aae5b9f12.sock every 8 connection(s)
W20260928 11:45:19.403146 3254 connection.cc:196] Error closing socket: Network error: TlsSocket::Close: Broken pipe
[ OK ] Parameters/TestRpc.TestHighFDs/SSL_UnixSocket (258 ms)
[ RUN ] Parameters/TestRpc.TestConnectionAlwaysKeepalive/SSL_UnixSocket
I20260928 11:45:19.460327 3280 acceptor_pool.cc:254] collecting diagnostics on the listening RPC socket unix:/tmp/dist-test-taskYPfJfR/test-tmp/rpc-test-ff3cabd53b0e4a5d934e761433651a50.sock every 8 connection(s)
I20260928 11:45:19.461087 3281 acceptor_pool.cc:254] collecting diagnostics on the listening RPC socket unix:/tmp/dist-test-taskYPfJfR/test-tmp/rpc-test-ff3cabd53b0e4a5d934e761433651a50.sock every 8 connection(s)
I20260928 11:45:19.465224 3087 rpc-test.cc:532] Connecting to unix:/tmp/dist-test-taskYPfJfR/test-tmp/rpc-test-ff3cabd53b0e4a5d934e761433651a50.sock
W20260928 11:45:22.499871 3279 connection.cc:196] Error closing socket: Network error: TlsSocket::Close: Broken pipe
[ OK ] Parameters/TestRpc.TestConnectionAlwaysKeepalive/SSL_UnixSocket (3087 ms)
[ RUN ] Parameters/TestRpc.TestReopenOutboundConnections/SSL_UnixSocket
I20260928 11:45:22.524941 3303 acceptor_pool.cc:254] collecting diagnostics on the listening RPC socket unix:/tmp/dist-test-taskYPfJfR/test-tmp/rpc-test-e6cbad776b8a4a3cbf92288e02d9a34f.sock every 8 connection(s)
I20260928 11:45:22.525640 3304 acceptor_pool.cc:254] collecting diagnostics on the listening RPC socket unix:/tmp/dist-test-taskYPfJfR/test-tmp/rpc-test-e6cbad776b8a4a3cbf92288e02d9a34f.sock every 8 connection(s)
I20260928 11:45:22.528928 3087 rpc-test.cc:658] Connecting to unix:/tmp/dist-test-taskYPfJfR/test-tmp/rpc-test-e6cbad776b8a4a3cbf92288e02d9a34f.sock
W20260928 11:45:22.556578 3302 connection.cc:196] Error closing socket: Network error: TlsSocket::Close: Broken pipe
W20260928 11:45:22.566681 3302 connection.cc:196] Error closing socket: Network error: TlsSocket::Close: Broken pipe
W20260928 11:45:22.576656 3302 connection.cc:196] Error closing socket: Network error: TlsSocket::Close: Broken pipe
W20260928 11:45:22.586803 3302 connection.cc:196] Error closing socket: Network error: TlsSocket::Close: Broken pipe
W20260928 11:45:22.596197 3302 connection.cc:196] Error closing socket: Network error: TlsSocket::Close: Broken pipe
W20260928 11:45:22.605993 3302 connection.cc:196] Error closing socket: Network error: TlsSocket::Close: Broken pipe
W20260928 11:45:22.617072 3302 connection.cc:196] Error closing socket: Network error: TlsSocket::Close: Broken pipe
W20260928 11:45:22.628549 3302 connection.cc:196] Error closing socket: Network error: TlsSocket::Close: Broken pipe
W20260928 11:45:22.639547 3302 connection.cc:196] Error closing socket: Network error: TlsSocket::Close: Broken pipe
W20260928 11:45:22.650318 3302 connection.cc:196] Error closing socket: Network error: TlsSocket::Close: Broken pipe
W20260928 11:45:22.661427 3302 connection.cc:196] Error closing socket: Network error: TlsSocket::Close: Broken pipe
W20260928 11:45:22.672258 3302 connection.cc:196] Error closing socket: Network error: TlsSocket::Close: Broken pipe
W20260928 11:45:22.683187 3302 connection.cc:196] Error closing socket: Network error: TlsSocket::Close: Broken pipe
W20260928 11:45:22.694242 3302 connection.cc:196] Error closing socket: Network error: TlsSocket::Close: Broken pipe
W20260928 11:45:22.694343 3303 acceptor_pool.cc:285] unable to collect diagnostics on RPC socket unix:/tmp/dist-test-taskYPfJfR/test-tmp/rpc-test-e6cbad776b8a4a3cbf92288e02d9a34f.sock: Not implemented: netlink diagnostics is currently supported only on IPv4 TCP sockets
W20260928 11:45:22.705307 3302 connection.cc:196] Error closing socket: Network error: TlsSocket::Close: Broken pipe
W20260928 11:45:22.716228 3302 connection.cc:196] Error closing socket: Network error: TlsSocket::Close: Broken pipe
W20260928 11:45:22.725692 3302 connection.cc:196] Error closing socket: Network error: TlsSocket::Close: Broken pipe
W20260928 11:45:22.735311 3302 connection.cc:196] Error closing socket: Network error: TlsSocket::Close: Broken pipe
W20260928 11:45:22.744802 3302 connection.cc:196] Error closing socket: Network error: TlsSocket::Close: Broken pipe
W20260928 11:45:22.754230 3302 connection.cc:196] Error closing socket: Network error: TlsSocket::Close: Broken pipe
W20260928 11:45:22.764146 3302 connection.cc:196] Error closing socket: Network error: TlsSocket::Close: Broken pipe
W20260928 11:45:22.774585 3302 connection.cc:196] Error closing socket: Network error: TlsSocket::Close: Broken pipe
W20260928 11:45:22.784368 3302 connection.cc:196] Error closing socket: Network error: TlsSocket::Close: Broken pipe
W20260928 11:45:22.794463 3302 connection.cc:196] Error closing socket: Network error: TlsSocket::Close: Broken pipe
W20260928 11:45:22.804065 3302 connection.cc:196] Error closing socket: Network error: TlsSocket::Close: Broken pipe
W20260928 11:45:22.813340 3302 connection.cc:196] Error closing socket: Network error: TlsSocket::Close: Broken pipe
W20260928 11:45:22.822252 3302 connection.cc:196] Error closing socket: Network error: TlsSocket::Close: Broken pipe
W20260928 11:45:22.830668 3302 connection.cc:196] Error closing socket: Network error: TlsSocket::Close: Broken pipe
W20260928 11:45:22.839213 3302 connection.cc:196] Error closing socket: Network error: TlsSocket::Close: Broken pipe
W20260928 11:45:22.847769 3302 connection.cc:196] Error closing socket: Network error: TlsSocket::Close: Broken pipe
W20260928 11:45:22.856889 3302 connection.cc:196] Error closing socket: Network error: TlsSocket::Close: Broken pipe
W20260928 11:45:22.867506 3302 connection.cc:196] Error closing socket: Network error: TlsSocket::Close: Broken pipe
[ OK ] Parameters/TestRpc.TestReopenOutboundConnections/SSL_UnixSocket (368 ms)
[ RUN ] Parameters/TestRpc.TestConnectionNetworkPlane/SSL_UnixSocket
I20260928 11:45:22.914557 3326 acceptor_pool.cc:254] collecting diagnostics on the listening RPC socket unix:/tmp/dist-test-taskYPfJfR/test-tmp/rpc-test-3b86ca61f34d441c836abdd96370a35c.sock every 8 connection(s)
I20260928 11:45:22.915257 3327 acceptor_pool.cc:254] collecting diagnostics on the listening RPC socket unix:/tmp/dist-test-taskYPfJfR/test-tmp/rpc-test-3b86ca61f34d441c836abdd96370a35c.sock every 8 connection(s)
I20260928 11:45:22.918550 3087 rpc-test.cc:772] Connecting to unix:/tmp/dist-test-taskYPfJfR/test-tmp/rpc-test-3b86ca61f34d441c836abdd96370a35c.sock
W20260928 11:45:22.957439 3325 connection.cc:196] Error closing socket: Network error: TlsSocket::Close: Broken pipe
W20260928 11:45:22.958310 3325 connection.cc:196] Error closing socket: Network error: TlsSocket::Close: Broken pipe
[ OK ] Parameters/TestRpc.TestConnectionNetworkPlane/SSL_UnixSocket (91 ms)
[ RUN ] Parameters/TestRpc.TestTCPKeepalive/SSL_UnixSocket
I20260928 11:45:22.993760 3351 acceptor_pool.cc:254] collecting diagnostics on the listening RPC socket unix:/tmp/dist-test-taskYPfJfR/test-tmp/rpc-test-3a3568c75dc047ec915b8e254a6354f6.sock every 8 connection(s)
I20260928 11:45:22.994504 3352 acceptor_pool.cc:254] collecting diagnostics on the listening RPC socket unix:/tmp/dist-test-taskYPfJfR/test-tmp/rpc-test-3a3568c75dc047ec915b8e254a6354f6.sock every 8 connection(s)
I20260928 11:45:23.026124 3355 rpc-test-base.h:222] got call: sleep_micros: 8000000 deferred: true
I20260928 11:45:31.030138 3355 rpcz_store.cc:275] Call kudu.rpc.GenericCalculatorService.Sleep from unix:<unnamed> (request call id 0) took 8004 ms. Trace:
I20260928 11:45:31.030527 3355 rpcz_store.cc:276] 0928 11:45:23.025956 (+ 0us) service_pool.cc:170] Inserting onto call queue
0928 11:45:23.026068 (+ 112us) service_pool.cc:227] Handling call
0928 11:45:31.029978 (+8003910us) inbound_call.cc:173] Queueing success response
Metrics: {}
W20260928 11:45:31.037343 3348 connection.cc:196] Error closing socket: Network error: TlsSocket::Close: Broken pipe
[ OK ] Parameters/TestRpc.TestTCPKeepalive/SSL_UnixSocket (8080 ms)
[ RUN ] Parameters/TestRpc.TestMaxSmallSidecars/SSL_UnixSocket
I20260928 11:45:31.073421 3377 acceptor_pool.cc:254] collecting diagnostics on the listening RPC socket unix:/tmp/dist-test-taskYPfJfR/test-tmp/rpc-test-59e53d028f4b4fde93b73be17790e0a6.sock every 8 connection(s)
I20260928 11:45:31.074364 3378 acceptor_pool.cc:254] collecting diagnostics on the listening RPC socket unix:/tmp/dist-test-taskYPfJfR/test-tmp/rpc-test-59e53d028f4b4fde93b73be17790e0a6.sock every 8 connection(s)
W20260928 11:45:31.241986 3374 connection.cc:196] Error closing socket: Network error: TlsSocket::Close: Broken pipe
[ OK ] Parameters/TestRpc.TestMaxSmallSidecars/SSL_UnixSocket (202 ms)
[ RUN ] Parameters/TestRpc.TestCallTimeout/SSL_UnixSocket
I20260928 11:45:31.263290 3402 acceptor_pool.cc:254] collecting diagnostics on the listening RPC socket unix:/tmp/dist-test-taskYPfJfR/test-tmp/rpc-test-256d8fe106e34101b080a36cf1f027d0.sock every 8 connection(s)
I20260928 11:45:31.264019 3403 acceptor_pool.cc:254] collecting diagnostics on the listening RPC socket unix:/tmp/dist-test-taskYPfJfR/test-tmp/rpc-test-256d8fe106e34101b080a36cf1f027d0.sock every 8 connection(s)
I20260928 11:45:31.282450 3087 rpc-test-base.h:595] status: Timed out: connection negotiation to unix:/tmp/dist-test-taskYPfJfR/test-tmp/rpc-test-256d8fe106e34101b080a36cf1f027d0.sock for RPC Sleep timed out after 0.000s (ON_OUTBOUND_QUEUE), seconds elapsed: 0.00231315
I20260928 11:45:31.289482 3406 rpc-test-base.h:222] got call: sleep_micros: 700000
I20260928 11:45:31.484248 3087 rpc-test-base.h:595] status: Timed out: Sleep RPC to unix:/tmp/dist-test-taskYPfJfR/test-tmp/rpc-test-256d8fe106e34101b080a36cf1f027d0.sock timed out after 0.200s (SENT), seconds elapsed: 0.201383
I20260928 11:45:31.485518 3405 rpc-test-base.h:222] got call: sleep_micros: 2000000
W20260928 11:45:31.990161 3406 rpcz_store.cc:267] Call kudu.rpc.GenericCalculatorService.Sleep from unix:<unnamed> (request call id 1) took 700 ms (client timeout 200 ms). Trace:
W20260928 11:45:31.990556 3406 rpcz_store.cc:269] 0928 11:45:31.289335 (+ 0us) service_pool.cc:170] Inserting onto call queue
0928 11:45:31.289437 (+ 102us) service_pool.cc:227] Handling call
0928 11:45:31.990091 (+700654us) inbound_call.cc:173] Queueing success response
Metrics: {}
I20260928 11:45:32.986641 3087 rpc-test-base.h:595] status: Timed out: Sleep RPC to unix:/tmp/dist-test-taskYPfJfR/test-tmp/rpc-test-256d8fe106e34101b080a36cf1f027d0.sock timed out after 1.500s (SENT), seconds elapsed: 1.50206
W20260928 11:45:33.486157 3405 rpcz_store.cc:267] Call kudu.rpc.GenericCalculatorService.Sleep from unix:<unnamed> (request call id 2) took 2000 ms (client timeout 1500 ms). Trace:
W20260928 11:45:33.486562 3405 rpcz_store.cc:269] 0928 11:45:31.485322 (+ 0us) service_pool.cc:170] Inserting onto call queue
0928 11:45:31.485461 (+ 139us) service_pool.cc:227] Handling call
0928 11:45:33.486063 (+2000602us) inbound_call.cc:173] Queueing success response
Metrics: {}
W20260928 11:45:33.487151 3399 connection.cc:441] server connection from unix:<unnamed> torn down before Call kudu.rpc.GenericCalculatorService.Sleep from unix:<unnamed> (request call id 2) could send its response
[ OK ] Parameters/TestRpc.TestCallTimeout/SSL_UnixSocket (2244 ms)
[ RUN ] Parameters/TestRpc.TestServerShutsDown/SSL_UnixSocket
I20260928 11:45:33.494206 3087 rpc-test.cc:1125] Connecting to 0.0.0.0:40839
W20260928 11:45:33.504405 3419 negotiation.cc:337] Failed RPC negotiation. Trace:
0928 11:45:33.502884 (+ 0us) reactor.cc:625] Submitting negotiation task for client connection to 0.0.0.0:40839 (local address 127.0.0.1:57008)
0928 11:45:33.503360 (+ 476us) negotiation.cc:107] Waiting for socket to connect
0928 11:45:33.503393 (+ 33us) client_negotiation.cc:174] Beginning negotiation
0928 11:45:33.503644 (+ 251us) client_negotiation.cc:252] Sending NEGOTIATE NegotiatePB request
0928 11:45:33.503888 (+ 244us) negotiation.cc:327] Negotiation complete: Network error: Client connection negotiation failed: client connection to 0.0.0.0:40839: BlockingWrite error: write error: Broken pipe (error 32)
Metrics: {"client-negotiator.queue_time_us":116}
[ OK ] Parameters/TestRpc.TestServerShutsDown/SSL_UnixSocket (14 ms)
[ RUN ] Parameters/TestRpc.TimedOutOnResponseMetric/SSL_UnixSocket
I20260928 11:45:33.529218 3436 acceptor_pool.cc:254] collecting diagnostics on the listening RPC socket unix:/tmp/dist-test-taskYPfJfR/test-tmp/rpc-test-8faaac21e75d490b9a4cfbb46ecd2cae.sock every 8 connection(s)
I20260928 11:45:33.529906 3437 acceptor_pool.cc:254] collecting diagnostics on the listening RPC socket unix:/tmp/dist-test-taskYPfJfR/test-tmp/rpc-test-8faaac21e75d490b9a4cfbb46ecd2cae.sock every 8 connection(s)
W20260928 11:45:33.778329 3440 rpcz_store.cc:267] Call kudu.rpc_test.CalculatorService.Sleep from unix:<unnamed> (request call id 3) took 50 ms (client timeout 25 ms). Trace:
W20260928 11:45:33.778630 3440 rpcz_store.cc:269] 0928 11:45:33.727727 (+ 0us) service_pool.cc:170] Inserting onto call queue
0928 11:45:33.727863 (+ 136us) service_pool.cc:227] Handling call
0928 11:45:33.778255 (+ 50392us) inbound_call.cc:173] Queueing success response
Related trace 'test_child':
Metrics: {"test_sleep_us":50000,"child_traces":[["test_child",{"related_trace_metric":1}]]}
W20260928 11:45:33.837541 3440 rpcz_store.cc:267] Call kudu.rpc_test.CalculatorService.Sleep from unix:<unnamed> (request call id 4) took 50 ms (client timeout 50 ms). Trace:
W20260928 11:45:33.837963 3440 rpcz_store.cc:269] 0928 11:45:33.786954 (+ 0us) service_pool.cc:170] Inserting onto call queue
0928 11:45:33.787091 (+ 137us) service_pool.cc:227] Handling call
0928 11:45:33.837473 (+ 50382us) inbound_call.cc:173] Queueing success response
Related trace 'test_child':
Metrics: {"test_sleep_us":50000,"child_traces":[["test_child",{"related_trace_metric":1}]]}
W20260928 11:45:33.841598 3433 connection.cc:196] Error closing socket: Network error: TlsSocket::Close: Broken pipe
[ OK ] Parameters/TestRpc.TimedOutOnResponseMetric/SSL_UnixSocket (339 ms)
[ RUN ] Parameters/TestRpc.AcceptorDispatchingTimesMetric/SSL_UnixSocket
I20260928 11:45:33.858289 3461 acceptor_pool.cc:254] collecting diagnostics on the listening RPC socket 0.0.0.0:39439 every 8 connection(s)
I20260928 11:45:33.858960 3462 acceptor_pool.cc:254] collecting diagnostics on the listening RPC socket 0.0.0.0:39439 every 8 connection(s)
W20260928 11:45:33.864351 3457 negotiation.cc:337] Failed RPC negotiation. Trace:
0928 11:45:33.862641 (+ 0us) reactor.cc:625] Submitting negotiation task for server connection from 127.0.0.1:32886 (local address 127.0.0.1:39439)
0928 11:45:33.863256 (+ 615us) server_negotiation.cc:206] Beginning negotiation
0928 11:45:33.863295 (+ 39us) server_negotiation.cc:399] Waiting for connection header
0928 11:45:33.863577 (+ 282us) negotiation.cc:327] Negotiation complete: Network error: Server connection negotiation failed: server connection from 127.0.0.1:32886: BlockingRecv error: recv got EOF from 127.0.0.1:32886 (error 108)
Metrics: {"server-negotiator.queue_time_us":164}
[ OK ] Parameters/TestRpc.AcceptorDispatchingTimesMetric/SSL_UnixSocket (20 ms)
[ RUN ] Parameters/TestRpc.TestRpcCallbackDestroysMessenger/SSL_UnixSocket
[ OK ] Parameters/TestRpc.TestRpcCallbackDestroysMessenger/SSL_UnixSocket (31 ms)
[ RUN ] Parameters/TestRpc.TestApplicationFeatureFlag/SSL_UnixSocket
I20260928 11:45:33.914274 3486 acceptor_pool.cc:254] collecting diagnostics on the listening RPC socket unix:/tmp/dist-test-taskYPfJfR/test-tmp/rpc-test-1228592297a946059b1673809d31ce19.sock every 8 connection(s)
I20260928 11:45:33.915019 3487 acceptor_pool.cc:254] collecting diagnostics on the listening RPC socket unix:/tmp/dist-test-taskYPfJfR/test-tmp/rpc-test-1228592297a946059b1673809d31ce19.sock every 8 connection(s)
W20260928 11:45:33.946709 3483 messenger.cc:357] Unable to handle RPC call: Not implemented: call requires unsupported application feature flags: 99
W20260928 11:45:33.949859 3483 connection.cc:196] Error closing socket: Network error: TlsSocket::Close: Broken pipe
[ OK ] Parameters/TestRpc.TestApplicationFeatureFlag/SSL_UnixSocket (56 ms)
[ RUN ] Parameters/TestRpc.TestCancellation/SSL_UnixSocket
I20260928 11:45:33.978561 3511 acceptor_pool.cc:254] collecting diagnostics on the listening RPC socket unix:/tmp/dist-test-taskYPfJfR/test-tmp/rpc-test-5bb6ac7de0524d8db42bf4a77f0d6238.sock every 8 connection(s)
I20260928 11:45:33.979332 3512 acceptor_pool.cc:254] collecting diagnostics on the listening RPC socket unix:/tmp/dist-test-taskYPfJfR/test-tmp/rpc-test-5bb6ac7de0524d8db42bf4a77f0d6238.sock every 8 connection(s)
I20260928 11:45:33.982793 3087 rpc-test.cc:1648] Connecting to unix:/tmp/dist-test-taskYPfJfR/test-tmp/rpc-test-5bb6ac7de0524d8db42bf4a77f0d6238.sock
I20260928 11:45:34.086983 3087 rpc-test-base.h:595] status: Aborted: Sleep RPC to unix:/tmp/dist-test-taskYPfJfR/test-tmp/rpc-test-5bb6ac7de0524d8db42bf4a77f0d6238.sock is cancelled in state READY, seconds elapsed: 0.000413015
I20260928 11:45:34.291332 3087 rpc-test-base.h:595] status: Aborted: Sleep RPC to unix:/tmp/dist-test-taskYPfJfR/test-tmp/rpc-test-5bb6ac7de0524d8db42bf4a77f0d6238.sock is cancelled in state SENT, seconds elapsed: 0.000971726
I20260928 11:45:34.291527 3514 rpc-test-base.h:222] got call: sleep_micros: 510000
I20260928 11:45:34.486656 3087 rpc-test-base.h:595] status: Aborted: Sleep RPC to unix:/tmp/dist-test-taskYPfJfR/test-tmp/rpc-test-5bb6ac7de0524d8db42bf4a77f0d6238.sock is cancelled in state SENT, seconds elapsed: 0.00095467
I20260928 11:45:34.486856 3513 rpc-test-base.h:222] got call: sleep_micros: 510000
I20260928 11:45:34.675791 3087 rpc-test-base.h:595] status: Aborted: Sleep RPC to unix:/tmp/dist-test-taskYPfJfR/test-tmp/rpc-test-5bb6ac7de0524d8db42bf4a77f0d6238.sock is cancelled in state SENT, seconds elapsed: 0.000900775
W20260928 11:45:34.686372 3515 rpcz_store.cc:267] Call kudu.rpc.GenericCalculatorService.Sleep from unix:<unnamed> (request call id 11) took 10 ms (client timeout 10 ms). Trace:
W20260928 11:45:34.686704 3515 rpcz_store.cc:269] 0928 11:45:34.675795 (+ 0us) service_pool.cc:170] Inserting onto call queue
0928 11:45:34.686097 (+ 10302us) service_pool.cc:214] Skipping call since client already timed out
0928 11:45:34.686178 (+ 81us) inbound_call.cc:173] Queueing failure response
Metrics: {}
I20260928 11:45:34.687218 3515 rpc-test-base.h:222] got call: sleep_micros: 1500000
W20260928 11:45:34.802114 3514 rpcz_store.cc:267] Call kudu.rpc.GenericCalculatorService.Sleep from unix:<unnamed> (request call id 3) took 510 ms (client timeout 10 ms). Trace:
W20260928 11:45:34.802443 3514 rpcz_store.cc:269] 0928 11:45:34.291355 (+ 0us) service_pool.cc:170] Inserting onto call queue
0928 11:45:34.291481 (+ 126us) service_pool.cc:227] Handling call
0928 11:45:34.802057 (+510576us) inbound_call.cc:173] Queueing success response
Metrics: {}
W20260928 11:45:34.997431 3513 rpcz_store.cc:267] Call kudu.rpc.GenericCalculatorService.Sleep from unix:<unnamed> (request call id 7) took 510 ms (client timeout 10 ms). Trace:
W20260928 11:45:34.997728 3513 rpcz_store.cc:269] 0928 11:45:34.486656 (+ 0us) service_pool.cc:170] Inserting onto call queue
0928 11:45:34.486799 (+ 143us) service_pool.cc:227] Handling call
0928 11:45:34.997376 (+510577us) inbound_call.cc:173] Queueing success response
Metrics: {}
I20260928 11:45:35.678144 3087 rpc-test-base.h:595] status: Timed out: Sleep RPC to unix:/tmp/dist-test-taskYPfJfR/test-tmp/rpc-test-5bb6ac7de0524d8db42bf4a77f0d6238.sock timed out after 1.000s (SENT), seconds elapsed: 1.00187
I20260928 11:45:35.680262 3513 rpc-test-base.h:222] got call: sleep_micros: 1500000
W20260928 11:45:36.187927 3515 rpcz_store.cc:267] Call kudu.rpc.GenericCalculatorService.Sleep from unix:<unnamed> (request call id 12) took 1511 ms (client timeout 1000 ms). Trace:
W20260928 11:45:36.188282 3515 rpcz_store.cc:269] 0928 11:45:34.676812 (+ 0us) service_pool.cc:170] Inserting onto call queue
0928 11:45:34.687190 (+ 10378us) service_pool.cc:227] Handling call
0928 11:45:36.187786 (+1500596us) inbound_call.cc:173] Queueing success response
Metrics: {}
I20260928 11:45:36.680783 3087 rpc-test-base.h:595] status: Timed out: Sleep RPC to unix:/tmp/dist-test-taskYPfJfR/test-tmp/rpc-test-5bb6ac7de0524d8db42bf4a77f0d6238.sock timed out after 1.000s (SENT), seconds elapsed: 1.00205
W20260928 11:45:36.682349 3508 messenger.cc:357] Unable to handle RPC call: Not implemented: call requires unsupported application feature flags: 99, 1
W20260928 11:45:36.684120 3508 messenger.cc:357] Unable to handle RPC call: Not implemented: call requires unsupported application feature flags: 99, 1
W20260928 11:45:36.898155 3508 connection.cc:196] Error closing socket: Network error: TlsSocket::Close: Broken pipe
W20260928 11:45:37.181017 3513 rpcz_store.cc:267] Call kudu.rpc.GenericCalculatorService.Sleep from unix:<unnamed> (request call id 13) took 1501 ms (client timeout 1000 ms). Trace:
W20260928 11:45:37.181344 3513 rpcz_store.cc:269] 0928 11:45:35.679922 (+ 0us) service_pool.cc:170] Inserting onto call queue
0928 11:45:35.680139 (+ 217us) service_pool.cc:227] Handling call
0928 11:45:37.180963 (+1500824us) inbound_call.cc:173] Queueing success response
Metrics: {}
W20260928 11:45:37.181882 3508 connection.cc:441] server connection from unix:<unnamed> torn down before Call kudu.rpc.GenericCalculatorService.Sleep from unix:<unnamed> (request call id 13) could send its response
[ OK ] Parameters/TestRpc.TestCancellation/SSL_UnixSocket (3234 ms)
[ RUN ] Parameters/TestRpc.TestCancellationMultiThreads/SSL_UnixSocket
I20260928 11:45:37.220018 3537 acceptor_pool.cc:254] collecting diagnostics on the listening RPC socket unix:/tmp/dist-test-taskYPfJfR/test-tmp/rpc-test-95fd0a64f9ae4874b37223ea36ab433d.sock every 8 connection(s)
I20260928 11:45:37.220878 3538 acceptor_pool.cc:254] collecting diagnostics on the listening RPC socket unix:/tmp/dist-test-taskYPfJfR/test-tmp/rpc-test-95fd0a64f9ae4874b37223ea36ab433d.sock every 8 connection(s)
I20260928 11:45:37.224048 3087 rpc-test.cc:1808] Connecting to unix:/tmp/dist-test-taskYPfJfR/test-tmp/rpc-test-95fd0a64f9ae4874b37223ea36ab433d.sock
I20260928 11:45:37.374696 3551 test_util.cc:268] Using random seed: -1698131588
I20260928 11:45:37.377359 3552 test_util.cc:268] Using random seed: -1698128845
I20260928 11:45:37.378680 3553 test_util.cc:268] Using random seed: -1698127523
I20260928 11:45:37.380661 3554 test_util.cc:268] Using random seed: -1698125632
I20260928 11:45:37.382120 3555 test_util.cc:268] Using random seed: -1698124180
I20260928 11:45:37.383486 3556 test_util.cc:268] Using random seed: -1698122850
I20260928 11:45:37.385259 3557 test_util.cc:268] Using random seed: -1698121105
I20260928 11:45:37.386669 3558 test_util.cc:268] Using random seed: -1698119665
I20260928 11:45:37.388433 3559 test_util.cc:268] Using random seed: -1698117924
I20260928 11:45:37.389920 3560 test_util.cc:268] Using random seed: -1698116474
I20260928 11:45:37.392118 3561 test_util.cc:268] Using random seed: -1698114247
I20260928 11:45:37.394820 3562 test_util.cc:268] Using random seed: -1698111584
I20260928 11:45:37.397310 3563 test_util.cc:268] Using random seed: -1698109090
I20260928 11:45:37.399253 3564 test_util.cc:268] Using random seed: -1698107161
I20260928 11:45:37.401240 3565 test_util.cc:268] Using random seed: -1698105177
I20260928 11:45:37.402956 3566 test_util.cc:268] Using random seed: -1698103453
I20260928 11:45:37.404964 3567 test_util.cc:268] Using random seed: -1698101409
I20260928 11:45:37.406687 3568 test_util.cc:268] Using random seed: -1698099699
I20260928 11:45:37.408555 3569 test_util.cc:268] Using random seed: -1698097850
I20260928 11:45:37.410138 3570 test_util.cc:268] Using random seed: -1698096205
I20260928 11:45:37.411926 3571 test_util.cc:268] Using random seed: -1698094499
I20260928 11:45:37.414669 3572 test_util.cc:268] Using random seed: -1698091744
I20260928 11:45:37.418643 3573 test_util.cc:268] Using random seed: -1698087729
I20260928 11:45:37.425323 3574 test_util.cc:268] Using random seed: -1698080999
I20260928 11:45:37.428290 3575 test_util.cc:268] Using random seed: -1698078130
I20260928 11:45:37.429899 3576 test_util.cc:268] Using random seed: -1698076468
I20260928 11:45:37.431804 3577 test_util.cc:268] Using random seed: -1698074581
I20260928 11:45:37.433378 3578 test_util.cc:268] Using random seed: -1698072983
I20260928 11:45:37.435320 3579 test_util.cc:268] Using random seed: -1698071082
I20260928 11:45:37.437127 3580 test_util.cc:268] Using random seed: -1698069207
W20260928 11:45:57.758646 3534 connection.cc:196] Error closing socket: Network error: TlsSocket::Close: Broken pipe
[ OK ] Parameters/TestRpc.TestCancellationMultiThreads/SSL_UnixSocket (20588 ms)
[ RUN ] Parameters/TestRpc.TestCallId/SSL_UnixSocket
I20260928 11:45:57.812256 3594 acceptor_pool.cc:254] collecting diagnostics on the listening RPC socket unix:/tmp/dist-test-taskYPfJfR/test-tmp/rpc-test-7f71933b4ada4c22a13105f686b20e7f.sock every 8 connection(s)
I20260928 11:45:57.813128 3595 acceptor_pool.cc:254] collecting diagnostics on the listening RPC socket unix:/tmp/dist-test-taskYPfJfR/test-tmp/rpc-test-7f71933b4ada4c22a13105f686b20e7f.sock every 8 connection(s)
[ OK ] Parameters/TestRpc.TestCallId/SSL_UnixSocket (80 ms)
[----------] 20 tests from Parameters/TestRpc (39132 ms total)
[----------] Global test environment tear-down
[==========] 21 tests from 2 test suites ran. (42382 ms total)
[ PASSED ] 20 tests.
[ FAILED ] 1 test, listed below:
[ FAILED ] Parameters/TestRpc.TestCallWithChainCertAndRootCA/SSL_UnixSocket, where GetParam() = (true, true)
1 FAILED TEST
I20260928 11:45:57.878012 3087 logging.cc:424] LogThrottler /data0/somelongdirectorytoavoidrpathissues/src/kudu/src/kudu/rpc/acceptor_pool.cc:285: suppressed but not reported on 3 messages since previous log ~35 seconds ago