Diagnosed failure

Parameters/TestRpc.TestCallWithChainCertAndChainCA/SSL_TCP: /data0/somelongdirectorytoavoidrpathissues/src/kudu/src/kudu/rpc/rpc-test.cc:270: Failure
Failed
Bad status: Runtime error: could not verify certificate chain (error with cert: subject=CN = localhost, ST = sadfjas, C = AS, emailAddress = sdflkdsajf, O = lskdfjlsad, OU = sldfkja, issuer=C = AS, ST = ASDfkjdhf, L = lskdjf, O = saldfja, OU = skdjf, CN = localhost, emailAddress = sadjflkadsj): : certificate has expired
Google Test trace:
/data0/somelongdirectorytoavoidrpathissues/src/kudu/src/kudu/rpc/rpc-test.cc:267: Connecting to 0.0.0.0:34607
I20260924 18:59:26.158813   379 test_util.cc:175] -----------------------------------------------
I20260924 18:59:26.158921   379 test_util.cc:176] Had fatal failures, leaving test files at /tmp/dist-test-taskyXqA4A/test-tmp/rpc-test.5.Parameters_TestRpc.TestCallWithChainCertAndChainCA_SSL_TCP.1790276366008460-379-0

Full log

Note: This is test shard 6 of 8.
[==========] Running 21 tests from 2 test suites.
[----------] Global test environment set-up.
[----------] 20 tests from Parameters/TestRpc
[ RUN      ] Parameters/TestRpc.TestMessengerCreateDestroy/SSL_TCP
WARNING: Logging before InitGoogleLogging() is written to STDERR
I20260924 18:59:26.061995   379 rpc-test.cc:169] started messenger TestCreateDestroy
[       OK ] Parameters/TestRpc.TestMessengerCreateDestroy/SSL_TCP (38 ms)
[ RUN      ] Parameters/TestRpc.TestNegotiationDeadlock/SSL_TCP
I20260924 18:59:26.093096   399 acceptor_pool.cc:254] collecting diagnostics on the listening RPC socket 0.0.0.0:43351 every 8 connection(s)
I20260924 18:59:26.093436   400 acceptor_pool.cc:254] collecting diagnostics on the listening RPC socket 0.0.0.0:43351 every 8 connection(s)
[       OK ] Parameters/TestRpc.TestNegotiationDeadlock/SSL_TCP (58 ms)
[ RUN      ] Parameters/TestRpc.TestCallWithChainCertAndChainCA/SSL_TCP
I20260924 18:59:26.147691   415 acceptor_pool.cc:254] collecting diagnostics on the listening RPC socket 0.0.0.0:34607 every 8 connection(s)
I20260924 18:59:26.148070   416 acceptor_pool.cc:254] collecting diagnostics on the listening RPC socket 0.0.0.0:34607 every 8 connection(s)
/data0/somelongdirectorytoavoidrpathissues/src/kudu/src/kudu/rpc/rpc-test.cc:270: Failure
Failed
Bad status: Runtime error: could not verify certificate chain (error with cert: subject=CN = localhost, ST = sadfjas, C = AS, emailAddress = sdflkdsajf, O = lskdfjlsad, OU = sldfkja, issuer=C = AS, ST = ASDfkjdhf, L = lskdjf, O = saldfja, OU = skdjf, CN = localhost, emailAddress = sadjflkadsj): : certificate has expired
Google Test trace:
/data0/somelongdirectorytoavoidrpathissues/src/kudu/src/kudu/rpc/rpc-test.cc:267: Connecting to 0.0.0.0:34607
I20260924 18:59:26.158813   379 test_util.cc:175] -----------------------------------------------
I20260924 18:59:26.158921   379 test_util.cc:176] Had fatal failures, leaving test files at /tmp/dist-test-taskyXqA4A/test-tmp/rpc-test.5.Parameters_TestRpc.TestCallWithChainCertAndChainCA_SSL_TCP.1790276366008460-379-0
[  FAILED  ] Parameters/TestRpc.TestCallWithChainCertAndChainCA/SSL_TCP, where GetParam() = (true, false) (35 ms)
[ RUN      ] Parameters/TestRpc.TestCallWithPasswordProtectedKey/SSL_TCP
I20260924 18:59:26.212598   440 acceptor_pool.cc:254] collecting diagnostics on the listening RPC socket 0.0.0.0:44085 every 8 connection(s)
I20260924 18:59:26.212750   441 acceptor_pool.cc:254] collecting diagnostics on the listening RPC socket 0.0.0.0:44085 every 8 connection(s)
[       OK ] Parameters/TestRpc.TestCallWithPasswordProtectedKey/SSL_TCP (86 ms)
[ RUN      ] Parameters/TestRpc.TestCallToBadServer/SSL_TCP
I20260924 18:59:26.280692   379 rpc-test.cc:394] Status: Network error: Client connection negotiation failed: client connection to 0.0.0.0:0: connect: Connection refused (error 111)
I20260924 18:59:26.281405   379 rpc-test.cc:394] Status: Network error: Client connection negotiation failed: client connection to 0.0.0.0:0: connect: Connection refused (error 111)
I20260924 18:59:26.282070   379 rpc-test.cc:394] Status: Network error: Client connection negotiation failed: client connection to 0.0.0.0:0: connect: Connection refused (error 111)
I20260924 18:59:26.282618   379 rpc-test.cc:394] Status: Network error: Client connection negotiation failed: client connection to 0.0.0.0:0: connect: Connection refused (error 111)
I20260924 18:59:26.283208   379 rpc-test.cc:394] Status: Network error: Client connection negotiation failed: client connection to 0.0.0.0:0: connect: Connection refused (error 111)
[       OK ] Parameters/TestRpc.TestCallToBadServer/SSL_TCP (39 ms)
[ RUN      ] Parameters/TestRpc.TestWrongService/SSL_TCP
I20260924 18:59:26.302845   475 acceptor_pool.cc:254] collecting diagnostics on the listening RPC socket 0.0.0.0:35881 every 8 connection(s)
I20260924 18:59:26.303076   476 acceptor_pool.cc:254] collecting diagnostics on the listening RPC socket 0.0.0.0:35881 every 8 connection(s)
I20260924 18:59:26.336776   473 messenger.cc:345] service WrongServiceName not registered on TestServer
[       OK ] Parameters/TestRpc.TestWrongService/SSL_TCP (57 ms)
[ RUN      ] Parameters/TestRpc.TestConnectionKeepalive/SSL_TCP
I20260924 18:59:26.367867   498 acceptor_pool.cc:254] collecting diagnostics on the listening RPC socket 0.0.0.0:46801 every 8 connection(s)
I20260924 18:59:26.368196   499 acceptor_pool.cc:254] collecting diagnostics on the listening RPC socket 0.0.0.0:46801 every 8 connection(s)
I20260924 18:59:26.369204   379 rpc-test.cc:488] Connecting to 0.0.0.0:46801
[       OK ] Parameters/TestRpc.TestConnectionKeepalive/SSL_TCP (1065 ms)
[ RUN      ] Parameters/TestRpc.TestClientConnectionMetrics/SSL_TCP
I20260924 18:59:27.425112   523 acceptor_pool.cc:254] collecting diagnostics on the listening RPC socket 0.0.0.0:35291 every 8 connection(s)
I20260924 18:59:27.425362   524 acceptor_pool.cc:254] collecting diagnostics on the listening RPC socket 0.0.0.0:35291 every 8 connection(s)
I20260924 18:59:27.426371   379 rpc-test.cc:569] Connecting to 0.0.0.0:35291
[       OK ] Parameters/TestRpc.TestClientConnectionMetrics/SSL_TCP (18700 ms)
[ RUN      ] Parameters/TestRpc.TestCredentialsPolicy/SSL_TCP
I20260924 18:59:46.126148   546 acceptor_pool.cc:254] collecting diagnostics on the listening RPC socket 0.0.0.0:43637 every 8 connection(s)
I20260924 18:59:46.126444   547 acceptor_pool.cc:254] collecting diagnostics on the listening RPC socket 0.0.0.0:43637 every 8 connection(s)
I20260924 18:59:46.127534   379 rpc-test.cc:700] Connecting to 0.0.0.0:43637
[       OK ] Parameters/TestRpc.TestCredentialsPolicy/SSL_TCP (76 ms)
[ RUN      ] Parameters/TestRpc.TestCallLongerThanKeepalive/SSL_TCP
I20260924 18:59:46.205070   571 acceptor_pool.cc:254] collecting diagnostics on the listening RPC socket 0.0.0.0:45797 every 8 connection(s)
I20260924 18:59:46.205318   572 acceptor_pool.cc:254] collecting diagnostics on the listening RPC socket 0.0.0.0:45797 every 8 connection(s)
I20260924 18:59:46.236174   575 rpc-test-base.h:222] got call: sleep_micros: 3000000 deferred: true
I20260924 18:59:49.237854   575 rpcz_store.cc:275] Call kudu.rpc.GenericCalculatorService.Sleep from 127.0.0.1:45166 (request call id 0) took 3001 ms. Trace:
I20260924 18:59:49.238042   575 rpcz_store.cc:276] 0924 18:59:46.236071 (+     0us) service_pool.cc:170] Inserting onto call queue
0924 18:59:46.236133 (+    62us) service_pool.cc:227] Handling call
0924 18:59:49.237800 (+3001667us) inbound_call.cc:173] Queueing success response
Metrics: {}
[       OK ] Parameters/TestRpc.TestCallLongerThanKeepalive/SSL_TCP (3059 ms)
[ RUN      ] Parameters/TestRpc.TestRpcSidecar/SSL_TCP
I20260924 18:59:49.274163   596 acceptor_pool.cc:254] collecting diagnostics on the listening RPC socket 0.0.0.0:37807 every 8 connection(s)
I20260924 18:59:49.274382   597 acceptor_pool.cc:254] collecting diagnostics on the listening RPC socket 0.0.0.0:37807 every 8 connection(s)
[       OK ] Parameters/TestRpc.TestRpcSidecar/SSL_TCP (129 ms)
[ RUN      ] Parameters/TestRpc.TestRpcSidecarLimits/SSL_TCP
I20260924 18:59:51.443958   621 acceptor_pool.cc:254] collecting diagnostics on the listening RPC socket 0.0.0.0:35681 every 8 connection(s)
I20260924 18:59:51.444088   622 acceptor_pool.cc:254] collecting diagnostics on the listening RPC socket 0.0.0.0:35681 every 8 connection(s)
W20260924 18:59:51.464888   379 serialization.cc:72] Serialized kudu.rpc_test.PushStringsRequestPB (2147483654 bytes) is larger than the maximum configured RPC message size (52428800 bytes). Sending anyway, but peer may reject the data.
W20260924 18:59:51.470618   619 connection.cc:535] server connection from 127.0.0.1:59540 recv error: Network error: RPC frame had a length of 2147483714, but we only support messages up to 52428800 bytes long.
W20260924 18:59:51.470741   619 connection.cc:158] shutting down server connection from 127.0.0.1:59540 with pending inbound data: 4/2147483714 bytes received; last active 0 ns ago: status Network error: RPC frame had a length of 2147483714, but we only support messages up to 52428800 bytes long.
W20260924 18:59:51.471076   634 connection.cc:698] client connection to 0.0.0.0:35681 send error: Network error: failed to write to TLS socket: Connection reset by peer
W20260924 18:59:51.471383   634 connection.cc:196] Error closing socket: Network error: TlsSocket::Close: Success
I20260924 18:59:51.494130   646 acceptor_pool.cc:254] collecting diagnostics on the listening RPC socket 0.0.0.0:39577 every 8 connection(s)
I20260924 18:59:51.494355   647 acceptor_pool.cc:254] collecting diagnostics on the listening RPC socket 0.0.0.0:39577 every 8 connection(s)
W20260924 18:59:56.584758   644 connection.cc:577] server connection from 127.0.0.1:60042: received bad data: 'Corruption: Invalid packet: message had a length of 2147483710, but we only support messages up to 2147483647 bytes
'
[       OK ] Parameters/TestRpc.TestRpcSidecarLimits/SSL_TCP (7669 ms)
[ RUN      ] Parameters/TestRpc.TestCallTimeoutDoesntAffectNegotiation/SSL_TCP
I20260924 18:59:57.068926   671 acceptor_pool.cc:254] collecting diagnostics on the listening RPC socket 0.0.0.0:40369 every 8 connection(s)
I20260924 18:59:57.069164   672 acceptor_pool.cc:254] collecting diagnostics on the listening RPC socket 0.0.0.0:40369 every 8 connection(s)
W20260924 18:59:57.083961   667 negotiation.cc:266] Injecting 500ms delay in negotiation
I20260924 18:59:57.134383   379 rpc-test-base.h:595] status: Timed out: connection negotiation to 0.0.0.0:40369 for RPC Sleep timed out after 0.050s (ON_OUTBOUND_QUEUE), seconds elapsed: 0.0509581
[       OK ] Parameters/TestRpc.TestCallTimeoutDoesntAffectNegotiation/SSL_TCP (550 ms)
[ RUN      ] Parameters/TestRpc.TestRpcHandlerLatencyMetric/SSL_TCP
I20260924 18:59:57.616241   696 acceptor_pool.cc:254] collecting diagnostics on the listening RPC socket 0.0.0.0:34945 every 8 connection(s)
I20260924 18:59:57.616501   697 acceptor_pool.cc:254] collecting diagnostics on the listening RPC socket 0.0.0.0:34945 every 8 connection(s)
I20260924 18:59:57.663094   379 rpc-test.cc:1236] Sleep() min lat: 20575
I20260924 18:59:57.663229   379 rpc-test.cc:1237] Sleep() mean lat: 20575
I20260924 18:59:57.663335   379 rpc-test.cc:1238] Sleep() max lat: 20575
I20260924 18:59:57.663424   379 rpc-test.cc:1239] Sleep() #calls: 1
[       OK ] Parameters/TestRpc.TestRpcHandlerLatencyMetric/SSL_TCP (74 ms)
[ RUN      ] Parameters/TestRpc.TimedOutOnResponseMetricServiceQueue/SSL_TCP
I20260924 18:59:57.698920   722 acceptor_pool.cc:254] collecting diagnostics on the listening RPC socket 0.0.0.0:45863 every 8 connection(s)
I20260924 18:59:57.699151   723 acceptor_pool.cc:254] collecting diagnostics on the listening RPC socket 0.0.0.0:45863 every 8 connection(s)
W20260924 18:59:57.761452   724 rpcz_store.cc:267] Call kudu.rpc_test.CalculatorService.Sleep from 127.0.0.1:34254 (request call id 2) took 20 ms (client timeout 20 ms). Trace:
W20260924 18:59:57.761631   724 rpcz_store.cc:269] 0924 18:59:57.741039 (+     0us) service_pool.cc:170] Inserting onto call queue
0924 18:59:57.761348 (+ 20309us) service_pool.cc:214] Skipping call since client already timed out
0924 18:59:57.761404 (+    56us) inbound_call.cc:173] Queueing failure response
Metrics: {}
[       OK ] Parameters/TestRpc.TimedOutOnResponseMetricServiceQueue/SSL_TCP (97 ms)
[ RUN      ] Parameters/TestRpc.RpcPendingConnectionsMetric/SSL_TCP
I20260924 18:59:57.770527   745 acceptor_pool.cc:254] collecting diagnostics on the listening RPC socket 0.0.0.0:45421 every 8 connection(s)
I20260924 18:59:57.770761   746 acceptor_pool.cc:254] collecting diagnostics on the listening RPC socket 0.0.0.0:45421 every 8 connection(s)
W20260924 18:59:57.783344   741 negotiation.cc:337] Failed RPC negotiation. Trace:
0924 18:59:57.782456 (+     0us) reactor.cc:625] Submitting negotiation task for server connection from 127.0.0.1:36950 (local address 127.0.0.1:45421)
0924 18:59:57.782686 (+   230us) server_negotiation.cc:206] Beginning negotiation
0924 18:59:57.782695 (+     9us) server_negotiation.cc:399] Waiting for connection header
0924 18:59:57.782913 (+   218us) negotiation.cc:327] Negotiation complete: Network error: Server connection negotiation failed: server connection from 127.0.0.1:36950: BlockingRecv error: recv got EOF from 127.0.0.1:36950 (error 108)
Metrics: {"server-negotiator.queue_time_us":63}
[       OK ] Parameters/TestRpc.RpcPendingConnectionsMetric/SSL_TCP (29 ms)
[ RUN      ] Parameters/TestRpc.TestRpcContextClientDeadline/SSL_TCP
I20260924 18:59:57.819681   761 acceptor_pool.cc:254] collecting diagnostics on the listening RPC socket 0.0.0.0:41241 every 8 connection(s)
I20260924 18:59:57.819891   762 acceptor_pool.cc:254] collecting diagnostics on the listening RPC socket 0.0.0.0:41241 every 8 connection(s)
[       OK ] Parameters/TestRpc.TestRpcContextClientDeadline/SSL_TCP (83 ms)
[ RUN      ] Parameters/TestRpc.TestApplicationFeatureFlagUnsupportedServer/SSL_TCP
I20260924 18:59:57.900368   786 acceptor_pool.cc:254] collecting diagnostics on the listening RPC socket 0.0.0.0:33801 every 8 connection(s)
I20260924 18:59:57.900517   787 acceptor_pool.cc:254] collecting diagnostics on the listening RPC socket 0.0.0.0:33801 every 8 connection(s)
[       OK ] Parameters/TestRpc.TestApplicationFeatureFlagUnsupportedServer/SSL_TCP (57 ms)
[ RUN      ] Parameters/TestRpc.TestCancellationAsync/SSL_TCP
I20260924 18:59:57.975812   811 acceptor_pool.cc:254] collecting diagnostics on the listening RPC socket 0.0.0.0:33435 every 8 connection(s)
I20260924 18:59:57.976063   812 acceptor_pool.cc:254] collecting diagnostics on the listening RPC socket 0.0.0.0:33435 every 8 connection(s)
I20260924 18:59:57.976899   379 rpc-test.cc:1716] Connecting to 0.0.0.0:33435
I20260924 18:59:57.991474   379 test_util.cc:268] Using random seed: 885032471
I20260924 18:59:58.024035   815 rpc-test-base.h:240] got call: sleep_micros: 500 pattern: 4294967295 num_repetitions: 2097152 sidecar_idx: 0
I20260924 18:59:58.047652   814 rpc-test-base.h:240] got call: sleep_micros: 500 pattern: 4294967295 num_repetitions: 2097152 sidecar_idx: 0
I20260924 18:59:58.070139   813 rpc-test-base.h:240] got call: sleep_micros: 500 pattern: 4294967295 num_repetitions: 2097152 sidecar_idx: 0
I20260924 18:59:58.095765   815 rpc-test-base.h:240] got call: sleep_micros: 500 pattern: 4294967295 num_repetitions: 2097152 sidecar_idx: 0
I20260924 18:59:58.128331   814 rpc-test-base.h:240] got call: sleep_micros: 500 pattern: 4294967295 num_repetitions: 2097152 sidecar_idx: 0
I20260924 18:59:58.156554   815 rpc-test-base.h:240] got call: sleep_micros: 500 pattern: 4294967295 num_repetitions: 2097152 sidecar_idx: 0
W20260924 18:59:58.197461   808 connection.cc:196] Error closing socket: Network error: TlsSocket::Close: Broken pipe
W20260924 18:59:58.197693   808 connection.cc:441] server connection from 127.0.0.1:54886 torn down before Call kudu.rpc.GenericCalculatorService.SleepWithSidecar from 127.0.0.1:54886 (request call id 7) could send its response
W20260924 18:59:58.219651   808 connection.cc:441] server connection from 127.0.0.1:54886 torn down before Call kudu.rpc.GenericCalculatorService.SleepWithSidecar from 127.0.0.1:54886 (request call id 8) could send its response
[       OK ] Parameters/TestRpc.TestCancellationAsync/SSL_TCP (285 ms)
[ RUN      ] Parameters/TestRpc.TestPerformanceBySocketType/SSL_TCP
I20260924 18:59:58.238504   836 acceptor_pool.cc:254] collecting diagnostics on the listening RPC socket 0.0.0.0:33351 every 8 connection(s)
I20260924 18:59:58.238735   837 acceptor_pool.cc:254] collecting diagnostics on the listening RPC socket 0.0.0.0:33351 every 8 connection(s)
I20260924 18:59:58.239529   379 rpc-test.cc:1846] Connecting to 0.0.0.0:33351
I20260924 19:00:00.964712   379 rpc-test.cc:1859] Sending 1024MB via ssl-enabled tcp socket: real 2.712s	user 2.479s	sys 2.047s
I20260924 19:00:03.828418   379 rpc-test.cc:1859] Sending 1024MB via ssl-enabled tcp socket: real 2.864s	user 2.624s	sys 2.129s
I20260924 19:00:06.570182   379 rpc-test.cc:1859] Sending 1024MB via ssl-enabled tcp socket: real 2.742s	user 2.469s	sys 2.090s
I20260924 19:00:09.344484   379 rpc-test.cc:1859] Sending 1024MB via ssl-enabled tcp socket: real 2.774s	user 2.542s	sys 2.045s
I20260924 19:00:12.096967   379 rpc-test.cc:1859] Sending 1024MB via ssl-enabled tcp socket: real 2.752s	user 2.416s	sys 2.156s
[       OK ] Parameters/TestRpc.TestPerformanceBySocketType/SSL_TCP (13880 ms)
[----------] 20 tests from Parameters/TestRpc (46077 ms total)

[----------] 1 test from Parameters/TestRpcSocketTxRxQueue
[ RUN      ] Parameters/TestRpcSocketTxRxQueue.OverCapacity/0
W20260924 19:00:12.400144   853 negotiation.cc:337] Failed RPC negotiation. Trace:
0924 19:00:12.108017 (+     0us) reactor.cc:625] Submitting negotiation task for client connection to 0.0.0.0:38771 (local address 127.0.0.1:44888)
0924 19:00:12.108176 (+   159us) negotiation.cc:107] Waiting for socket to connect
0924 19:00:12.108194 (+    18us) client_negotiation.cc:174] Beginning negotiation
0924 19:00:12.108312 (+   118us) client_negotiation.cc:252] Sending NEGOTIATE NegotiatePB request
0924 19:00:12.399468 (+291156us) negotiation.cc:327] Negotiation complete: Network error: Client connection negotiation failed: client connection to 0.0.0.0:38771: BlockingRecv error: recv error from unknown peer: Transport endpoint is not connected (error 107)
Metrics: {"client-negotiator.queue_time_us":50}
W20260924 19:00:12.403469   871 negotiation.cc:337] Failed RPC negotiation. Trace:
0924 19:00:12.112609 (+     0us) reactor.cc:625] Submitting negotiation task for client connection to 0.0.0.0:38771 (local address 127.0.0.1:44900)
0924 19:00:12.112873 (+   264us) negotiation.cc:107] Waiting for socket to connect
0924 19:00:12.112891 (+    18us) client_negotiation.cc:174] Beginning negotiation
0924 19:00:12.113024 (+   133us) client_negotiation.cc:252] Sending NEGOTIATE NegotiatePB request
0924 19:00:12.399505 (+286481us) negotiation.cc:327] Negotiation complete: Network error: Client connection negotiation failed: client connection to 0.0.0.0:38771: BlockingRecv error: recv error from unknown peer: Transport endpoint is not connected (error 107)
Metrics: {"client-negotiator.queue_time_us":29}
W20260924 19:00:12.403493   862 negotiation.cc:337] Failed RPC negotiation. Trace:
0924 19:00:12.110331 (+     0us) reactor.cc:625] Submitting negotiation task for client connection to 0.0.0.0:38771 (local address 127.0.0.1:44892)
0924 19:00:12.110479 (+   148us) negotiation.cc:107] Waiting for socket to connect
0924 19:00:12.110494 (+    15us) client_negotiation.cc:174] Beginning negotiation
0924 19:00:12.110578 (+    84us) client_negotiation.cc:252] Sending NEGOTIATE NegotiatePB request
0924 19:00:12.399455 (+288877us) negotiation.cc:327] Negotiation complete: Network error: Client connection negotiation failed: client connection to 0.0.0.0:38771: BlockingRecv error: recv error from unknown peer: Transport endpoint is not connected (error 107)
Metrics: {"client-negotiator.queue_time_us":47}
W20260924 19:00:12.404191   880 negotiation.cc:337] Failed RPC negotiation. Trace:
0924 19:00:12.115268 (+     0us) reactor.cc:625] Submitting negotiation task for client connection to 0.0.0.0:38771 (local address 127.0.0.1:44916)
0924 19:00:12.115455 (+   187us) negotiation.cc:107] Waiting for socket to connect
0924 19:00:12.115471 (+    16us) client_negotiation.cc:174] Beginning negotiation
0924 19:00:12.115560 (+    89us) client_negotiation.cc:252] Sending NEGOTIATE NegotiatePB request
0924 19:00:12.399583 (+284023us) negotiation.cc:327] Negotiation complete: Network error: Client connection negotiation failed: client connection to 0.0.0.0:38771: BlockingRecv error: recv error from unknown peer: Transport endpoint is not connected (error 107)
Metrics: {"client-negotiator.queue_time_us":67}
W20260924 19:00:12.406613   889 negotiation.cc:337] Failed RPC negotiation. Trace:
0924 19:00:12.118122 (+     0us) reactor.cc:625] Submitting negotiation task for client connection to 0.0.0.0:38771 (local address 127.0.0.1:44932)
0924 19:00:12.118260 (+   138us) negotiation.cc:107] Waiting for socket to connect
0924 19:00:12.118275 (+    15us) client_negotiation.cc:174] Beginning negotiation
0924 19:00:12.118366 (+    91us) client_negotiation.cc:252] Sending NEGOTIATE NegotiatePB request
0924 19:00:12.400142 (+281776us) negotiation.cc:327] Negotiation complete: Network error: Client connection negotiation failed: client connection to 0.0.0.0:38771: BlockingRecv error: recv error from unknown peer: Transport endpoint is not connected (error 107)
Metrics: {"client-negotiator.queue_time_us":27}
W20260924 19:00:12.406697   898 negotiation.cc:337] Failed RPC negotiation. Trace:
0924 19:00:12.120727 (+     0us) reactor.cc:625] Submitting negotiation task for client connection to 0.0.0.0:38771 (local address 127.0.0.1:44946)
0924 19:00:12.120956 (+   229us) negotiation.cc:107] Waiting for socket to connect
0924 19:00:12.120971 (+    15us) client_negotiation.cc:174] Beginning negotiation
0924 19:00:12.121088 (+   117us) client_negotiation.cc:252] Sending NEGOTIATE NegotiatePB request
0924 19:00:12.400383 (+279295us) negotiation.cc:327] Negotiation complete: Network error: Client connection negotiation failed: client connection to 0.0.0.0:38771: BlockingRecv error: recv error from unknown peer: Transport endpoint is not connected (error 107)
Metrics: {"client-negotiator.queue_time_us":65}
[       OK ] Parameters/TestRpcSocketTxRxQueue.OverCapacity/0 (1060 ms)
[----------] 1 test from Parameters/TestRpcSocketTxRxQueue (1060 ms total)

[----------] Global test environment tear-down
[==========] 21 tests from 2 test suites ran. (47138 ms total)
[  PASSED  ] 20 tests.
[  FAILED  ] 1 test, listed below:
[  FAILED  ] Parameters/TestRpc.TestCallWithChainCertAndChainCA/SSL_TCP, where GetParam() = (true, false)

 1 FAILED TEST