Diagnosed failure
Parameters/TestRpc.TestCallWithChainCertAndChainCA/SSL_UnixSocket: /data0/somelongdirectorytoavoidrpathissues/src/kudu/src/kudu/rpc/rpc-test.cc:270: Failure
Failed
Bad status: Runtime error: could not verify certificate chain (error with cert: subject=CN = localhost, ST = sadfjas, C = AS, emailAddress = sdflkdsajf, O = lskdfjlsad, OU = sldfkja, issuer=C = AS, ST = ASDfkjdhf, L = lskdjf, O = saldfja, OU = skdjf, CN = localhost, emailAddress = sadjflkadsj): : certificate has expired
Google Test trace:
/data0/somelongdirectorytoavoidrpathissues/src/kudu/src/kudu/rpc/rpc-test.cc:267: Connecting to unix:/tmp/dist-test-taskeWaJ1n/test-tmp/rpc-test-cf37e5d2407249a0bf326e644699bcd3.sock
I20260925 02:23:34.923691 12249 test_util.cc:175] -----------------------------------------------
I20260925 02:23:34.923744 12249 test_util.cc:176] Had fatal failures, leaving test files at /tmp/dist-test-taskeWaJ1n/test-tmp/rpc-test.6.Parameters_TestRpc.TestCallWithChainCertAndChainCA_SSL_UnixSocket.1790303014884716-12249-0
Full log
Note: This is test shard 7 of 8.
[==========] Running 21 tests from 2 test suites.
[----------] Global test environment set-up.
[----------] 20 tests from Parameters/TestRpc
[ RUN ] Parameters/TestRpc.TestMessengerCreateDestroy/SSL_UnixSocket
WARNING: Logging before InitGoogleLogging() is written to STDERR
I20260925 02:23:34.900842 12249 rpc-test.cc:169] started messenger TestCreateDestroy
[ OK ] Parameters/TestRpc.TestMessengerCreateDestroy/SSL_UnixSocket (14 ms)
[ RUN ] Parameters/TestRpc.TestNegotiationDeadlock/SSL_UnixSocket
I20260925 02:23:34.908123 12270 acceptor_pool.cc:254] collecting diagnostics on the listening RPC socket unix:/tmp/dist-test-taskeWaJ1n/test-tmp/rpc-test-56e8a4e5624e4d5ead862b66ac16a35a.sock every 8 connection(s)
I20260925 02:23:34.908123 12269 acceptor_pool.cc:254] collecting diagnostics on the listening RPC socket unix:/tmp/dist-test-taskeWaJ1n/test-tmp/rpc-test-56e8a4e5624e4d5ead862b66ac16a35a.sock every 8 connection(s)
[ OK ] Parameters/TestRpc.TestNegotiationDeadlock/SSL_UnixSocket (12 ms)
[ RUN ] Parameters/TestRpc.TestCallWithChainCertAndChainCA/SSL_UnixSocket
I20260925 02:23:34.920212 12285 acceptor_pool.cc:254] collecting diagnostics on the listening RPC socket unix:/tmp/dist-test-taskeWaJ1n/test-tmp/rpc-test-cf37e5d2407249a0bf326e644699bcd3.sock every 8 connection(s)
I20260925 02:23:34.920228 12286 acceptor_pool.cc:254] collecting diagnostics on the listening RPC socket unix:/tmp/dist-test-taskeWaJ1n/test-tmp/rpc-test-cf37e5d2407249a0bf326e644699bcd3.sock every 8 connection(s)
/data0/somelongdirectorytoavoidrpathissues/src/kudu/src/kudu/rpc/rpc-test.cc:270: Failure
Failed
Bad status: Runtime error: could not verify certificate chain (error with cert: subject=CN = localhost, ST = sadfjas, C = AS, emailAddress = sdflkdsajf, O = lskdfjlsad, OU = sldfkja, issuer=C = AS, ST = ASDfkjdhf, L = lskdjf, O = saldfja, OU = skdjf, CN = localhost, emailAddress = sadjflkadsj): : certificate has expired
Google Test trace:
/data0/somelongdirectorytoavoidrpathissues/src/kudu/src/kudu/rpc/rpc-test.cc:267: Connecting to unix:/tmp/dist-test-taskeWaJ1n/test-tmp/rpc-test-cf37e5d2407249a0bf326e644699bcd3.sock
I20260925 02:23:34.923691 12249 test_util.cc:175] -----------------------------------------------
I20260925 02:23:34.923744 12249 test_util.cc:176] Had fatal failures, leaving test files at /tmp/dist-test-taskeWaJ1n/test-tmp/rpc-test.6.Parameters_TestRpc.TestCallWithChainCertAndChainCA_SSL_UnixSocket.1790303014884716-12249-0
[ FAILED ] Parameters/TestRpc.TestCallWithChainCertAndChainCA/SSL_UnixSocket, where GetParam() = (true, true) (9 ms)
[ RUN ] Parameters/TestRpc.TestCallWithPasswordProtectedKey/SSL_UnixSocket
I20260925 02:23:34.941088 12310 acceptor_pool.cc:254] collecting diagnostics on the listening RPC socket unix:/tmp/dist-test-taskeWaJ1n/test-tmp/rpc-test-c5ba0bd39b224902856ce7907fa42f12.sock every 8 connection(s)
I20260925 02:23:34.941110 12311 acceptor_pool.cc:254] collecting diagnostics on the listening RPC socket unix:/tmp/dist-test-taskeWaJ1n/test-tmp/rpc-test-c5ba0bd39b224902856ce7907fa42f12.sock every 8 connection(s)
W20260925 02:23:34.950584 12307 connection.cc:196] Error closing socket: Network error: TlsSocket::Close: Broken pipe
[ OK ] Parameters/TestRpc.TestCallWithPasswordProtectedKey/SSL_UnixSocket (27 ms)
[ RUN ] Parameters/TestRpc.TestCallToBadServer/SSL_UnixSocket
I20260925 02:23:34.957432 12249 rpc-test.cc:394] Status: Network error: Client connection negotiation failed: client connection to 0.0.0.0:0: connect: Connection refused (error 111)
I20260925 02:23:34.957669 12249 rpc-test.cc:394] Status: Network error: Client connection negotiation failed: client connection to 0.0.0.0:0: connect: Connection refused (error 111)
I20260925 02:23:34.957852 12249 rpc-test.cc:394] Status: Network error: Client connection negotiation failed: client connection to 0.0.0.0:0: connect: Connection refused (error 111)
I20260925 02:23:34.958024 12249 rpc-test.cc:394] Status: Network error: Client connection negotiation failed: client connection to 0.0.0.0:0: connect: Connection refused (error 111)
I20260925 02:23:34.958180 12249 rpc-test.cc:394] Status: Network error: Client connection negotiation failed: client connection to 0.0.0.0:0: connect: Connection refused (error 111)
[ OK ] Parameters/TestRpc.TestCallToBadServer/SSL_UnixSocket (6 ms)
[ RUN ] Parameters/TestRpc.TestWrongService/SSL_UnixSocket
I20260925 02:23:34.982405 12345 acceptor_pool.cc:254] collecting diagnostics on the listening RPC socket unix:/tmp/dist-test-taskeWaJ1n/test-tmp/rpc-test-3f74a70577884f499148d8d7f8832624.sock every 8 connection(s)
I20260925 02:23:34.982455 12346 acceptor_pool.cc:254] collecting diagnostics on the listening RPC socket unix:/tmp/dist-test-taskeWaJ1n/test-tmp/rpc-test-3f74a70577884f499148d8d7f8832624.sock every 8 connection(s)
I20260925 02:23:35.000531 12342 messenger.cc:345] service WrongServiceName not registered on TestServer
[ OK ] Parameters/TestRpc.TestWrongService/SSL_UnixSocket (43 ms)
[ RUN ] Parameters/TestRpc.TestConnectionKeepalive/SSL_UnixSocket
I20260925 02:23:35.015811 12368 acceptor_pool.cc:254] collecting diagnostics on the listening RPC socket unix:/tmp/dist-test-taskeWaJ1n/test-tmp/rpc-test-1338532662204a179d672a422698237c.sock every 8 connection(s)
I20260925 02:23:35.015883 12369 acceptor_pool.cc:254] collecting diagnostics on the listening RPC socket unix:/tmp/dist-test-taskeWaJ1n/test-tmp/rpc-test-1338532662204a179d672a422698237c.sock every 8 connection(s)
I20260925 02:23:35.016031 12249 rpc-test.cc:488] Connecting to unix:/tmp/dist-test-taskeWaJ1n/test-tmp/rpc-test-1338532662204a179d672a422698237c.sock
W20260925 02:23:35.603276 12381 connection.cc:196] Error closing socket: Network error: TlsSocket::Close: Broken pipe
[ OK ] Parameters/TestRpc.TestConnectionKeepalive/SSL_UnixSocket (1045 ms)
[ RUN ] Parameters/TestRpc.TestClientConnectionMetrics/SSL_UnixSocket
I20260925 02:23:36.054050 12393 acceptor_pool.cc:254] collecting diagnostics on the listening RPC socket unix:/tmp/dist-test-taskeWaJ1n/test-tmp/rpc-test-71a02de64ea64463af3fe9f280c85dca.sock every 8 connection(s)
I20260925 02:23:36.054121 12394 acceptor_pool.cc:254] collecting diagnostics on the listening RPC socket unix:/tmp/dist-test-taskeWaJ1n/test-tmp/rpc-test-71a02de64ea64463af3fe9f280c85dca.sock every 8 connection(s)
I20260925 02:23:36.054272 12249 rpc-test.cc:569] Connecting to unix:/tmp/dist-test-taskeWaJ1n/test-tmp/rpc-test-71a02de64ea64463af3fe9f280c85dca.sock
W20260925 02:23:43.580781 12390 connection.cc:196] Error closing socket: Network error: TlsSocket::Close: Broken pipe
[ OK ] Parameters/TestRpc.TestClientConnectionMetrics/SSL_UnixSocket (7534 ms)
[ RUN ] Parameters/TestRpc.TestCredentialsPolicy/SSL_UnixSocket
I20260925 02:23:43.590868 12416 acceptor_pool.cc:254] collecting diagnostics on the listening RPC socket unix:/tmp/dist-test-taskeWaJ1n/test-tmp/rpc-test-4f5816bd664e4b27aeb4f91630ad6164.sock every 8 connection(s)
I20260925 02:23:43.591107 12249 rpc-test.cc:700] Connecting to unix:/tmp/dist-test-taskeWaJ1n/test-tmp/rpc-test-4f5816bd664e4b27aeb4f91630ad6164.sock
I20260925 02:23:43.591141 12417 acceptor_pool.cc:254] collecting diagnostics on the listening RPC socket unix:/tmp/dist-test-taskeWaJ1n/test-tmp/rpc-test-4f5816bd664e4b27aeb4f91630ad6164.sock every 8 connection(s)
W20260925 02:23:43.605386 12415 connection.cc:196] Error closing socket: Network error: TlsSocket::Close: Broken pipe
W20260925 02:23:43.608223 12415 connection.cc:196] Error closing socket: Network error: TlsSocket::Close: Broken pipe
[ OK ] Parameters/TestRpc.TestCredentialsPolicy/SSL_UnixSocket (27 ms)
[ RUN ] Parameters/TestRpc.TestCallLongerThanKeepalive/SSL_UnixSocket
I20260925 02:23:43.615804 12441 acceptor_pool.cc:254] collecting diagnostics on the listening RPC socket unix:/tmp/dist-test-taskeWaJ1n/test-tmp/rpc-test-eece7f826fd04b18b2eff74b265c3a0a.sock every 8 connection(s)
I20260925 02:23:43.615859 12442 acceptor_pool.cc:254] collecting diagnostics on the listening RPC socket unix:/tmp/dist-test-taskeWaJ1n/test-tmp/rpc-test-eece7f826fd04b18b2eff74b265c3a0a.sock every 8 connection(s)
I20260925 02:23:43.638489 12444 rpc-test-base.h:222] got call: sleep_micros: 3000000 deferred: true
I20260925 02:23:46.639102 12444 rpcz_store.cc:275] Call kudu.rpc.GenericCalculatorService.Sleep from unix:<unnamed> (request call id 0) took 3000 ms. Trace:
I20260925 02:23:46.639207 12444 rpcz_store.cc:276] 0925 02:23:43.638440 (+ 0us) service_pool.cc:170] Inserting onto call queue
0925 02:23:43.638475 (+ 35us) service_pool.cc:227] Handling call
0925 02:23:46.639084 (+3000609us) inbound_call.cc:173] Queueing success response
Metrics: {}
W20260925 02:23:46.640182 12438 connection.cc:196] Error closing socket: Network error: TlsSocket::Close: Broken pipe
[ OK ] Parameters/TestRpc.TestCallLongerThanKeepalive/SSL_UnixSocket (3031 ms)
[ RUN ] Parameters/TestRpc.TestRpcSidecar/SSL_UnixSocket
I20260925 02:23:46.672780 12466 acceptor_pool.cc:254] collecting diagnostics on the listening RPC socket unix:/tmp/dist-test-taskeWaJ1n/test-tmp/rpc-test-14ce6b716d64455d95646d8bf7537375.sock every 8 connection(s)
I20260925 02:23:46.672821 12467 acceptor_pool.cc:254] collecting diagnostics on the listening RPC socket unix:/tmp/dist-test-taskeWaJ1n/test-tmp/rpc-test-14ce6b716d64455d95646d8bf7537375.sock every 8 connection(s)
W20260925 02:23:46.735198 12463 connection.cc:196] Error closing socket: Network error: TlsSocket::Close: Broken pipe
[ OK ] Parameters/TestRpc.TestRpcSidecar/SSL_UnixSocket (94 ms)
[ RUN ] Parameters/TestRpc.TestRpcSidecarLimits/SSL_UnixSocket
I20260925 02:23:48.516775 12492 acceptor_pool.cc:254] collecting diagnostics on the listening RPC socket unix:/tmp/dist-test-taskeWaJ1n/test-tmp/rpc-test-eedfb77d376741ba977373c2b97e3fcb.sock every 8 connection(s)
I20260925 02:23:48.516800 12491 acceptor_pool.cc:254] collecting diagnostics on the listening RPC socket unix:/tmp/dist-test-taskeWaJ1n/test-tmp/rpc-test-eedfb77d376741ba977373c2b97e3fcb.sock every 8 connection(s)
W20260925 02:23:48.525802 12249 serialization.cc:72] Serialized kudu.rpc_test.PushStringsRequestPB (2147483654 bytes) is larger than the maximum configured RPC message size (52428800 bytes). Sending anyway, but peer may reject the data.
W20260925 02:23:48.528446 12488 connection.cc:535] server connection from unix:<unnamed> recv error: Network error: RPC frame had a length of 2147483714, but we only support messages up to 52428800 bytes long.
W20260925 02:23:48.528483 12488 connection.cc:158] shutting down server connection from unix:<unnamed> with pending inbound data: 4/2147483714 bytes received; last active 0 ns ago: status Network error: RPC frame had a length of 2147483714, but we only support messages up to 52428800 bytes long.
W20260925 02:23:48.528635 12504 connection.cc:196] Error closing socket: Network error: TlsSocket::Close: Broken pipe
I20260925 02:23:48.571993 12516 acceptor_pool.cc:254] collecting diagnostics on the listening RPC socket unix:/tmp/dist-test-taskeWaJ1n/test-tmp/rpc-test-eedfb77d376741ba977373c2b97e3fcb.sock every 8 connection(s)
I20260925 02:23:48.572073 12517 acceptor_pool.cc:254] collecting diagnostics on the listening RPC socket unix:/tmp/dist-test-taskeWaJ1n/test-tmp/rpc-test-eedfb77d376741ba977373c2b97e3fcb.sock every 8 connection(s)
W20260925 02:23:53.265600 12513 connection.cc:577] server connection from unix:<unnamed>: received bad data: 'Corruption: Invalid packet: message had a length of 2147483710, but we only support messages up to 2147483647 bytes
'
W20260925 02:23:53.265897 12529 connection.cc:196] Error closing socket: Network error: TlsSocket::Close: Broken pipe
[ OK ] Parameters/TestRpc.TestRpcSidecarLimits/SSL_UnixSocket (6531 ms)
[ RUN ] Parameters/TestRpc.TestCallTimeoutDoesntAffectNegotiation/SSL_UnixSocket
I20260925 02:23:53.274713 12541 acceptor_pool.cc:254] collecting diagnostics on the listening RPC socket unix:/tmp/dist-test-taskeWaJ1n/test-tmp/rpc-test-8b4d8850f45b46a3bd5023635e1a87d8.sock every 8 connection(s)
I20260925 02:23:53.274798 12542 acceptor_pool.cc:254] collecting diagnostics on the listening RPC socket unix:/tmp/dist-test-taskeWaJ1n/test-tmp/rpc-test-8b4d8850f45b46a3bd5023635e1a87d8.sock every 8 connection(s)
W20260925 02:23:53.284890 12537 negotiation.cc:266] Injecting 500ms delay in negotiation
I20260925 02:23:53.335085 12249 rpc-test-base.h:595] status: Timed out: connection negotiation to unix:/tmp/dist-test-taskeWaJ1n/test-tmp/rpc-test-8b4d8850f45b46a3bd5023635e1a87d8.sock for RPC Sleep timed out after 0.050s (ON_OUTBOUND_QUEUE), seconds elapsed: 0.0504064
[ OK ] Parameters/TestRpc.TestCallTimeoutDoesntAffectNegotiation/SSL_UnixSocket (522 ms)
[ RUN ] Parameters/TestRpc.TestRpcHandlerLatencyMetric/SSL_UnixSocket
I20260925 02:23:53.803596 12566 acceptor_pool.cc:254] collecting diagnostics on the listening RPC socket unix:/tmp/dist-test-taskeWaJ1n/test-tmp/rpc-test-2f0a5a56db654f9aac2b2fb2dcb002a9.sock every 8 connection(s)
I20260925 02:23:53.803646 12567 acceptor_pool.cc:254] collecting diagnostics on the listening RPC socket unix:/tmp/dist-test-taskeWaJ1n/test-tmp/rpc-test-2f0a5a56db654f9aac2b2fb2dcb002a9.sock every 8 connection(s)
I20260925 02:23:53.861549 12249 rpc-test.cc:1236] Sleep() min lat: 20233
I20260925 02:23:53.861598 12249 rpc-test.cc:1237] Sleep() mean lat: 20233
I20260925 02:23:53.861621 12249 rpc-test.cc:1238] Sleep() max lat: 20233
I20260925 02:23:53.861634 12249 rpc-test.cc:1239] Sleep() #calls: 1
W20260925 02:23:53.862259 12563 connection.cc:196] Error closing socket: Network error: TlsSocket::Close: Broken pipe
[ OK ] Parameters/TestRpc.TestRpcHandlerLatencyMetric/SSL_UnixSocket (72 ms)
[ RUN ] Parameters/TestRpc.TimedOutOnResponseMetricServiceQueue/SSL_UnixSocket
I20260925 02:23:53.875646 12592 acceptor_pool.cc:254] collecting diagnostics on the listening RPC socket unix:/tmp/dist-test-taskeWaJ1n/test-tmp/rpc-test-4bdfb9e4612347a5ad3d7634a6e9f4e4.sock every 8 connection(s)
I20260925 02:23:53.875700 12593 acceptor_pool.cc:254] collecting diagnostics on the listening RPC socket unix:/tmp/dist-test-taskeWaJ1n/test-tmp/rpc-test-4bdfb9e4612347a5ad3d7634a6e9f4e4.sock every 8 connection(s)
W20260925 02:23:53.941140 12594 rpcz_store.cc:267] Call kudu.rpc_test.CalculatorService.Sleep from unix:<unnamed> (request call id 2) took 20 ms (client timeout 20 ms). Trace:
W20260925 02:23:53.941191 12594 rpcz_store.cc:269] 0925 02:23:53.920968 (+ 0us) service_pool.cc:170] Inserting onto call queue
0925 02:23:53.941116 (+ 20148us) service_pool.cc:214] Skipping call since client already timed out
0925 02:23:53.941121 (+ 5us) inbound_call.cc:173] Queueing failure response
Metrics: {}
[ OK ] Parameters/TestRpc.TimedOutOnResponseMetricServiceQueue/SSL_UnixSocket (79 ms)
[ RUN ] Parameters/TestRpc.RpcPendingConnectionsMetric/SSL_UnixSocket
I20260925 02:23:53.944010 12615 acceptor_pool.cc:254] collecting diagnostics on the listening RPC socket 0.0.0.0:43915 every 8 connection(s)
I20260925 02:23:53.944084 12616 acceptor_pool.cc:254] collecting diagnostics on the listening RPC socket 0.0.0.0:43915 every 8 connection(s)
W20260925 02:23:53.944578 12611 negotiation.cc:337] Failed RPC negotiation. Trace:
0925 02:23:53.944422 (+ 0us) reactor.cc:625] Submitting negotiation task for server connection from 127.0.0.1:53522 (local address 127.0.0.1:43915)
0925 02:23:53.944463 (+ 41us) server_negotiation.cc:206] Beginning negotiation
0925 02:23:53.944465 (+ 2us) server_negotiation.cc:399] Waiting for connection header
0925 02:23:53.944531 (+ 66us) negotiation.cc:327] Negotiation complete: Network error: Server connection negotiation failed: server connection from 127.0.0.1:53522: BlockingRecv error: recv got EOF from 127.0.0.1:53522 (error 108)
Metrics: {"server-negotiator.queue_time_us":12}
[ OK ] Parameters/TestRpc.RpcPendingConnectionsMetric/SSL_UnixSocket (13 ms)
[ RUN ] Parameters/TestRpc.TestRpcContextClientDeadline/SSL_UnixSocket
I20260925 02:23:53.974388 12631 acceptor_pool.cc:254] collecting diagnostics on the listening RPC socket unix:/tmp/dist-test-taskeWaJ1n/test-tmp/rpc-test-0511a6b499404ead8fec18ddae1c7f8d.sock every 8 connection(s)
I20260925 02:23:53.974452 12632 acceptor_pool.cc:254] collecting diagnostics on the listening RPC socket unix:/tmp/dist-test-taskeWaJ1n/test-tmp/rpc-test-0511a6b499404ead8fec18ddae1c7f8d.sock every 8 connection(s)
[ OK ] Parameters/TestRpc.TestRpcContextClientDeadline/SSL_UnixSocket (56 ms)
[ RUN ] Parameters/TestRpc.TestApplicationFeatureFlagUnsupportedServer/SSL_UnixSocket
I20260925 02:23:54.024750 12656 acceptor_pool.cc:254] collecting diagnostics on the listening RPC socket unix:/tmp/dist-test-taskeWaJ1n/test-tmp/rpc-test-6c8a40d18d1b4eafaea9fc7a52f8b877.sock every 8 connection(s)
I20260925 02:23:54.024804 12657 acceptor_pool.cc:254] collecting diagnostics on the listening RPC socket unix:/tmp/dist-test-taskeWaJ1n/test-tmp/rpc-test-6c8a40d18d1b4eafaea9fc7a52f8b877.sock every 8 connection(s)
W20260925 02:23:54.051115 12653 connection.cc:196] Error closing socket: Network error: TlsSocket::Close: Broken pipe
[ OK ] Parameters/TestRpc.TestApplicationFeatureFlagUnsupportedServer/SSL_UnixSocket (39 ms)
[ RUN ] Parameters/TestRpc.TestCancellationAsync/SSL_UnixSocket
I20260925 02:23:54.064914 12681 acceptor_pool.cc:254] collecting diagnostics on the listening RPC socket unix:/tmp/dist-test-taskeWaJ1n/test-tmp/rpc-test-d4e329feb2a844c8b121109a8a93bbee.sock every 8 connection(s)
I20260925 02:23:54.064958 12682 acceptor_pool.cc:254] collecting diagnostics on the listening RPC socket unix:/tmp/dist-test-taskeWaJ1n/test-tmp/rpc-test-d4e329feb2a844c8b121109a8a93bbee.sock every 8 connection(s)
I20260925 02:23:54.065083 12249 rpc-test.cc:1716] Connecting to unix:/tmp/dist-test-taskeWaJ1n/test-tmp/rpc-test-d4e329feb2a844c8b121109a8a93bbee.sock
I20260925 02:23:54.076635 12249 test_util.cc:268] Using random seed: 1751313882
I20260925 02:23:54.092288 12685 rpc-test-base.h:240] got call: sleep_micros: 500 pattern: 4294967295 num_repetitions: 2097152 sidecar_idx: 0
I20260925 02:23:54.102298 12685 rpc-test-base.h:240] got call: sleep_micros: 500 pattern: 4294967295 num_repetitions: 2097152 sidecar_idx: 0
I20260925 02:23:54.111274 12685 rpc-test-base.h:240] got call: sleep_micros: 500 pattern: 4294967295 num_repetitions: 2097152 sidecar_idx: 0
I20260925 02:23:54.119679 12685 rpc-test-base.h:240] got call: sleep_micros: 500 pattern: 4294967295 num_repetitions: 2097152 sidecar_idx: 0
I20260925 02:23:54.128332 12685 rpc-test-base.h:240] got call: sleep_micros: 500 pattern: 4294967295 num_repetitions: 2097152 sidecar_idx: 0
I20260925 02:23:54.136879 12685 rpc-test-base.h:240] got call: sleep_micros: 500 pattern: 4294967295 num_repetitions: 2097152 sidecar_idx: 0
I20260925 02:23:54.145540 12685 rpc-test-base.h:240] got call: sleep_micros: 500 pattern: 4294967295 num_repetitions: 2097152 sidecar_idx: 0
I20260925 02:23:54.153836 12685 rpc-test-base.h:240] got call: sleep_micros: 500 pattern: 4294967295 num_repetitions: 2097152 sidecar_idx: 0
W20260925 02:23:54.154846 12678 connection.cc:196] Error closing socket: Network error: TlsSocket::Close: Broken pipe
W20260925 02:23:54.156421 12678 connection.cc:441] server connection from unix:<unnamed> torn down before Call kudu.rpc.GenericCalculatorService.SleepWithSidecar from unix:<unnamed> (request call id 9) could send its response
[ OK ] Parameters/TestRpc.TestCancellationAsync/SSL_UnixSocket (105 ms)
[ RUN ] Parameters/TestRpc.TestPerformanceBySocketType/SSL_UnixSocket
I20260925 02:23:54.172950 12706 acceptor_pool.cc:254] collecting diagnostics on the listening RPC socket unix:/tmp/dist-test-taskeWaJ1n/test-tmp/rpc-test-c8712f47ede14082889398600fec9029.sock every 8 connection(s)
I20260925 02:23:54.173002 12707 acceptor_pool.cc:254] collecting diagnostics on the listening RPC socket unix:/tmp/dist-test-taskeWaJ1n/test-tmp/rpc-test-c8712f47ede14082889398600fec9029.sock every 8 connection(s)
I20260925 02:23:54.173175 12249 rpc-test.cc:1846] Connecting to unix:/tmp/dist-test-taskeWaJ1n/test-tmp/rpc-test-c8712f47ede14082889398600fec9029.sock
I20260925 02:23:55.273934 12249 rpc-test.cc:1859] Sending 1024MB via ssl-enabled unix socket: real 1.094s user 1.145s sys 0.851s
I20260925 02:23:56.309934 12249 rpc-test.cc:1859] Sending 1024MB via ssl-enabled unix socket: real 1.036s user 1.091s sys 0.804s
I20260925 02:23:57.412277 12249 rpc-test.cc:1859] Sending 1024MB via ssl-enabled unix socket: real 1.102s user 1.245s sys 0.772s
I20260925 02:23:58.462669 12249 rpc-test.cc:1859] Sending 1024MB via ssl-enabled unix socket: real 1.050s user 1.111s sys 0.804s
I20260925 02:23:59.577652 12249 rpc-test.cc:1859] Sending 1024MB via ssl-enabled unix socket: real 1.115s user 1.199s sys 0.840s
W20260925 02:23:59.578380 12703 connection.cc:196] Error closing socket: Network error: TlsSocket::Close: Broken pipe
[ OK ] Parameters/TestRpc.TestPerformanceBySocketType/SSL_UnixSocket (5422 ms)
[----------] 20 tests from Parameters/TestRpc (24692 ms total)
[----------] 1 test from Parameters/TestRpcSocketTxRxQueue
[ RUN ] Parameters/TestRpcSocketTxRxQueue.AcceptorRxQueueSizeMetric/0
I20260925 02:23:59.585088 12731 acceptor_pool.cc:254] collecting diagnostics on the listening RPC socket 0.0.0.0:35305 every 1 connection(s)
I20260925 02:23:59.585152 12732 acceptor_pool.cc:254] collecting diagnostics on the listening RPC socket 0.0.0.0:35305 every 1 connection(s)
W20260925 02:23:59.585690 12727 negotiation.cc:337] Failed RPC negotiation. Trace:
0925 02:23:59.585545 (+ 0us) reactor.cc:625] Submitting negotiation task for server connection from 127.0.0.1:45918 (local address 127.0.0.1:35305)
0925 02:23:59.585589 (+ 44us) server_negotiation.cc:206] Beginning negotiation
0925 02:23:59.585591 (+ 2us) server_negotiation.cc:399] Waiting for connection header
0925 02:23:59.585661 (+ 70us) negotiation.cc:327] Negotiation complete: Network error: Server connection negotiation failed: server connection from 127.0.0.1:45918: BlockingRecv error: recv got EOF from 127.0.0.1:45918 (error 108)
Metrics: {"server-negotiator.queue_time_us":21}
[ OK ] Parameters/TestRpcSocketTxRxQueue.AcceptorRxQueueSizeMetric/0 (8 ms)
[----------] 1 test from Parameters/TestRpcSocketTxRxQueue (8 ms total)
[----------] Global test environment tear-down
[==========] 21 tests from 2 test suites ran. (24700 ms total)
[ PASSED ] 20 tests.
[ FAILED ] 1 test, listed below:
[ FAILED ] Parameters/TestRpc.TestCallWithChainCertAndChainCA/SSL_UnixSocket, where GetParam() = (true, true)
1 FAILED TEST