Diagnosed failure
Parameters/TestRpc.TestCallWithChainCertAndChainCA/SSL_UnixSocket: /data0/somelongdirectorytoavoidrpathissues/src/kudu/src/kudu/rpc/rpc-test.cc:270: Failure
Failed
Bad status: Runtime error: could not verify certificate chain (error with cert: subject=CN = localhost, ST = sadfjas, C = AS, emailAddress = sdflkdsajf, O = lskdfjlsad, OU = sldfkja, issuer=C = AS, ST = ASDfkjdhf, L = lskdjf, O = saldfja, OU = skdjf, CN = localhost, emailAddress = sadjflkadsj): : certificate has expired
Google Test trace:
/data0/somelongdirectorytoavoidrpathissues/src/kudu/src/kudu/rpc/rpc-test.cc:267: Connecting to unix:/tmp/dist-test-taskU2y0gX/test-tmp/rpc-test-f2d50a2f4af444c39717ceabc783929c.sock
I20260925 17:25:25.071367 1615 test_util.cc:175] -----------------------------------------------
I20260925 17:25:25.071421 1615 test_util.cc:176] Had fatal failures, leaving test files at /tmp/dist-test-taskU2y0gX/test-tmp/rpc-test.6.Parameters_TestRpc.TestCallWithChainCertAndChainCA_SSL_UnixSocket.1790357125009737-1615-0
Full log
Note: This is test shard 7 of 8.
[==========] Running 21 tests from 2 test suites.
[----------] Global test environment set-up.
[----------] 20 tests from Parameters/TestRpc
[ RUN ] Parameters/TestRpc.TestMessengerCreateDestroy/SSL_UnixSocket
WARNING: Logging before InitGoogleLogging() is written to STDERR
I20260925 17:25:25.040719 1615 rpc-test.cc:169] started messenger TestCreateDestroy
[ OK ] Parameters/TestRpc.TestMessengerCreateDestroy/SSL_UnixSocket (26 ms)
[ RUN ] Parameters/TestRpc.TestNegotiationDeadlock/SSL_UnixSocket
I20260925 17:25:25.048846 1635 acceptor_pool.cc:254] collecting diagnostics on the listening RPC socket unix:/tmp/dist-test-taskU2y0gX/test-tmp/rpc-test-294a2b64645b47c180c394ae6ce2a40d.sock every 8 connection(s)
I20260925 17:25:25.048897 1636 acceptor_pool.cc:254] collecting diagnostics on the listening RPC socket unix:/tmp/dist-test-taskU2y0gX/test-tmp/rpc-test-294a2b64645b47c180c394ae6ce2a40d.sock every 8 connection(s)
[ OK ] Parameters/TestRpc.TestNegotiationDeadlock/SSL_UnixSocket (17 ms)
[ RUN ] Parameters/TestRpc.TestCallWithChainCertAndChainCA/SSL_UnixSocket
I20260925 17:25:25.066491 1651 acceptor_pool.cc:254] collecting diagnostics on the listening RPC socket unix:/tmp/dist-test-taskU2y0gX/test-tmp/rpc-test-f2d50a2f4af444c39717ceabc783929c.sock every 8 connection(s)
I20260925 17:25:25.066557 1652 acceptor_pool.cc:254] collecting diagnostics on the listening RPC socket unix:/tmp/dist-test-taskU2y0gX/test-tmp/rpc-test-f2d50a2f4af444c39717ceabc783929c.sock every 8 connection(s)
/data0/somelongdirectorytoavoidrpathissues/src/kudu/src/kudu/rpc/rpc-test.cc:270: Failure
Failed
Bad status: Runtime error: could not verify certificate chain (error with cert: subject=CN = localhost, ST = sadfjas, C = AS, emailAddress = sdflkdsajf, O = lskdfjlsad, OU = sldfkja, issuer=C = AS, ST = ASDfkjdhf, L = lskdjf, O = saldfja, OU = skdjf, CN = localhost, emailAddress = sadjflkadsj): : certificate has expired
Google Test trace:
/data0/somelongdirectorytoavoidrpathissues/src/kudu/src/kudu/rpc/rpc-test.cc:267: Connecting to unix:/tmp/dist-test-taskU2y0gX/test-tmp/rpc-test-f2d50a2f4af444c39717ceabc783929c.sock
I20260925 17:25:25.071367 1615 test_util.cc:175] -----------------------------------------------
I20260925 17:25:25.071421 1615 test_util.cc:176] Had fatal failures, leaving test files at /tmp/dist-test-taskU2y0gX/test-tmp/rpc-test.6.Parameters_TestRpc.TestCallWithChainCertAndChainCA_SSL_UnixSocket.1790357125009737-1615-0
[ FAILED ] Parameters/TestRpc.TestCallWithChainCertAndChainCA/SSL_UnixSocket, where GetParam() = (true, true) (11 ms)
[ RUN ] Parameters/TestRpc.TestCallWithPasswordProtectedKey/SSL_UnixSocket
I20260925 17:25:25.079962 1677 acceptor_pool.cc:254] collecting diagnostics on the listening RPC socket unix:/tmp/dist-test-taskU2y0gX/test-tmp/rpc-test-8f23d811c806484e870c3354e6381b82.sock every 8 connection(s)
I20260925 17:25:25.080101 1676 acceptor_pool.cc:254] collecting diagnostics on the listening RPC socket unix:/tmp/dist-test-taskU2y0gX/test-tmp/rpc-test-8f23d811c806484e870c3354e6381b82.sock every 8 connection(s)
W20260925 17:25:25.093310 1673 connection.cc:196] Error closing socket: Network error: TlsSocket::Close: Broken pipe
[ OK ] Parameters/TestRpc.TestCallWithPasswordProtectedKey/SSL_UnixSocket (23 ms)
[ RUN ] Parameters/TestRpc.TestCallToBadServer/SSL_UnixSocket
I20260925 17:25:25.112033 1615 rpc-test.cc:394] Status: Network error: Client connection negotiation failed: client connection to 0.0.0.0:0: connect: Connection refused (error 111)
I20260925 17:25:25.112530 1615 rpc-test.cc:394] Status: Network error: Client connection negotiation failed: client connection to 0.0.0.0:0: connect: Connection refused (error 111)
I20260925 17:25:25.113025 1615 rpc-test.cc:394] Status: Network error: Client connection negotiation failed: client connection to 0.0.0.0:0: connect: Connection refused (error 111)
I20260925 17:25:25.113466 1615 rpc-test.cc:394] Status: Network error: Client connection negotiation failed: client connection to 0.0.0.0:0: connect: Connection refused (error 111)
I20260925 17:25:25.113952 1615 rpc-test.cc:394] Status: Network error: Client connection negotiation failed: client connection to 0.0.0.0:0: connect: Connection refused (error 111)
[ OK ] Parameters/TestRpc.TestCallToBadServer/SSL_UnixSocket (19 ms)
[ RUN ] Parameters/TestRpc.TestWrongService/SSL_UnixSocket
I20260925 17:25:25.125444 1711 acceptor_pool.cc:254] collecting diagnostics on the listening RPC socket unix:/tmp/dist-test-taskU2y0gX/test-tmp/rpc-test-8a4dce02d7494bea8a74cbe3fa806308.sock every 8 connection(s)
I20260925 17:25:25.125478 1712 acceptor_pool.cc:254] collecting diagnostics on the listening RPC socket unix:/tmp/dist-test-taskU2y0gX/test-tmp/rpc-test-8a4dce02d7494bea8a74cbe3fa806308.sock every 8 connection(s)
I20260925 17:25:25.138260 1708 messenger.cc:345] service WrongServiceName not registered on TestServer
[ OK ] Parameters/TestRpc.TestWrongService/SSL_UnixSocket (25 ms)
[ RUN ] Parameters/TestRpc.TestConnectionKeepalive/SSL_UnixSocket
I20260925 17:25:25.146775 1734 acceptor_pool.cc:254] collecting diagnostics on the listening RPC socket unix:/tmp/dist-test-taskU2y0gX/test-tmp/rpc-test-ee2fd86ed5484bbeb077f79d3aa3ec05.sock every 8 connection(s)
I20260925 17:25:25.146821 1735 acceptor_pool.cc:254] collecting diagnostics on the listening RPC socket unix:/tmp/dist-test-taskU2y0gX/test-tmp/rpc-test-ee2fd86ed5484bbeb077f79d3aa3ec05.sock every 8 connection(s)
I20260925 17:25:25.147065 1615 rpc-test.cc:488] Connecting to unix:/tmp/dist-test-taskU2y0gX/test-tmp/rpc-test-ee2fd86ed5484bbeb077f79d3aa3ec05.sock
W20260925 17:25:25.642063 1747 connection.cc:196] Error closing socket: Network error: TlsSocket::Close: Broken pipe
[ OK ] Parameters/TestRpc.TestConnectionKeepalive/SSL_UnixSocket (1027 ms)
[ RUN ] Parameters/TestRpc.TestClientConnectionMetrics/SSL_UnixSocket
I20260925 17:25:26.179590 1759 acceptor_pool.cc:254] collecting diagnostics on the listening RPC socket unix:/tmp/dist-test-taskU2y0gX/test-tmp/rpc-test-f4db9c0fa607468cba7b2f4d2ebdbee6.sock every 8 connection(s)
I20260925 17:25:26.179754 1760 acceptor_pool.cc:254] collecting diagnostics on the listening RPC socket unix:/tmp/dist-test-taskU2y0gX/test-tmp/rpc-test-f4db9c0fa607468cba7b2f4d2ebdbee6.sock every 8 connection(s)
I20260925 17:25:26.179975 1615 rpc-test.cc:569] Connecting to unix:/tmp/dist-test-taskU2y0gX/test-tmp/rpc-test-f4db9c0fa607468cba7b2f4d2ebdbee6.sock
W20260925 17:25:36.467801 1756 connection.cc:196] Error closing socket: Network error: TlsSocket::Close: Broken pipe
[ OK ] Parameters/TestRpc.TestClientConnectionMetrics/SSL_UnixSocket (10301 ms)
[ RUN ] Parameters/TestRpc.TestCredentialsPolicy/SSL_UnixSocket
I20260925 17:25:36.479552 1782 acceptor_pool.cc:254] collecting diagnostics on the listening RPC socket unix:/tmp/dist-test-taskU2y0gX/test-tmp/rpc-test-824d5462c69e48b9a2df0c354f786d6d.sock every 8 connection(s)
I20260925 17:25:36.479566 1783 acceptor_pool.cc:254] collecting diagnostics on the listening RPC socket unix:/tmp/dist-test-taskU2y0gX/test-tmp/rpc-test-824d5462c69e48b9a2df0c354f786d6d.sock every 8 connection(s)
I20260925 17:25:36.479875 1615 rpc-test.cc:700] Connecting to unix:/tmp/dist-test-taskU2y0gX/test-tmp/rpc-test-824d5462c69e48b9a2df0c354f786d6d.sock
W20260925 17:25:36.512699 1781 connection.cc:196] Error closing socket: Network error: TlsSocket::Close: Broken pipe
W20260925 17:25:36.517729 1781 connection.cc:196] Error closing socket: Network error: TlsSocket::Close: Broken pipe
[ OK ] Parameters/TestRpc.TestCredentialsPolicy/SSL_UnixSocket (49 ms)
[ RUN ] Parameters/TestRpc.TestCallLongerThanKeepalive/SSL_UnixSocket
I20260925 17:25:36.534017 1807 acceptor_pool.cc:254] collecting diagnostics on the listening RPC socket unix:/tmp/dist-test-taskU2y0gX/test-tmp/rpc-test-df8880680d234c149984c53d57308c7b.sock every 8 connection(s)
I20260925 17:25:36.534049 1808 acceptor_pool.cc:254] collecting diagnostics on the listening RPC socket unix:/tmp/dist-test-taskU2y0gX/test-tmp/rpc-test-df8880680d234c149984c53d57308c7b.sock every 8 connection(s)
I20260925 17:25:36.550885 1811 rpc-test-base.h:222] got call: sleep_micros: 3000000 deferred: true
I20260925 17:25:39.551820 1811 rpcz_store.cc:275] Call kudu.rpc.GenericCalculatorService.Sleep from unix:<unnamed> (request call id 0) took 3001 ms. Trace:
I20260925 17:25:39.551966 1811 rpcz_store.cc:276] 0925 17:25:36.550797 (+ 0us) service_pool.cc:170] Inserting onto call queue
0925 17:25:36.550853 (+ 56us) service_pool.cc:227] Handling call
0925 17:25:39.551798 (+3000945us) inbound_call.cc:173] Queueing success response
Metrics: {}
W20260925 17:25:39.553519 1804 connection.cc:196] Error closing socket: Network error: TlsSocket::Close: Broken pipe
[ OK ] Parameters/TestRpc.TestCallLongerThanKeepalive/SSL_UnixSocket (3037 ms)
[ RUN ] Parameters/TestRpc.TestRpcSidecar/SSL_UnixSocket
I20260925 17:25:39.590690 1832 acceptor_pool.cc:254] collecting diagnostics on the listening RPC socket unix:/tmp/dist-test-taskU2y0gX/test-tmp/rpc-test-e09009e41794492ba73f714af3c1294d.sock every 8 connection(s)
I20260925 17:25:39.590742 1833 acceptor_pool.cc:254] collecting diagnostics on the listening RPC socket unix:/tmp/dist-test-taskU2y0gX/test-tmp/rpc-test-e09009e41794492ba73f714af3c1294d.sock every 8 connection(s)
[ OK ] Parameters/TestRpc.TestRpcSidecar/SSL_UnixSocket (102 ms)
[ RUN ] Parameters/TestRpc.TestRpcSidecarLimits/SSL_UnixSocket
I20260925 17:25:41.388492 1857 acceptor_pool.cc:254] collecting diagnostics on the listening RPC socket unix:/tmp/dist-test-taskU2y0gX/test-tmp/rpc-test-5230839c0f56406cbbc95bc7f4fa6c4b.sock every 8 connection(s)
I20260925 17:25:41.388492 1858 acceptor_pool.cc:254] collecting diagnostics on the listening RPC socket unix:/tmp/dist-test-taskU2y0gX/test-tmp/rpc-test-5230839c0f56406cbbc95bc7f4fa6c4b.sock every 8 connection(s)
W20260925 17:25:41.398859 1615 serialization.cc:72] Serialized kudu.rpc_test.PushStringsRequestPB (2147483654 bytes) is larger than the maximum configured RPC message size (52428800 bytes). Sending anyway, but peer may reject the data.
W20260925 17:25:41.402769 1854 connection.cc:535] server connection from unix:<unnamed> recv error: Network error: RPC frame had a length of 2147483714, but we only support messages up to 52428800 bytes long.
W20260925 17:25:41.402863 1854 connection.cc:158] shutting down server connection from unix:<unnamed> with pending inbound data: 4/2147483714 bytes received; last active 0 ns ago: status Network error: RPC frame had a length of 2147483714, but we only support messages up to 52428800 bytes long.
W20260925 17:25:41.403144 1870 connection.cc:196] Error closing socket: Network error: TlsSocket::Close: Broken pipe
I20260925 17:25:41.418799 1882 acceptor_pool.cc:254] collecting diagnostics on the listening RPC socket unix:/tmp/dist-test-taskU2y0gX/test-tmp/rpc-test-5230839c0f56406cbbc95bc7f4fa6c4b.sock every 8 connection(s)
I20260925 17:25:41.418799 1883 acceptor_pool.cc:254] collecting diagnostics on the listening RPC socket unix:/tmp/dist-test-taskU2y0gX/test-tmp/rpc-test-5230839c0f56406cbbc95bc7f4fa6c4b.sock every 8 connection(s)
W20260925 17:25:46.330960 1879 connection.cc:577] server connection from unix:<unnamed>: received bad data: 'Corruption: Invalid packet: message had a length of 2147483710, but we only support messages up to 2147483647 bytes
'
W20260925 17:25:46.331362 1895 connection.cc:196] Error closing socket: Network error: TlsSocket::Close: Broken pipe
[ OK ] Parameters/TestRpc.TestRpcSidecarLimits/SSL_UnixSocket (6674 ms)
[ RUN ] Parameters/TestRpc.TestCallTimeoutDoesntAffectNegotiation/SSL_UnixSocket
I20260925 17:25:46.370859 1907 acceptor_pool.cc:254] collecting diagnostics on the listening RPC socket unix:/tmp/dist-test-taskU2y0gX/test-tmp/rpc-test-5251cc8c07c64250af84f11f09f65a65.sock every 8 connection(s)
I20260925 17:25:46.370894 1908 acceptor_pool.cc:254] collecting diagnostics on the listening RPC socket unix:/tmp/dist-test-taskU2y0gX/test-tmp/rpc-test-5251cc8c07c64250af84f11f09f65a65.sock every 8 connection(s)
W20260925 17:25:46.381819 1903 negotiation.cc:266] Injecting 500ms delay in negotiation
I20260925 17:25:46.432265 1615 rpc-test-base.h:595] status: Timed out: connection negotiation to unix:/tmp/dist-test-taskU2y0gX/test-tmp/rpc-test-5251cc8c07c64250af84f11f09f65a65.sock for RPC Sleep timed out after 0.050s (ON_OUTBOUND_QUEUE), seconds elapsed: 0.0509217
W20260925 17:25:46.887117 1904 connection.cc:196] Error closing socket: Network error: TlsSocket::Close: Broken pipe
[ OK ] Parameters/TestRpc.TestCallTimeoutDoesntAffectNegotiation/SSL_UnixSocket (554 ms)
[ RUN ] Parameters/TestRpc.TestRpcHandlerLatencyMetric/SSL_UnixSocket
I20260925 17:25:46.899425 1932 acceptor_pool.cc:254] collecting diagnostics on the listening RPC socket unix:/tmp/dist-test-taskU2y0gX/test-tmp/rpc-test-3190fe3d4e174bef8e81f6a153134a4d.sock every 8 connection(s)
I20260925 17:25:46.899570 1933 acceptor_pool.cc:254] collecting diagnostics on the listening RPC socket unix:/tmp/dist-test-taskU2y0gX/test-tmp/rpc-test-3190fe3d4e174bef8e81f6a153134a4d.sock every 8 connection(s)
I20260925 17:25:46.933208 1615 rpc-test.cc:1236] Sleep() min lat: 20375
I20260925 17:25:46.933286 1615 rpc-test.cc:1237] Sleep() mean lat: 20375
I20260925 17:25:46.933323 1615 rpc-test.cc:1238] Sleep() max lat: 20375
I20260925 17:25:46.933337 1615 rpc-test.cc:1239] Sleep() #calls: 1
W20260925 17:25:46.934309 1929 connection.cc:196] Error closing socket: Network error: TlsSocket::Close: Broken pipe
[ OK ] Parameters/TestRpc.TestRpcHandlerLatencyMetric/SSL_UnixSocket (47 ms)
[ RUN ] Parameters/TestRpc.TimedOutOnResponseMetricServiceQueue/SSL_UnixSocket
I20260925 17:25:46.957208 1958 acceptor_pool.cc:254] collecting diagnostics on the listening RPC socket unix:/tmp/dist-test-taskU2y0gX/test-tmp/rpc-test-8b4549f41c8b433893e51e419d59bc7b.sock every 8 connection(s)
I20260925 17:25:46.957238 1959 acceptor_pool.cc:254] collecting diagnostics on the listening RPC socket unix:/tmp/dist-test-taskU2y0gX/test-tmp/rpc-test-8b4549f41c8b433893e51e419d59bc7b.sock every 8 connection(s)
W20260925 17:25:47.008315 1960 rpcz_store.cc:267] Call kudu.rpc_test.CalculatorService.Sleep from unix:<unnamed> (request call id 2) took 20 ms (client timeout 20 ms). Trace:
W20260925 17:25:47.008440 1960 rpcz_store.cc:269] 0925 17:25:46.987922 (+ 0us) service_pool.cc:170] Inserting onto call queue
0925 17:25:47.008270 (+ 20348us) service_pool.cc:214] Skipping call since client already timed out
0925 17:25:47.008297 (+ 27us) inbound_call.cc:173] Queueing failure response
Metrics: {}
W20260925 17:25:47.009454 1955 connection.cc:196] Error closing socket: Network error: TlsSocket::Close: Broken pipe
[ OK ] Parameters/TestRpc.TimedOutOnResponseMetricServiceQueue/SSL_UnixSocket (75 ms)
[ RUN ] Parameters/TestRpc.RpcPendingConnectionsMetric/SSL_UnixSocket
I20260925 17:25:47.013301 1981 acceptor_pool.cc:254] collecting diagnostics on the listening RPC socket 0.0.0.0:42719 every 8 connection(s)
I20260925 17:25:47.013360 1982 acceptor_pool.cc:254] collecting diagnostics on the listening RPC socket 0.0.0.0:42719 every 8 connection(s)
W20260925 17:25:47.023605 1977 negotiation.cc:337] Failed RPC negotiation. Trace:
0925 17:25:47.022951 (+ 0us) reactor.cc:625] Submitting negotiation task for server connection from 127.0.0.1:60014 (local address 127.0.0.1:42719)
0925 17:25:47.023108 (+ 157us) server_negotiation.cc:206] Beginning negotiation
0925 17:25:47.023112 (+ 4us) server_negotiation.cc:399] Waiting for connection header
0925 17:25:47.023277 (+ 165us) negotiation.cc:327] Negotiation complete: Network error: Server connection negotiation failed: server connection from 127.0.0.1:60014: BlockingRecv error: recv got EOF from 127.0.0.1:60014 (error 108)
Metrics: {"server-negotiator.queue_time_us":64}
[ OK ] Parameters/TestRpc.RpcPendingConnectionsMetric/SSL_UnixSocket (23 ms)
[ RUN ] Parameters/TestRpc.TestRpcContextClientDeadline/SSL_UnixSocket
I20260925 17:25:47.053558 1997 acceptor_pool.cc:254] collecting diagnostics on the listening RPC socket unix:/tmp/dist-test-taskU2y0gX/test-tmp/rpc-test-1cb33dafa30d4be78199c982019bfb60.sock every 8 connection(s)
I20260925 17:25:47.053619 1998 acceptor_pool.cc:254] collecting diagnostics on the listening RPC socket unix:/tmp/dist-test-taskU2y0gX/test-tmp/rpc-test-1cb33dafa30d4be78199c982019bfb60.sock every 8 connection(s)
W20260925 17:25:47.084585 1994 connection.cc:196] Error closing socket: Network error: TlsSocket::Close: Broken pipe
[ OK ] Parameters/TestRpc.TestRpcContextClientDeadline/SSL_UnixSocket (51 ms)
[ RUN ] Parameters/TestRpc.TestApplicationFeatureFlagUnsupportedServer/SSL_UnixSocket
I20260925 17:25:47.094780 2022 acceptor_pool.cc:254] collecting diagnostics on the listening RPC socket unix:/tmp/dist-test-taskU2y0gX/test-tmp/rpc-test-124119b07b42443382699a3871eb3bd1.sock every 8 connection(s)
I20260925 17:25:47.094832 2023 acceptor_pool.cc:254] collecting diagnostics on the listening RPC socket unix:/tmp/dist-test-taskU2y0gX/test-tmp/rpc-test-124119b07b42443382699a3871eb3bd1.sock every 8 connection(s)
W20260925 17:25:47.113395 2019 connection.cc:196] Error closing socket: Network error: TlsSocket::Close: Broken pipe
[ OK ] Parameters/TestRpc.TestApplicationFeatureFlagUnsupportedServer/SSL_UnixSocket (28 ms)
[ RUN ] Parameters/TestRpc.TestCancellationAsync/SSL_UnixSocket
I20260925 17:25:47.136610 2047 acceptor_pool.cc:254] collecting diagnostics on the listening RPC socket unix:/tmp/dist-test-taskU2y0gX/test-tmp/rpc-test-7ef60574ddc64b6187b8a7cd50523e8a.sock every 8 connection(s)
I20260925 17:25:47.136611 2048 acceptor_pool.cc:254] collecting diagnostics on the listening RPC socket unix:/tmp/dist-test-taskU2y0gX/test-tmp/rpc-test-7ef60574ddc64b6187b8a7cd50523e8a.sock every 8 connection(s)
I20260925 17:25:47.136914 1615 rpc-test.cc:1716] Connecting to unix:/tmp/dist-test-taskU2y0gX/test-tmp/rpc-test-7ef60574ddc64b6187b8a7cd50523e8a.sock
I20260925 17:25:47.150224 1615 test_util.cc:268] Using random seed: 29812621
I20260925 17:25:47.170912 2051 rpc-test-base.h:240] got call: sleep_micros: 500 pattern: 4294967295 num_repetitions: 2097152 sidecar_idx: 0
I20260925 17:25:47.187294 2050 rpc-test-base.h:240] got call: sleep_micros: 500 pattern: 4294967295 num_repetitions: 2097152 sidecar_idx: 0
I20260925 17:25:47.203871 2051 rpc-test-base.h:240] got call: sleep_micros: 500 pattern: 4294967295 num_repetitions: 2097152 sidecar_idx: 0
I20260925 17:25:47.220250 2050 rpc-test-base.h:240] got call: sleep_micros: 500 pattern: 4294967295 num_repetitions: 2097152 sidecar_idx: 0
I20260925 17:25:47.239957 2050 rpc-test-base.h:240] got call: sleep_micros: 500 pattern: 4294967295 num_repetitions: 2097152 sidecar_idx: 0
I20260925 17:25:47.259227 2050 rpc-test-base.h:240] got call: sleep_micros: 500 pattern: 4294967295 num_repetitions: 2097152 sidecar_idx: 0
I20260925 17:25:47.275091 2051 rpc-test-base.h:240] got call: sleep_micros: 500 pattern: 4294967295 num_repetitions: 2097152 sidecar_idx: 0
W20260925 17:25:47.283349 2044 connection.cc:196] Error closing socket: Network error: TlsSocket::Close: Broken pipe
W20260925 17:25:47.293680 2044 connection.cc:441] server connection from unix:<unnamed> torn down before Call kudu.rpc.GenericCalculatorService.SleepWithSidecar from unix:<unnamed> (request call id 9) could send its response
[ OK ] Parameters/TestRpc.TestCancellationAsync/SSL_UnixSocket (180 ms)
[ RUN ] Parameters/TestRpc.TestPerformanceBySocketType/SSL_UnixSocket
I20260925 17:25:47.309633 2072 acceptor_pool.cc:254] collecting diagnostics on the listening RPC socket unix:/tmp/dist-test-taskU2y0gX/test-tmp/rpc-test-5a34fc27974947898e252e20d9b9538b.sock every 8 connection(s)
I20260925 17:25:47.309706 2073 acceptor_pool.cc:254] collecting diagnostics on the listening RPC socket unix:/tmp/dist-test-taskU2y0gX/test-tmp/rpc-test-5a34fc27974947898e252e20d9b9538b.sock every 8 connection(s)
I20260925 17:25:47.310047 1615 rpc-test.cc:1846] Connecting to unix:/tmp/dist-test-taskU2y0gX/test-tmp/rpc-test-5a34fc27974947898e252e20d9b9538b.sock
I20260925 17:25:48.851280 1615 rpc-test.cc:1859] Sending 1024MB via ssl-enabled unix socket: real 1.529s user 1.933s sys 0.841s
I20260925 17:25:50.471843 1615 rpc-test.cc:1859] Sending 1024MB via ssl-enabled unix socket: real 1.620s user 2.031s sys 0.917s
I20260925 17:25:52.055073 1615 rpc-test.cc:1859] Sending 1024MB via ssl-enabled unix socket: real 1.583s user 2.055s sys 0.823s
I20260925 17:25:53.609295 1615 rpc-test.cc:1859] Sending 1024MB via ssl-enabled unix socket: real 1.554s user 1.957s sys 0.860s
I20260925 17:25:55.170167 1615 rpc-test.cc:1859] Sending 1024MB via ssl-enabled unix socket: real 1.561s user 2.063s sys 0.772s
W20260925 17:25:55.171056 2069 connection.cc:196] Error closing socket: Network error: TlsSocket::Close: Broken pipe
[ OK ] Parameters/TestRpc.TestPerformanceBySocketType/SSL_UnixSocket (7876 ms)
[----------] 20 tests from Parameters/TestRpc (30156 ms total)
[----------] 1 test from Parameters/TestRpcSocketTxRxQueue
[ RUN ] Parameters/TestRpcSocketTxRxQueue.AcceptorRxQueueSizeMetric/0
I20260925 17:25:55.174708 2097 acceptor_pool.cc:254] collecting diagnostics on the listening RPC socket 0.0.0.0:42867 every 1 connection(s)
I20260925 17:25:55.174795 2098 acceptor_pool.cc:254] collecting diagnostics on the listening RPC socket 0.0.0.0:42867 every 1 connection(s)
W20260925 17:25:55.175563 2093 negotiation.cc:337] Failed RPC negotiation. Trace:
0925 17:25:55.175319 (+ 0us) reactor.cc:625] Submitting negotiation task for server connection from 127.0.0.1:40912 (local address 127.0.0.1:42867)
0925 17:25:55.175411 (+ 92us) server_negotiation.cc:206] Beginning negotiation
0925 17:25:55.175415 (+ 4us) server_negotiation.cc:399] Waiting for connection header
0925 17:25:55.175495 (+ 80us) negotiation.cc:327] Negotiation complete: Network error: Server connection negotiation failed: server connection from 127.0.0.1:40912: BlockingRecv error: recv got EOF from 127.0.0.1:40912 (error 108)
Metrics: {"server-negotiator.queue_time_us":22}
[ OK ] Parameters/TestRpcSocketTxRxQueue.AcceptorRxQueueSizeMetric/0 (5 ms)
[----------] 1 test from Parameters/TestRpcSocketTxRxQueue (5 ms total)
[----------] Global test environment tear-down
[==========] 21 tests from 2 test suites ran. (30161 ms total)
[ PASSED ] 20 tests.
[ FAILED ] 1 test, listed below:
[ FAILED ] Parameters/TestRpc.TestCallWithChainCertAndChainCA/SSL_UnixSocket, where GetParam() = (true, true)
1 FAILED TEST