Parameters/TestRpc.TestCallWithChainCertAndRootCA/SSL_TCP: /data0/somelongdirectorytoavoidrpathissues/src/kudu/src/kudu/rpc/rpc-test.cc:303: Failure
Failed
Bad status: Runtime error: could not verify certificate chain (error with cert: subject=CN = localhost, ST = sadfjas, C = AS, emailAddress = sdflkdsajf, O = lskdfjlsad, OU = sldfkja, issuer=C = AS, ST = ASDfkjdhf, L = lskdjf, O = saldfja, OU = skdjf, CN = localhost, emailAddress = sadjflkadsj): : certificate has expired
Google Test trace:
/data0/somelongdirectorytoavoidrpathissues/src/kudu/src/kudu/rpc/rpc-test.cc:300: Connecting to 0.0.0.0:39675
I20260928 03:45:42.407718 11280 test_util.cc:175] -----------------------------------------------
I20260928 03:45:42.407902 11280 test_util.cc:176] Had fatal failures, leaving test files at /tmp/dist-test-taskagIpGs/test-tmp/rpc-test.1.Parameters_TestRpc.TestCallWithChainCertAndRootCA_SSL_TCP.1790567140883634-11280-0
Note: This is test shard 2 of 8.
[==========] Running 21 tests from 2 test suites.
[----------] Global test environment set-up.
[----------] 1 test from TestRpc
[ RUN ] TestRpc.TestMethodsByName
[ OK ] TestRpc.TestMethodsByName (6 ms)
[----------] 1 test from TestRpc (6 ms total)
[----------] 20 tests from Parameters/TestRpc
[ RUN ] Parameters/TestRpc.TestAcceptorPoolStartStop/SSL_TCP
WARNING: Logging before InitGoogleLogging() is written to STDERR
I20260928 03:45:40.980091 11295 acceptor_pool.cc:254] collecting diagnostics on the listening RPC socket 0.0.0.0:40121 every 8 connection(s)
I20260928 03:45:40.981727 11296 acceptor_pool.cc:254] collecting diagnostics on the listening RPC socket 0.0.0.0:40121 every 8 connection(s)
W20260928 03:45:41.982283 11280 thread.cc:536] Waited for 1000ms trying to join with acceptor (tid 11296)
I20260928 03:45:42.133770 11307 acceptor_pool.cc:254] collecting diagnostics on the listening RPC socket 0.0.0.0:33457 every 8 connection(s)
I20260928 03:45:42.135309 11308 acceptor_pool.cc:254] collecting diagnostics on the listening RPC socket 0.0.0.0:33457 every 8 connection(s)
I20260928 03:45:42.161173 11318 acceptor_pool.cc:254] collecting diagnostics on the listening RPC socket 0.0.0.0:33895 every 8 connection(s)
I20260928 03:45:42.162616 11319 acceptor_pool.cc:254] collecting diagnostics on the listening RPC socket 0.0.0.0:33895 every 8 connection(s)
I20260928 03:45:42.188166 11329 acceptor_pool.cc:254] collecting diagnostics on the listening RPC socket 0.0.0.0:42313 every 8 connection(s)
I20260928 03:45:42.188927 11330 acceptor_pool.cc:254] collecting diagnostics on the listening RPC socket 0.0.0.0:42313 every 8 connection(s)
I20260928 03:45:42.219102 11340 acceptor_pool.cc:254] collecting diagnostics on the listening RPC socket 0.0.0.0:34647 every 8 connection(s)
I20260928 03:45:42.219833 11341 acceptor_pool.cc:254] collecting diagnostics on the listening RPC socket 0.0.0.0:34647 every 8 connection(s)
[ OK ] Parameters/TestRpc.TestAcceptorPoolStartStop/SSL_TCP (1281 ms)
[ RUN ] Parameters/TestRpc.TestCall/SSL_TCP
I20260928 03:45:42.259335 11353 acceptor_pool.cc:254] collecting diagnostics on the listening RPC socket 0.0.0.0:33601 every 8 connection(s)
I20260928 03:45:42.261611 11354 acceptor_pool.cc:254] collecting diagnostics on the listening RPC socket 0.0.0.0:33601 every 8 connection(s)
I20260928 03:45:42.266955 11280 rpc-test.cc:234] Connecting to 0.0.0.0:33601
[ OK ] Parameters/TestRpc.TestCall/SSL_TCP (136 ms)
[ RUN ] Parameters/TestRpc.TestCallWithChainCertAndRootCA/SSL_TCP
I20260928 03:45:42.387190 11378 acceptor_pool.cc:254] collecting diagnostics on the listening RPC socket 0.0.0.0:39675 every 8 connection(s)
I20260928 03:45:42.387964 11379 acceptor_pool.cc:254] collecting diagnostics on the listening RPC socket 0.0.0.0:39675 every 8 connection(s)
/data0/somelongdirectorytoavoidrpathissues/src/kudu/src/kudu/rpc/rpc-test.cc:303: Failure
Failed
Bad status: Runtime error: could not verify certificate chain (error with cert: subject=CN = localhost, ST = sadfjas, C = AS, emailAddress = sdflkdsajf, O = lskdfjlsad, OU = sldfkja, issuer=C = AS, ST = ASDfkjdhf, L = lskdjf, O = saldfja, OU = skdjf, CN = localhost, emailAddress = sadjflkadsj): : certificate has expired
Google Test trace:
/data0/somelongdirectorytoavoidrpathissues/src/kudu/src/kudu/rpc/rpc-test.cc:300: Connecting to 0.0.0.0:39675
I20260928 03:45:42.407718 11280 test_util.cc:175] -----------------------------------------------
I20260928 03:45:42.407902 11280 test_util.cc:176] Had fatal failures, leaving test files at /tmp/dist-test-taskagIpGs/test-tmp/rpc-test.1.Parameters_TestRpc.TestCallWithChainCertAndRootCA_SSL_TCP.1790567140883634-11280-0
[ FAILED ] Parameters/TestRpc.TestCallWithChainCertAndRootCA/SSL_TCP, where GetParam() = (true, false) (47 ms)
[ RUN ] Parameters/TestRpc.TestCallWithBadPasswordProtectedKey/SSL_TCP
[ OK ] Parameters/TestRpc.TestCallWithBadPasswordProtectedKey/SSL_TCP (36 ms)
[ RUN ] Parameters/TestRpc.TestInvalidMethodCall/SSL_TCP
I20260928 03:45:42.468379 11415 acceptor_pool.cc:254] collecting diagnostics on the listening RPC socket 0.0.0.0:35635 every 8 connection(s)
I20260928 03:45:42.469152 11416 acceptor_pool.cc:254] collecting diagnostics on the listening RPC socket 0.0.0.0:35635 every 8 connection(s)
I20260928 03:45:42.473241 11280 rpc-test.cc:406] Connecting to 0.0.0.0:35635
[ OK ] Parameters/TestRpc.TestInvalidMethodCall/SSL_TCP (64 ms)
[ RUN ] Parameters/TestRpc.TestHighFDs/SSL_TCP
I20260928 03:45:42.717532 11440 acceptor_pool.cc:254] collecting diagnostics on the listening RPC socket 0.0.0.0:45693 every 8 connection(s)
I20260928 03:45:42.718291 11441 acceptor_pool.cc:254] collecting diagnostics on the listening RPC socket 0.0.0.0:45693 every 8 connection(s)
[ OK ] Parameters/TestRpc.TestHighFDs/SSL_TCP (281 ms)
[ RUN ] Parameters/TestRpc.TestConnectionAlwaysKeepalive/SSL_TCP
I20260928 03:45:42.816985 11463 acceptor_pool.cc:254] collecting diagnostics on the listening RPC socket 0.0.0.0:40119 every 8 connection(s)
I20260928 03:45:42.817754 11464 acceptor_pool.cc:254] collecting diagnostics on the listening RPC socket 0.0.0.0:40119 every 8 connection(s)
I20260928 03:45:42.820848 11280 rpc-test.cc:532] Connecting to 0.0.0.0:40119
[ OK ] Parameters/TestRpc.TestConnectionAlwaysKeepalive/SSL_TCP (3061 ms)
[ RUN ] Parameters/TestRpc.TestReopenOutboundConnections/SSL_TCP
I20260928 03:45:45.875703 11486 acceptor_pool.cc:254] collecting diagnostics on the listening RPC socket 0.0.0.0:46085 every 8 connection(s)
I20260928 03:45:45.876462 11487 acceptor_pool.cc:254] collecting diagnostics on the listening RPC socket 0.0.0.0:46085 every 8 connection(s)
I20260928 03:45:45.879465 11280 rpc-test.cc:658] Connecting to 0.0.0.0:46085
[ OK ] Parameters/TestRpc.TestReopenOutboundConnections/SSL_TCP (352 ms)
[ RUN ] Parameters/TestRpc.TestConnectionNetworkPlane/SSL_TCP
I20260928 03:45:46.234632 11509 acceptor_pool.cc:254] collecting diagnostics on the listening RPC socket 0.0.0.0:39683 every 8 connection(s)
I20260928 03:45:46.235360 11510 acceptor_pool.cc:254] collecting diagnostics on the listening RPC socket 0.0.0.0:39683 every 8 connection(s)
I20260928 03:45:46.238466 11280 rpc-test.cc:772] Connecting to 0.0.0.0:39683
[ OK ] Parameters/TestRpc.TestConnectionNetworkPlane/SSL_TCP (87 ms)
[ RUN ] Parameters/TestRpc.TestTCPKeepalive/SSL_TCP
I20260928 03:45:46.309314 11534 acceptor_pool.cc:254] collecting diagnostics on the listening RPC socket 0.0.0.0:37579 every 8 connection(s)
I20260928 03:45:46.310048 11535 acceptor_pool.cc:254] collecting diagnostics on the listening RPC socket 0.0.0.0:37579 every 8 connection(s)
I20260928 03:45:46.347679 11538 rpc-test-base.h:222] got call: sleep_micros: 8000000 deferred: true
I20260928 03:45:54.351714 11538 rpcz_store.cc:275] Call kudu.rpc.GenericCalculatorService.Sleep from 127.0.0.1:50502 (request call id 0) took 8004 ms. Trace:
I20260928 03:45:54.352125 11538 rpcz_store.cc:276] 0928 03:45:46.347416 (+ 0us) service_pool.cc:170] Inserting onto call queue
0928 03:45:46.347527 (+ 111us) service_pool.cc:227] Handling call
0928 03:45:54.351522 (+8003995us) inbound_call.cc:173] Queueing success response
Metrics: {}
[ OK ] Parameters/TestRpc.TestTCPKeepalive/SSL_TCP (8074 ms)
[ RUN ] Parameters/TestRpc.TestMaxSmallSidecars/SSL_TCP
I20260928 03:45:54.399987 11560 acceptor_pool.cc:254] collecting diagnostics on the listening RPC socket 0.0.0.0:40723 every 8 connection(s)
I20260928 03:45:54.400832 11561 acceptor_pool.cc:254] collecting diagnostics on the listening RPC socket 0.0.0.0:40723 every 8 connection(s)
[ OK ] Parameters/TestRpc.TestMaxSmallSidecars/SSL_TCP (212 ms)
[ RUN ] Parameters/TestRpc.TestCallTimeout/SSL_TCP
I20260928 03:45:54.607180 11585 acceptor_pool.cc:254] collecting diagnostics on the listening RPC socket 0.0.0.0:35789 every 8 connection(s)
I20260928 03:45:54.607918 11586 acceptor_pool.cc:254] collecting diagnostics on the listening RPC socket 0.0.0.0:35789 every 8 connection(s)
I20260928 03:45:54.638619 11280 rpc-test-base.h:595] status: Timed out: connection negotiation to 0.0.0.0:35789 for RPC Sleep timed out after 0.000s (ON_OUTBOUND_QUEUE), seconds elapsed: 0.00247993
I20260928 03:45:54.645972 11589 rpc-test-base.h:222] got call: sleep_micros: 700000
I20260928 03:45:54.839872 11280 rpc-test-base.h:595] status: Timed out: Sleep RPC to 0.0.0.0:35789 timed out after 0.200s (SENT), seconds elapsed: 0.200892
I20260928 03:45:54.841699 11588 rpc-test-base.h:222] got call: sleep_micros: 2000000
W20260928 03:45:55.346652 11589 rpcz_store.cc:267] Call kudu.rpc.GenericCalculatorService.Sleep from 127.0.0.1:46270 (request call id 1) took 700 ms (client timeout 200 ms). Trace:
W20260928 03:45:55.346972 11589 rpcz_store.cc:269] 0928 03:45:54.645807 (+ 0us) service_pool.cc:170] Inserting onto call queue
0928 03:45:54.645912 (+ 105us) service_pool.cc:227] Handling call
0928 03:45:55.346569 (+700657us) inbound_call.cc:173] Queueing success response
Metrics: {}
I20260928 03:45:56.342365 11280 rpc-test-base.h:595] status: Timed out: Sleep RPC to 0.0.0.0:35789 timed out after 1.500s (SENT), seconds elapsed: 1.50195
W20260928 03:45:56.842250 11588 rpcz_store.cc:267] Call kudu.rpc.GenericCalculatorService.Sleep from 127.0.0.1:46270 (request call id 2) took 2001 ms (client timeout 1500 ms). Trace:
W20260928 03:45:56.842577 11588 rpcz_store.cc:269] 0928 03:45:54.841238 (+ 0us) service_pool.cc:170] Inserting onto call queue
0928 03:45:54.841376 (+ 138us) service_pool.cc:227] Handling call
0928 03:45:56.842194 (+2000818us) inbound_call.cc:173] Queueing success response
Metrics: {}
W20260928 03:45:56.843124 11584 connection.cc:441] server connection from 127.0.0.1:46270 torn down before Call kudu.rpc.GenericCalculatorService.Sleep from 127.0.0.1:46270 (request call id 2) could send its response
[ OK ] Parameters/TestRpc.TestCallTimeout/SSL_TCP (2269 ms)
[ RUN ] Parameters/TestRpc.TestServerShutsDown/SSL_TCP
I20260928 03:45:56.850116 11280 rpc-test.cc:1125] Connecting to 0.0.0.0:39809
W20260928 03:45:56.859817 11602 negotiation.cc:337] Failed RPC negotiation. Trace:
0928 03:45:56.858308 (+ 0us) reactor.cc:625] Submitting negotiation task for client connection to 0.0.0.0:39809 (local address 127.0.0.1:39760)
0928 03:45:56.858767 (+ 459us) negotiation.cc:107] Waiting for socket to connect
0928 03:45:56.858798 (+ 31us) client_negotiation.cc:174] Beginning negotiation
0928 03:45:56.859022 (+ 224us) client_negotiation.cc:252] Sending NEGOTIATE NegotiatePB request
0928 03:45:56.859237 (+ 215us) negotiation.cc:327] Negotiation complete: Network error: Client connection negotiation failed: client connection to 0.0.0.0:39809: BlockingWrite error: write error: Broken pipe (error 32)
Metrics: {"client-negotiator.queue_time_us":133}
[ OK ] Parameters/TestRpc.TestServerShutsDown/SSL_TCP (14 ms)
[ RUN ] Parameters/TestRpc.TimedOutOnResponseMetric/SSL_TCP
I20260928 03:45:56.887229 11619 acceptor_pool.cc:254] collecting diagnostics on the listening RPC socket 0.0.0.0:44787 every 8 connection(s)
I20260928 03:45:56.887948 11620 acceptor_pool.cc:254] collecting diagnostics on the listening RPC socket 0.0.0.0:44787 every 8 connection(s)
W20260928 03:45:57.145085 11623 rpcz_store.cc:267] Call kudu.rpc_test.CalculatorService.Sleep from 127.0.0.1:57950 (request call id 3) took 50 ms (client timeout 25 ms). Trace:
W20260928 03:45:57.145404 11623 rpcz_store.cc:269] 0928 03:45:57.094539 (+ 0us) service_pool.cc:170] Inserting onto call queue
0928 03:45:57.094661 (+ 122us) service_pool.cc:227] Handling call
0928 03:45:57.145019 (+ 50358us) inbound_call.cc:173] Queueing success response
Related trace 'test_child':
Metrics: {"test_sleep_us":50000,"child_traces":[["test_child",{"related_trace_metric":1}]]}
W20260928 03:45:57.204121 11623 rpcz_store.cc:267] Call kudu.rpc_test.CalculatorService.Sleep from 127.0.0.1:57950 (request call id 4) took 50 ms (client timeout 50 ms). Trace:
W20260928 03:45:57.204581 11623 rpcz_store.cc:269] 0928 03:45:57.153543 (+ 0us) service_pool.cc:170] Inserting onto call queue
0928 03:45:57.153668 (+ 125us) service_pool.cc:227] Handling call
0928 03:45:57.204045 (+ 50377us) inbound_call.cc:173] Queueing success response
Related trace 'test_child':
Metrics: {"test_sleep_us":50000,"child_traces":[["test_child",{"related_trace_metric":1}]]}
W20260928 03:45:57.206877 11618 connection.cc:441] server connection from 127.0.0.1:57950 torn down before Call kudu.rpc_test.CalculatorService.Sleep from 127.0.0.1:57950 (request call id 4) could send its response
[ OK ] Parameters/TestRpc.TimedOutOnResponseMetric/SSL_TCP (350 ms)
[ RUN ] Parameters/TestRpc.AcceptorDispatchingTimesMetric/SSL_TCP
I20260928 03:45:57.224663 11644 acceptor_pool.cc:254] collecting diagnostics on the listening RPC socket 0.0.0.0:33125 every 8 connection(s)
I20260928 03:45:57.225327 11645 acceptor_pool.cc:254] collecting diagnostics on the listening RPC socket 0.0.0.0:33125 every 8 connection(s)
W20260928 03:45:57.231594 11640 negotiation.cc:337] Failed RPC negotiation. Trace:
0928 03:45:57.229544 (+ 0us) reactor.cc:625] Submitting negotiation task for server connection from 127.0.0.1:36494 (local address 127.0.0.1:33125)
0928 03:45:57.230299 (+ 755us) server_negotiation.cc:206] Beginning negotiation
0928 03:45:57.230320 (+ 21us) server_negotiation.cc:399] Waiting for connection header
0928 03:45:57.230744 (+ 424us) negotiation.cc:327] Negotiation complete: Network error: Server connection negotiation failed: server connection from 127.0.0.1:36494: BlockingRecv error: recv got EOF from 127.0.0.1:36494 (error 108)
Metrics: {"server-negotiator.queue_time_us":239}
[ OK ] Parameters/TestRpc.AcceptorDispatchingTimesMetric/SSL_TCP (21 ms)
[ RUN ] Parameters/TestRpc.TestRpcCallbackDestroysMessenger/SSL_TCP
[ OK ] Parameters/TestRpc.TestRpcCallbackDestroysMessenger/SSL_TCP (19 ms)
[ RUN ] Parameters/TestRpc.TestApplicationFeatureFlag/SSL_TCP
I20260928 03:45:57.273408 11669 acceptor_pool.cc:254] collecting diagnostics on the listening RPC socket 0.0.0.0:42967 every 8 connection(s)
I20260928 03:45:57.274384 11670 acceptor_pool.cc:254] collecting diagnostics on the listening RPC socket 0.0.0.0:42967 every 8 connection(s)
W20260928 03:45:57.311651 11667 messenger.cc:357] Unable to handle RPC call: Not implemented: call requires unsupported application feature flags: 99
[ OK ] Parameters/TestRpc.TestApplicationFeatureFlag/SSL_TCP (65 ms)
[ RUN ] Parameters/TestRpc.TestCancellation/SSL_TCP
I20260928 03:45:57.351855 11694 acceptor_pool.cc:254] collecting diagnostics on the listening RPC socket 0.0.0.0:39179 every 8 connection(s)
I20260928 03:45:57.352682 11695 acceptor_pool.cc:254] collecting diagnostics on the listening RPC socket 0.0.0.0:39179 every 8 connection(s)
I20260928 03:45:57.355784 11280 rpc-test.cc:1648] Connecting to 0.0.0.0:39179
I20260928 03:45:57.489907 11280 rpc-test-base.h:595] status: Aborted: Sleep RPC to 0.0.0.0:39179 is cancelled in state READY, seconds elapsed: 0.000449498
I20260928 03:45:57.626487 11280 rpc-test-base.h:595] status: Aborted: Sleep RPC to 0.0.0.0:39179 is cancelled in state SENT, seconds elapsed: 0.000802015
I20260928 03:45:57.670599 11697 rpc-test-base.h:222] got call: sleep_micros: 510000
I20260928 03:45:57.797297 11280 rpc-test-base.h:595] status: Aborted: Sleep RPC to 0.0.0.0:39179 is cancelled in state SENT, seconds elapsed: 0.00127145
I20260928 03:45:57.837060 11696 rpc-test-base.h:222] got call: sleep_micros: 510000
I20260928 03:45:57.971704 11280 rpc-test-base.h:595] status: Aborted: Sleep RPC to 0.0.0.0:39179 is cancelled in state SENT, seconds elapsed: 0.000854858
W20260928 03:45:58.008292 11698 rpcz_store.cc:267] Call kudu.rpc.GenericCalculatorService.Sleep from 127.0.0.1:51424 (request call id 11) took 14 ms (client timeout 10 ms). Trace:
W20260928 03:45:58.008630 11698 rpcz_store.cc:269] 0928 03:45:57.993577 (+ 0us) service_pool.cc:170] Inserting onto call queue
0928 03:45:58.007958 (+ 14381us) service_pool.cc:214] Skipping call since client already timed out
0928 03:45:58.008043 (+ 85us) inbound_call.cc:173] Queueing failure response
Metrics: {}
I20260928 03:45:58.009193 11698 rpc-test-base.h:222] got call: sleep_micros: 1500000
W20260928 03:45:58.181205 11697 rpcz_store.cc:267] Call kudu.rpc.GenericCalculatorService.Sleep from 127.0.0.1:51424 (request call id 3) took 510 ms (client timeout 10 ms). Trace:
W20260928 03:45:58.181583 11697 rpcz_store.cc:269] 0928 03:45:57.670402 (+ 0us) service_pool.cc:170] Inserting onto call queue
0928 03:45:57.670542 (+ 140us) service_pool.cc:227] Handling call
0928 03:45:58.181152 (+510610us) inbound_call.cc:173] Queueing success response
Metrics: {}
W20260928 03:45:58.347784 11696 rpcz_store.cc:267] Call kudu.rpc.GenericCalculatorService.Sleep from 127.0.0.1:51424 (request call id 7) took 510 ms (client timeout 10 ms). Trace:
W20260928 03:45:58.348127 11696 rpcz_store.cc:269] 0928 03:45:57.836860 (+ 0us) service_pool.cc:170] Inserting onto call queue
0928 03:45:57.836990 (+ 130us) service_pool.cc:227] Handling call
0928 03:45:58.347730 (+510740us) inbound_call.cc:173] Queueing success response
Metrics: {}
I20260928 03:45:58.974315 11280 rpc-test-base.h:595] status: Timed out: Sleep RPC to 0.0.0.0:39179 timed out after 1.000s (SENT), seconds elapsed: 1.00229
I20260928 03:45:58.975721 11696 rpc-test-base.h:222] got call: sleep_micros: 1500000
W20260928 03:45:59.509752 11698 rpcz_store.cc:267] Call kudu.rpc.GenericCalculatorService.Sleep from 127.0.0.1:51424 (request call id 12) took 1516 ms (client timeout 1000 ms). Trace:
W20260928 03:45:59.510089 11698 rpcz_store.cc:269] 0928 03:45:57.993783 (+ 0us) service_pool.cc:170] Inserting onto call queue
0928 03:45:58.009158 (+ 15375us) service_pool.cc:227] Handling call
0928 03:45:59.509701 (+1500543us) inbound_call.cc:173] Queueing success response
Metrics: {}
I20260928 03:45:59.976668 11280 rpc-test-base.h:595] status: Timed out: Sleep RPC to 0.0.0.0:39179 timed out after 1.000s (SENT), seconds elapsed: 1.00197
W20260928 03:45:59.978089 11691 messenger.cc:357] Unable to handle RPC call: Not implemented: call requires unsupported application feature flags: 99, 1
W20260928 03:45:59.979446 11691 messenger.cc:357] Unable to handle RPC call: Not implemented: call requires unsupported application feature flags: 99, 1
W20260928 03:46:00.476313 11696 rpcz_store.cc:267] Call kudu.rpc.GenericCalculatorService.Sleep from 127.0.0.1:51424 (request call id 13) took 1500 ms (client timeout 1000 ms). Trace:
W20260928 03:46:00.476682 11696 rpcz_store.cc:269] 0928 03:45:58.975512 (+ 0us) service_pool.cc:170] Inserting onto call queue
0928 03:45:58.975670 (+ 158us) service_pool.cc:227] Handling call
0928 03:46:00.476192 (+1500522us) inbound_call.cc:173] Queueing success response
Metrics: {}
W20260928 03:46:00.477319 11691 connection.cc:441] server connection from 127.0.0.1:51424 torn down before Call kudu.rpc.GenericCalculatorService.Sleep from 127.0.0.1:51424 (request call id 13) could send its response
[ OK ] Parameters/TestRpc.TestCancellation/SSL_TCP (3163 ms)
[ RUN ] Parameters/TestRpc.TestCancellationMultiThreads/SSL_TCP
I20260928 03:46:00.523506 11719 acceptor_pool.cc:254] collecting diagnostics on the listening RPC socket 0.0.0.0:40815 every 8 connection(s)
I20260928 03:46:00.524305 11720 acceptor_pool.cc:254] collecting diagnostics on the listening RPC socket 0.0.0.0:40815 every 8 connection(s)
I20260928 03:46:00.527383 11280 rpc-test.cc:1808] Connecting to 0.0.0.0:40815
I20260928 03:46:00.673060 11733 test_util.cc:268] Using random seed: -410062072
I20260928 03:46:00.675365 11734 test_util.cc:268] Using random seed: -410059764
I20260928 03:46:00.676720 11735 test_util.cc:268] Using random seed: -410058412
I20260928 03:46:00.678323 11736 test_util.cc:268] Using random seed: -410056835
I20260928 03:46:00.679850 11737 test_util.cc:268] Using random seed: -410055418
I20260928 03:46:00.681475 11738 test_util.cc:268] Using random seed: -410053803
I20260928 03:46:00.682986 11739 test_util.cc:268] Using random seed: -410052270
I20260928 03:46:00.685210 11740 test_util.cc:268] Using random seed: -410050087
I20260928 03:46:00.686546 11741 test_util.cc:268] Using random seed: -410048714
I20260928 03:46:00.687899 11742 test_util.cc:268] Using random seed: -410047352
I20260928 03:46:00.689318 11743 test_util.cc:268] Using random seed: -410045950
I20260928 03:46:00.691104 11744 test_util.cc:268] Using random seed: -410044205
I20260928 03:46:00.692714 11745 test_util.cc:268] Using random seed: -410042576
I20260928 03:46:00.695413 11746 test_util.cc:268] Using random seed: -410040603
I20260928 03:46:00.698051 11747 test_util.cc:268] Using random seed: -410037265
I20260928 03:46:00.699640 11748 test_util.cc:268] Using random seed: -410035631
I20260928 03:46:00.701745 11749 test_util.cc:268] Using random seed: -410033538
I20260928 03:46:00.703419 11750 test_util.cc:268] Using random seed: -410031861
I20260928 03:46:00.705118 11751 test_util.cc:268] Using random seed: -410030180
I20260928 03:46:00.706678 11752 test_util.cc:268] Using random seed: -410028578
I20260928 03:46:00.709492 11753 test_util.cc:268] Using random seed: -410025795
I20260928 03:46:00.711089 11754 test_util.cc:268] Using random seed: -410024210
I20260928 03:46:00.713001 11755 test_util.cc:268] Using random seed: -410022257
I20260928 03:46:00.716013 11756 test_util.cc:268] Using random seed: -410019249
I20260928 03:46:00.717866 11757 test_util.cc:268] Using random seed: -410017396
I20260928 03:46:00.719573 11758 test_util.cc:268] Using random seed: -410015718
I20260928 03:46:00.721217 11759 test_util.cc:268] Using random seed: -410014077
I20260928 03:46:00.722922 11760 test_util.cc:268] Using random seed: -410012363
I20260928 03:46:00.724576 11761 test_util.cc:268] Using random seed: -410010710
I20260928 03:46:00.726238 11762 test_util.cc:268] Using random seed: -410009044
[ OK ] Parameters/TestRpc.TestCancellationMultiThreads/SSL_TCP (17416 ms)
[ RUN ] Parameters/TestRpc.TestCallId/SSL_TCP
I20260928 03:46:17.950781 11776 acceptor_pool.cc:254] collecting diagnostics on the listening RPC socket 0.0.0.0:36887 every 8 connection(s)
I20260928 03:46:17.951570 11777 acceptor_pool.cc:254] collecting diagnostics on the listening RPC socket 0.0.0.0:36887 every 8 connection(s)
[ OK ] Parameters/TestRpc.TestCallId/SSL_TCP (102 ms)
[----------] 20 tests from Parameters/TestRpc (37060 ms total)
[----------] Global test environment tear-down
[==========] 21 tests from 2 test suites ran. (37068 ms total)
[ PASSED ] 20 tests.
[ FAILED ] 1 test, listed below:
[ FAILED ] Parameters/TestRpc.TestCallWithChainCertAndRootCA/SSL_TCP, where GetParam() = (true, false)
1 FAILED TEST