Diagnosed failure

Parameters/TestRpc.TestCallWithChainCertAndChainCA/SSL_UnixSocket: /data0/somelongdirectorytoavoidrpathissues/src/kudu/src/kudu/rpc/rpc-test.cc:270: Failure
Failed
Bad status: Runtime error: could not verify certificate chain (error with cert: subject=CN = localhost, ST = sadfjas, C = AS, emailAddress = sdflkdsajf, O = lskdfjlsad, OU = sldfkja, issuer=C = AS, ST = ASDfkjdhf, L = lskdjf, O = saldfja, OU = skdjf, CN = localhost, emailAddress = sadjflkadsj): : certificate has expired
Google Test trace:
/data0/somelongdirectorytoavoidrpathissues/src/kudu/src/kudu/rpc/rpc-test.cc:267: Connecting to unix:/tmp/dist-test-taskQEJATU/test-tmp/rpc-test-a731c6aae08d40cebdcd8ec8f92c2ed1.sock
I20260929 02:46:47.412266 16533 test_util.cc:175] -----------------------------------------------
I20260929 02:46:47.412361 16533 test_util.cc:176] Had fatal failures, leaving test files at /tmp/dist-test-taskQEJATU/test-tmp/rpc-test.6.Parameters_TestRpc.TestCallWithChainCertAndChainCA_SSL_UnixSocket.1790650007297750-16533-0

Full log

Note: This is test shard 7 of 8.
[==========] Running 21 tests from 2 test suites.
[----------] Global test environment set-up.
[----------] 20 tests from Parameters/TestRpc
[ RUN      ] Parameters/TestRpc.TestMessengerCreateDestroy/SSL_UnixSocket
WARNING: Logging before InitGoogleLogging() is written to STDERR
I20260929 02:46:47.348696 16533 rpc-test.cc:169] started messenger TestCreateDestroy
[       OK ] Parameters/TestRpc.TestMessengerCreateDestroy/SSL_UnixSocket (34 ms)
[ RUN      ] Parameters/TestRpc.TestNegotiationDeadlock/SSL_UnixSocket
I20260929 02:46:47.368686 16553 acceptor_pool.cc:254] collecting diagnostics on the listening RPC socket unix:/tmp/dist-test-taskQEJATU/test-tmp/rpc-test-6e59d1cf2d874d4d8d408ff24fd2bba5.sock every 8 connection(s)
I20260929 02:46:47.368956 16554 acceptor_pool.cc:254] collecting diagnostics on the listening RPC socket unix:/tmp/dist-test-taskQEJATU/test-tmp/rpc-test-6e59d1cf2d874d4d8d408ff24fd2bba5.sock every 8 connection(s)
[       OK ] Parameters/TestRpc.TestNegotiationDeadlock/SSL_UnixSocket (35 ms)
[ RUN      ] Parameters/TestRpc.TestCallWithChainCertAndChainCA/SSL_UnixSocket
I20260929 02:46:47.400559 16569 acceptor_pool.cc:254] collecting diagnostics on the listening RPC socket unix:/tmp/dist-test-taskQEJATU/test-tmp/rpc-test-a731c6aae08d40cebdcd8ec8f92c2ed1.sock every 8 connection(s)
I20260929 02:46:47.400885 16570 acceptor_pool.cc:254] collecting diagnostics on the listening RPC socket unix:/tmp/dist-test-taskQEJATU/test-tmp/rpc-test-a731c6aae08d40cebdcd8ec8f92c2ed1.sock every 8 connection(s)
/data0/somelongdirectorytoavoidrpathissues/src/kudu/src/kudu/rpc/rpc-test.cc:270: Failure
Failed
Bad status: Runtime error: could not verify certificate chain (error with cert: subject=CN = localhost, ST = sadfjas, C = AS, emailAddress = sdflkdsajf, O = lskdfjlsad, OU = sldfkja, issuer=C = AS, ST = ASDfkjdhf, L = lskdjf, O = saldfja, OU = skdjf, CN = localhost, emailAddress = sadjflkadsj): : certificate has expired
Google Test trace:
/data0/somelongdirectorytoavoidrpathissues/src/kudu/src/kudu/rpc/rpc-test.cc:267: Connecting to unix:/tmp/dist-test-taskQEJATU/test-tmp/rpc-test-a731c6aae08d40cebdcd8ec8f92c2ed1.sock
I20260929 02:46:47.412266 16533 test_util.cc:175] -----------------------------------------------
I20260929 02:46:47.412361 16533 test_util.cc:176] Had fatal failures, leaving test files at /tmp/dist-test-taskQEJATU/test-tmp/rpc-test.6.Parameters_TestRpc.TestCallWithChainCertAndChainCA_SSL_UnixSocket.1790650007297750-16533-0
[  FAILED  ] Parameters/TestRpc.TestCallWithChainCertAndChainCA/SSL_UnixSocket, where GetParam() = (true, true) (24 ms)
[ RUN      ] Parameters/TestRpc.TestCallWithPasswordProtectedKey/SSL_UnixSocket
I20260929 02:46:47.433032 16594 acceptor_pool.cc:254] collecting diagnostics on the listening RPC socket unix:/tmp/dist-test-taskQEJATU/test-tmp/rpc-test-4e2c7f5b016a404eb4d393fea1eba374.sock every 8 connection(s)
I20260929 02:46:47.433256 16595 acceptor_pool.cc:254] collecting diagnostics on the listening RPC socket unix:/tmp/dist-test-taskQEJATU/test-tmp/rpc-test-4e2c7f5b016a404eb4d393fea1eba374.sock every 8 connection(s)
W20260929 02:46:47.462281 16591 connection.cc:196] Error closing socket: Network error: TlsSocket::Close: Broken pipe
[       OK ] Parameters/TestRpc.TestCallWithPasswordProtectedKey/SSL_UnixSocket (53 ms)
[ RUN      ] Parameters/TestRpc.TestCallToBadServer/SSL_UnixSocket
I20260929 02:46:47.484426 16533 rpc-test.cc:394] Status: Network error: Client connection negotiation failed: client connection to 0.0.0.0:0: connect: Connection refused (error 111)
I20260929 02:46:47.485078 16533 rpc-test.cc:394] Status: Network error: Client connection negotiation failed: client connection to 0.0.0.0:0: connect: Connection refused (error 111)
I20260929 02:46:47.485637 16533 rpc-test.cc:394] Status: Network error: Client connection negotiation failed: client connection to 0.0.0.0:0: connect: Connection refused (error 111)
I20260929 02:46:47.486184 16533 rpc-test.cc:394] Status: Network error: Client connection negotiation failed: client connection to 0.0.0.0:0: connect: Connection refused (error 111)
I20260929 02:46:47.486724 16533 rpc-test.cc:394] Status: Network error: Client connection negotiation failed: client connection to 0.0.0.0:0: connect: Connection refused (error 111)
[       OK ] Parameters/TestRpc.TestCallToBadServer/SSL_UnixSocket (21 ms)
[ RUN      ] Parameters/TestRpc.TestWrongService/SSL_UnixSocket
I20260929 02:46:47.520093 16629 acceptor_pool.cc:254] collecting diagnostics on the listening RPC socket unix:/tmp/dist-test-taskQEJATU/test-tmp/rpc-test-79d28b0b3e474590b538bb1da5098349.sock every 8 connection(s)
I20260929 02:46:47.520336 16630 acceptor_pool.cc:254] collecting diagnostics on the listening RPC socket unix:/tmp/dist-test-taskQEJATU/test-tmp/rpc-test-79d28b0b3e474590b538bb1da5098349.sock every 8 connection(s)
I20260929 02:46:47.558954 16626 messenger.cc:345] service WrongServiceName not registered on TestServer
[       OK ] Parameters/TestRpc.TestWrongService/SSL_UnixSocket (75 ms)
[ RUN      ] Parameters/TestRpc.TestConnectionKeepalive/SSL_UnixSocket
I20260929 02:46:47.582154 16652 acceptor_pool.cc:254] collecting diagnostics on the listening RPC socket unix:/tmp/dist-test-taskQEJATU/test-tmp/rpc-test-58b6fc9dd9ad4ab38185b960f782ff73.sock every 8 connection(s)
I20260929 02:46:47.582379 16653 acceptor_pool.cc:254] collecting diagnostics on the listening RPC socket unix:/tmp/dist-test-taskQEJATU/test-tmp/rpc-test-58b6fc9dd9ad4ab38185b960f782ff73.sock every 8 connection(s)
I20260929 02:46:47.583300 16533 rpc-test.cc:488] Connecting to unix:/tmp/dist-test-taskQEJATU/test-tmp/rpc-test-58b6fc9dd9ad4ab38185b960f782ff73.sock
W20260929 02:46:48.066119 16665 connection.cc:196] Error closing socket: Network error: TlsSocket::Close: Broken pipe
[       OK ] Parameters/TestRpc.TestConnectionKeepalive/SSL_UnixSocket (1044 ms)
[ RUN      ] Parameters/TestRpc.TestClientConnectionMetrics/SSL_UnixSocket
I20260929 02:46:48.627053 16677 acceptor_pool.cc:254] collecting diagnostics on the listening RPC socket unix:/tmp/dist-test-taskQEJATU/test-tmp/rpc-test-1ea83e4ec1424c3b9b0aa7870627924b.sock every 8 connection(s)
I20260929 02:46:48.627285 16678 acceptor_pool.cc:254] collecting diagnostics on the listening RPC socket unix:/tmp/dist-test-taskQEJATU/test-tmp/rpc-test-1ea83e4ec1424c3b9b0aa7870627924b.sock every 8 connection(s)
I20260929 02:46:48.628163 16533 rpc-test.cc:569] Connecting to unix:/tmp/dist-test-taskQEJATU/test-tmp/rpc-test-1ea83e4ec1424c3b9b0aa7870627924b.sock
W20260929 02:47:09.198256 16674 connection.cc:196] Error closing socket: Network error: TlsSocket::Close: Broken pipe
[       OK ] Parameters/TestRpc.TestClientConnectionMetrics/SSL_UnixSocket (20595 ms)
[ RUN      ] Parameters/TestRpc.TestCredentialsPolicy/SSL_UnixSocket
I20260929 02:47:09.219893 16700 acceptor_pool.cc:254] collecting diagnostics on the listening RPC socket unix:/tmp/dist-test-taskQEJATU/test-tmp/rpc-test-f70b877ec06d4c96b313276c8ac64af5.sock every 8 connection(s)
I20260929 02:47:09.220079 16701 acceptor_pool.cc:254] collecting diagnostics on the listening RPC socket unix:/tmp/dist-test-taskQEJATU/test-tmp/rpc-test-f70b877ec06d4c96b313276c8ac64af5.sock every 8 connection(s)
I20260929 02:47:09.220955 16533 rpc-test.cc:700] Connecting to unix:/tmp/dist-test-taskQEJATU/test-tmp/rpc-test-f70b877ec06d4c96b313276c8ac64af5.sock
W20260929 02:47:09.250361 16699 connection.cc:196] Error closing socket: Network error: TlsSocket::Close: Broken pipe
W20260929 02:47:09.258037 16699 connection.cc:196] Error closing socket: Network error: TlsSocket::Close: Broken pipe
[       OK ] Parameters/TestRpc.TestCredentialsPolicy/SSL_UnixSocket (57 ms)
[ RUN      ] Parameters/TestRpc.TestCallLongerThanKeepalive/SSL_UnixSocket
I20260929 02:47:09.270709 16725 acceptor_pool.cc:254] collecting diagnostics on the listening RPC socket unix:/tmp/dist-test-taskQEJATU/test-tmp/rpc-test-e9b62d3e77ef4139934e70bf52ae6fa9.sock every 8 connection(s)
I20260929 02:47:09.270934 16726 acceptor_pool.cc:254] collecting diagnostics on the listening RPC socket unix:/tmp/dist-test-taskQEJATU/test-tmp/rpc-test-e9b62d3e77ef4139934e70bf52ae6fa9.sock every 8 connection(s)
I20260929 02:47:09.299700 16729 rpc-test-base.h:222] got call: sleep_micros: 3000000 deferred: true
I20260929 02:47:12.301424 16729 rpcz_store.cc:275] Call kudu.rpc.GenericCalculatorService.Sleep from unix:<unnamed> (request call id 0) took 3001 ms. Trace:
I20260929 02:47:12.301581 16729 rpcz_store.cc:276] 0929 02:47:09.299587 (+     0us) service_pool.cc:170] Inserting onto call queue
0929 02:47:09.299649 (+    62us) service_pool.cc:227] Handling call
0929 02:47:12.301382 (+3001733us) inbound_call.cc:173] Queueing success response
Metrics: {}
[       OK ] Parameters/TestRpc.TestCallLongerThanKeepalive/SSL_UnixSocket (3047 ms)
[ RUN      ] Parameters/TestRpc.TestRpcSidecar/SSL_UnixSocket
I20260929 02:47:12.337013 16750 acceptor_pool.cc:254] collecting diagnostics on the listening RPC socket unix:/tmp/dist-test-taskQEJATU/test-tmp/rpc-test-b74e00e182d343b69aec08baf6fb9958.sock every 8 connection(s)
I20260929 02:47:12.337353 16751 acceptor_pool.cc:254] collecting diagnostics on the listening RPC socket unix:/tmp/dist-test-taskQEJATU/test-tmp/rpc-test-b74e00e182d343b69aec08baf6fb9958.sock every 8 connection(s)
[       OK ] Parameters/TestRpc.TestRpcSidecar/SSL_UnixSocket (125 ms)
[ RUN      ] Parameters/TestRpc.TestRpcSidecarLimits/SSL_UnixSocket
I20260929 02:47:19.038923 16775 acceptor_pool.cc:254] collecting diagnostics on the listening RPC socket unix:/tmp/dist-test-taskQEJATU/test-tmp/rpc-test-72ad507ff32f4357905e1be98ff42efb.sock every 8 connection(s)
I20260929 02:47:19.039243 16776 acceptor_pool.cc:254] collecting diagnostics on the listening RPC socket unix:/tmp/dist-test-taskQEJATU/test-tmp/rpc-test-72ad507ff32f4357905e1be98ff42efb.sock every 8 connection(s)
W20260929 02:47:19.060784 16533 serialization.cc:72] Serialized kudu.rpc_test.PushStringsRequestPB (2147483654 bytes) is larger than the maximum configured RPC message size (52428800 bytes). Sending anyway, but peer may reject the data.
W20260929 02:47:19.067852 16772 connection.cc:535] server connection from unix:<unnamed> recv error: Network error: RPC frame had a length of 2147483714, but we only support messages up to 52428800 bytes long.
W20260929 02:47:19.068042 16772 connection.cc:158] shutting down server connection from unix:<unnamed> with pending inbound data: 4/2147483714 bytes received; last active 0 ns ago: status Network error: RPC frame had a length of 2147483714, but we only support messages up to 52428800 bytes long.
W20260929 02:47:19.068586 16788 connection.cc:196] Error closing socket: Network error: TlsSocket::Close: Broken pipe
I20260929 02:47:19.093082 16800 acceptor_pool.cc:254] collecting diagnostics on the listening RPC socket unix:/tmp/dist-test-taskQEJATU/test-tmp/rpc-test-72ad507ff32f4357905e1be98ff42efb.sock every 8 connection(s)
I20260929 02:47:19.093159 16801 acceptor_pool.cc:254] collecting diagnostics on the listening RPC socket unix:/tmp/dist-test-taskQEJATU/test-tmp/rpc-test-72ad507ff32f4357905e1be98ff42efb.sock every 8 connection(s)
W20260929 02:47:33.655650 16797 connection.cc:577] server connection from unix:<unnamed>: received bad data: 'Corruption: Invalid packet: message had a length of 2147483710, but we only support messages up to 2147483647 bytes
'
W20260929 02:47:33.656380 16813 connection.cc:196] Error closing socket: Network error: TlsSocket::Close: Broken pipe
[       OK ] Parameters/TestRpc.TestRpcSidecarLimits/SSL_UnixSocket (21653 ms)
[ RUN      ] Parameters/TestRpc.TestCallTimeoutDoesntAffectNegotiation/SSL_UnixSocket
I20260929 02:47:34.107000 16825 acceptor_pool.cc:254] collecting diagnostics on the listening RPC socket unix:/tmp/dist-test-taskQEJATU/test-tmp/rpc-test-db7ed09ee3ff471e986eed117b9c0c42.sock every 8 connection(s)
I20260929 02:47:34.107254 16826 acceptor_pool.cc:254] collecting diagnostics on the listening RPC socket unix:/tmp/dist-test-taskQEJATU/test-tmp/rpc-test-db7ed09ee3ff471e986eed117b9c0c42.sock every 8 connection(s)
W20260929 02:47:34.133996 16821 negotiation.cc:266] Injecting 500ms delay in negotiation
I20260929 02:47:34.184417 16533 rpc-test-base.h:595] status: Timed out: connection negotiation to unix:/tmp/dist-test-taskQEJATU/test-tmp/rpc-test-db7ed09ee3ff471e986eed117b9c0c42.sock for RPC Sleep timed out after 0.050s (ON_OUTBOUND_QUEUE), seconds elapsed: 0.0510403
W20260929 02:47:34.642784 16822 connection.cc:196] Error closing socket: Network error: TlsSocket::Close: Broken pipe
[       OK ] Parameters/TestRpc.TestCallTimeoutDoesntAffectNegotiation/SSL_UnixSocket (558 ms)
[ RUN      ] Parameters/TestRpc.TestRpcHandlerLatencyMetric/SSL_UnixSocket
I20260929 02:47:34.660737 16850 acceptor_pool.cc:254] collecting diagnostics on the listening RPC socket unix:/tmp/dist-test-taskQEJATU/test-tmp/rpc-test-f0fae479e3324e9b94c8a1a29d721e6b.sock every 8 connection(s)
I20260929 02:47:34.660974 16851 acceptor_pool.cc:254] collecting diagnostics on the listening RPC socket unix:/tmp/dist-test-taskQEJATU/test-tmp/rpc-test-f0fae479e3324e9b94c8a1a29d721e6b.sock every 8 connection(s)
I20260929 02:47:34.706552 16533 rpc-test.cc:1236] Sleep() min lat: 20688
I20260929 02:47:34.706667 16533 rpc-test.cc:1237] Sleep() mean lat: 20688
I20260929 02:47:34.706714 16533 rpc-test.cc:1238] Sleep() max lat: 20688
I20260929 02:47:34.706743 16533 rpc-test.cc:1239] Sleep() #calls: 1
[       OK ] Parameters/TestRpc.TestRpcHandlerLatencyMetric/SSL_UnixSocket (65 ms)
[ RUN      ] Parameters/TestRpc.TimedOutOnResponseMetricServiceQueue/SSL_UnixSocket
I20260929 02:47:34.730540 16876 acceptor_pool.cc:254] collecting diagnostics on the listening RPC socket unix:/tmp/dist-test-taskQEJATU/test-tmp/rpc-test-b636742fc6424fa5ba1ac6b59f871235.sock every 8 connection(s)
I20260929 02:47:34.730796 16877 acceptor_pool.cc:254] collecting diagnostics on the listening RPC socket unix:/tmp/dist-test-taskQEJATU/test-tmp/rpc-test-b636742fc6424fa5ba1ac6b59f871235.sock every 8 connection(s)
W20260929 02:47:34.791294 16878 rpcz_store.cc:267] Call kudu.rpc_test.CalculatorService.Sleep from unix:<unnamed> (request call id 2) took 20 ms (client timeout 20 ms). Trace:
W20260929 02:47:34.791455 16878 rpcz_store.cc:269] 0929 02:47:34.770716 (+     0us) service_pool.cc:170] Inserting onto call queue
0929 02:47:34.791215 (+ 20499us) service_pool.cc:214] Skipping call since client already timed out
0929 02:47:34.791271 (+    56us) inbound_call.cc:173] Queueing failure response
Metrics: {}
W20260929 02:47:34.792807 16873 connection.cc:196] Error closing socket: Network error: TlsSocket::Close: Broken pipe
[       OK ] Parameters/TestRpc.TimedOutOnResponseMetricServiceQueue/SSL_UnixSocket (83 ms)
[ RUN      ] Parameters/TestRpc.RpcPendingConnectionsMetric/SSL_UnixSocket
I20260929 02:47:34.800838 16899 acceptor_pool.cc:254] collecting diagnostics on the listening RPC socket 0.0.0.0:34969 every 8 connection(s)
I20260929 02:47:34.801072 16900 acceptor_pool.cc:254] collecting diagnostics on the listening RPC socket 0.0.0.0:34969 every 8 connection(s)
W20260929 02:47:34.803017 16895 negotiation.cc:337] Failed RPC negotiation. Trace:
0929 02:47:34.802412 (+     0us) reactor.cc:625] Submitting negotiation task for server connection from 127.0.0.1:37128 (local address 127.0.0.1:34969)
0929 02:47:34.802572 (+   160us) server_negotiation.cc:206] Beginning negotiation
0929 02:47:34.802576 (+     4us) server_negotiation.cc:399] Waiting for connection header
0929 02:47:34.802699 (+   123us) negotiation.cc:327] Negotiation complete: Network error: Server connection negotiation failed: server connection from 127.0.0.1:37128: BlockingRecv error: recv got EOF from 127.0.0.1:37128 (error 108)
Metrics: {"server-negotiator.queue_time_us":51}
[       OK ] Parameters/TestRpc.RpcPendingConnectionsMetric/SSL_UnixSocket (19 ms)
[ RUN      ] Parameters/TestRpc.TestRpcContextClientDeadline/SSL_UnixSocket
I20260929 02:47:34.829995 16915 acceptor_pool.cc:254] collecting diagnostics on the listening RPC socket unix:/tmp/dist-test-taskQEJATU/test-tmp/rpc-test-f79cf3359b1f40e8a099a109d65e631c.sock every 8 connection(s)
I20260929 02:47:34.830303 16916 acceptor_pool.cc:254] collecting diagnostics on the listening RPC socket unix:/tmp/dist-test-taskQEJATU/test-tmp/rpc-test-f79cf3359b1f40e8a099a109d65e631c.sock every 8 connection(s)
[       OK ] Parameters/TestRpc.TestRpcContextClientDeadline/SSL_UnixSocket (74 ms)
[ RUN      ] Parameters/TestRpc.TestApplicationFeatureFlagUnsupportedServer/SSL_UnixSocket
I20260929 02:47:34.898397 16940 acceptor_pool.cc:254] collecting diagnostics on the listening RPC socket unix:/tmp/dist-test-taskQEJATU/test-tmp/rpc-test-6f5973ae808b47aa8345bfa3a2e409d4.sock every 8 connection(s)
I20260929 02:47:34.898612 16941 acceptor_pool.cc:254] collecting diagnostics on the listening RPC socket unix:/tmp/dist-test-taskQEJATU/test-tmp/rpc-test-6f5973ae808b47aa8345bfa3a2e409d4.sock every 8 connection(s)
[       OK ] Parameters/TestRpc.TestApplicationFeatureFlagUnsupportedServer/SSL_UnixSocket (49 ms)
[ RUN      ] Parameters/TestRpc.TestCancellationAsync/SSL_UnixSocket
I20260929 02:47:34.950145 16965 acceptor_pool.cc:254] collecting diagnostics on the listening RPC socket unix:/tmp/dist-test-taskQEJATU/test-tmp/rpc-test-7062933504534a23953325ff5f489c8f.sock every 8 connection(s)
I20260929 02:47:34.950379 16966 acceptor_pool.cc:254] collecting diagnostics on the listening RPC socket unix:/tmp/dist-test-taskQEJATU/test-tmp/rpc-test-7062933504534a23953325ff5f489c8f.sock every 8 connection(s)
I20260929 02:47:34.951227 16533 rpc-test.cc:1716] Connecting to unix:/tmp/dist-test-taskQEJATU/test-tmp/rpc-test-7062933504534a23953325ff5f489c8f.sock
I20260929 02:47:34.961282 16533 test_util.cc:268] Using random seed: 879847532
I20260929 02:47:35.004361 16969 rpc-test-base.h:240] got call: sleep_micros: 500 pattern: 4294967295 num_repetitions: 2097152 sidecar_idx: 0
I20260929 02:47:35.034257 16968 rpc-test-base.h:240] got call: sleep_micros: 500 pattern: 4294967295 num_repetitions: 2097152 sidecar_idx: 0
I20260929 02:47:35.064570 16969 rpc-test-base.h:240] got call: sleep_micros: 500 pattern: 4294967295 num_repetitions: 2097152 sidecar_idx: 0
I20260929 02:47:35.094985 16968 rpc-test-base.h:240] got call: sleep_micros: 500 pattern: 4294967295 num_repetitions: 2097152 sidecar_idx: 0
I20260929 02:47:35.125358 16969 rpc-test-base.h:240] got call: sleep_micros: 500 pattern: 4294967295 num_repetitions: 2097152 sidecar_idx: 0
I20260929 02:47:35.157035 16968 rpc-test-base.h:240] got call: sleep_micros: 500 pattern: 4294967295 num_repetitions: 2097152 sidecar_idx: 0
I20260929 02:47:35.305505 16968 rpc-test-base.h:240] got call: sleep_micros: 500 pattern: 4294967295 num_repetitions: 2097152 sidecar_idx: 0
W20260929 02:47:35.313724 16962 connection.cc:196] Error closing socket: Network error: TlsSocket::Close: Broken pipe
W20260929 02:47:35.399336 16962 connection.cc:441] server connection from unix:<unnamed> torn down before Call kudu.rpc.GenericCalculatorService.SleepWithSidecar from unix:<unnamed> (request call id 9) could send its response
[       OK ] Parameters/TestRpc.TestCancellationAsync/SSL_UnixSocket (468 ms)
[ RUN      ] Parameters/TestRpc.TestPerformanceBySocketType/SSL_UnixSocket
I20260929 02:47:35.443602 16990 acceptor_pool.cc:254] collecting diagnostics on the listening RPC socket unix:/tmp/dist-test-taskQEJATU/test-tmp/rpc-test-cc593394a80c4c9a9a133c9326bc56b3.sock every 8 connection(s)
I20260929 02:47:35.444787 16991 acceptor_pool.cc:254] collecting diagnostics on the listening RPC socket unix:/tmp/dist-test-taskQEJATU/test-tmp/rpc-test-cc593394a80c4c9a9a133c9326bc56b3.sock every 8 connection(s)
I20260929 02:47:35.447991 16533 rpc-test.cc:1846] Connecting to unix:/tmp/dist-test-taskQEJATU/test-tmp/rpc-test-cc593394a80c4c9a9a133c9326bc56b3.sock
I20260929 02:47:38.652823 16533 rpc-test.cc:1859] Sending 1024MB via ssl-enabled unix socket: real 3.072s	user 3.023s	sys 2.153s
I20260929 02:47:41.841519 16533 rpc-test.cc:1859] Sending 1024MB via ssl-enabled unix socket: real 3.189s	user 3.241s	sys 2.135s
I20260929 02:47:45.027541 16533 rpc-test.cc:1859] Sending 1024MB via ssl-enabled unix socket: real 3.186s	user 3.116s	sys 2.239s
I20260929 02:47:48.138806 16533 rpc-test.cc:1859] Sending 1024MB via ssl-enabled unix socket: real 3.111s	user 3.070s	sys 2.148s
I20260929 02:47:51.280541 16533 rpc-test.cc:1859] Sending 1024MB via ssl-enabled unix socket: real 3.142s	user 3.166s	sys 2.118s
W20260929 02:47:51.281926 16987 connection.cc:196] Error closing socket: Network error: TlsSocket::Close: Broken pipe
[       OK ] Parameters/TestRpc.TestPerformanceBySocketType/SSL_UnixSocket (15880 ms)
[----------] 20 tests from Parameters/TestRpc (63970 ms total)

[----------] 1 test from Parameters/TestRpcSocketTxRxQueue
[ RUN      ] Parameters/TestRpcSocketTxRxQueue.AcceptorRxQueueSizeMetric/0
I20260929 02:47:51.292634 17015 acceptor_pool.cc:254] collecting diagnostics on the listening RPC socket 0.0.0.0:43729 every 1 connection(s)
I20260929 02:47:51.292886 17016 acceptor_pool.cc:254] collecting diagnostics on the listening RPC socket 0.0.0.0:43729 every 1 connection(s)
W20260929 02:47:51.294586 17011 negotiation.cc:337] Failed RPC negotiation. Trace:
0929 02:47:51.294194 (+     0us) reactor.cc:625] Submitting negotiation task for server connection from 127.0.0.1:53602 (local address 127.0.0.1:43729)
0929 02:47:51.294336 (+   142us) server_negotiation.cc:206] Beginning negotiation
0929 02:47:51.294340 (+     4us) server_negotiation.cc:399] Waiting for connection header
0929 02:47:51.294465 (+   125us) negotiation.cc:327] Negotiation complete: Network error: Server connection negotiation failed: server connection from 127.0.0.1:53602: BlockingRecv error: recv got EOF from 127.0.0.1:53602 (error 108)
Metrics: {"server-negotiator.queue_time_us":36}
[       OK ] Parameters/TestRpcSocketTxRxQueue.AcceptorRxQueueSizeMetric/0 (10 ms)
[----------] 1 test from Parameters/TestRpcSocketTxRxQueue (10 ms total)

[----------] Global test environment tear-down
[==========] 21 tests from 2 test suites ran. (63981 ms total)
[  PASSED  ] 20 tests.
[  FAILED  ] 1 test, listed below:
[  FAILED  ] Parameters/TestRpc.TestCallWithChainCertAndChainCA/SSL_UnixSocket, where GetParam() = (true, true)

 1 FAILED TEST