Diagnosed failure

Parameters/TestRpc.TestCallWithChainCertAndRootCA/SSL_UnixSocket: /data0/somelongdirectorytoavoidrpathissues/src/kudu/src/kudu/rpc/rpc-test.cc:303: Failure
Failed
Bad status: Runtime error: could not verify certificate chain (error with cert: subject=CN = localhost, ST = sadfjas, C = AS, emailAddress = sdflkdsajf, O = lskdfjlsad, OU = sldfkja, issuer=C = AS, ST = ASDfkjdhf, L = lskdjf, O = saldfja, OU = skdjf, CN = localhost, emailAddress = sadjflkadsj): : certificate has expired
Google Test trace:
/data0/somelongdirectorytoavoidrpathissues/src/kudu/src/kudu/rpc/rpc-test.cc:300: Connecting to unix:/tmp/dist-test-taskbtdQHq/test-tmp/rpc-test-2a2f5178d0494a49ab7fa81e42642b30.sock
I20260928 14:37:02.752326  5110 test_util.cc:175] -----------------------------------------------
I20260928 14:37:02.752513  5110 test_util.cc:176] Had fatal failures, leaving test files at /tmp/dist-test-taskbtdQHq/test-tmp/rpc-test.2.Parameters_TestRpc.TestCallWithChainCertAndRootCA_SSL_UnixSocket.1790606219227403-5110-0

Full log

Note: This is test shard 3 of 8.
[==========] Running 21 tests from 2 test suites.
[----------] Global test environment set-up.
[----------] 1 test from TestRpc
[ RUN      ] TestRpc.TestNegotiationTimeout
WARNING: Logging before InitGoogleLogging() is written to STDERR
I20260928 14:36:59.410156  5110 rpc-test-base.h:595] status: Timed out: connection negotiation to 0.0.0.0:45619 for RPC Sleep timed out after 0.100s (ON_OUTBOUND_QUEUE), seconds elapsed: 0.101755
W20260928 14:37:02.459231  5120 negotiation.cc:337] Failed RPC negotiation. Trace:
0928 14:36:59.309242 (+     0us) reactor.cc:625] Submitting negotiation task for client connection to 0.0.0.0:45619 (local address 127.0.0.1:57896)
0928 14:36:59.309868 (+   626us) negotiation.cc:107] Waiting for socket to connect
0928 14:36:59.309913 (+    45us) client_negotiation.cc:174] Beginning negotiation
0928 14:36:59.321741 (+ 11828us) client_negotiation.cc:252] Sending NEGOTIATE NegotiatePB request
0928 14:37:02.458102 (+3136361us) negotiation.cc:327] Negotiation complete: Timed out: Client connection negotiation failed: client connection to 0.0.0.0:45619: received 0 of 4 requested bytes
Metrics: {"client-negotiator.queue_time_us":193}
[       OK ] TestRpc.TestNegotiationTimeout (3187 ms)
[----------] 1 test from TestRpc (3187 ms total)

[----------] 20 tests from Parameters/TestRpc
[ RUN      ] Parameters/TestRpc.TestAcceptorPoolStartStop/SSL_UnixSocket
I20260928 14:37:02.515978  5136 acceptor_pool.cc:254] collecting diagnostics on the listening RPC socket unix:/tmp/dist-test-taskbtdQHq/test-tmp/rpc-test-bd296578f45141d4bf86a55762e3d7c7.sock every 8 connection(s)
I20260928 14:37:02.517632  5137 acceptor_pool.cc:254] collecting diagnostics on the listening RPC socket unix:/tmp/dist-test-taskbtdQHq/test-tmp/rpc-test-bd296578f45141d4bf86a55762e3d7c7.sock every 8 connection(s)
I20260928 14:37:02.553064  5147 acceptor_pool.cc:254] collecting diagnostics on the listening RPC socket unix:/tmp/dist-test-taskbtdQHq/test-tmp/rpc-test-bd296578f45141d4bf86a55762e3d7c7.sock every 8 connection(s)
I20260928 14:37:02.554507  5148 acceptor_pool.cc:254] collecting diagnostics on the listening RPC socket unix:/tmp/dist-test-taskbtdQHq/test-tmp/rpc-test-bd296578f45141d4bf86a55762e3d7c7.sock every 8 connection(s)
I20260928 14:37:02.574451  5158 acceptor_pool.cc:254] collecting diagnostics on the listening RPC socket unix:/tmp/dist-test-taskbtdQHq/test-tmp/rpc-test-bd296578f45141d4bf86a55762e3d7c7.sock every 8 connection(s)
I20260928 14:37:02.575169  5159 acceptor_pool.cc:254] collecting diagnostics on the listening RPC socket unix:/tmp/dist-test-taskbtdQHq/test-tmp/rpc-test-bd296578f45141d4bf86a55762e3d7c7.sock every 8 connection(s)
I20260928 14:37:02.597745  5169 acceptor_pool.cc:254] collecting diagnostics on the listening RPC socket unix:/tmp/dist-test-taskbtdQHq/test-tmp/rpc-test-bd296578f45141d4bf86a55762e3d7c7.sock every 8 connection(s)
I20260928 14:37:02.598500  5170 acceptor_pool.cc:254] collecting diagnostics on the listening RPC socket unix:/tmp/dist-test-taskbtdQHq/test-tmp/rpc-test-bd296578f45141d4bf86a55762e3d7c7.sock every 8 connection(s)
I20260928 14:37:02.614316  5180 acceptor_pool.cc:254] collecting diagnostics on the listening RPC socket unix:/tmp/dist-test-taskbtdQHq/test-tmp/rpc-test-bd296578f45141d4bf86a55762e3d7c7.sock every 8 connection(s)
I20260928 14:37:02.615023  5181 acceptor_pool.cc:254] collecting diagnostics on the listening RPC socket unix:/tmp/dist-test-taskbtdQHq/test-tmp/rpc-test-bd296578f45141d4bf86a55762e3d7c7.sock every 8 connection(s)
[       OK ] Parameters/TestRpc.TestAcceptorPoolStartStop/SSL_UnixSocket (154 ms)
[ RUN      ] Parameters/TestRpc.TestCall/SSL_UnixSocket
I20260928 14:37:02.649266  5193 acceptor_pool.cc:254] collecting diagnostics on the listening RPC socket unix:/tmp/dist-test-taskbtdQHq/test-tmp/rpc-test-bd045539f8fc4058a6f83773a2a86721.sock every 8 connection(s)
I20260928 14:37:02.651511  5194 acceptor_pool.cc:254] collecting diagnostics on the listening RPC socket unix:/tmp/dist-test-taskbtdQHq/test-tmp/rpc-test-bd045539f8fc4058a6f83773a2a86721.sock every 8 connection(s)
I20260928 14:37:02.656585  5110 rpc-test.cc:234] Connecting to unix:/tmp/dist-test-taskbtdQHq/test-tmp/rpc-test-bd045539f8fc4058a6f83773a2a86721.sock
W20260928 14:37:02.702143  5190 connection.cc:196] Error closing socket: Network error: TlsSocket::Close: Broken pipe
[       OK ] Parameters/TestRpc.TestCall/SSL_UnixSocket (88 ms)
[ RUN      ] Parameters/TestRpc.TestCallWithChainCertAndRootCA/SSL_UnixSocket
I20260928 14:37:02.733361  5218 acceptor_pool.cc:254] collecting diagnostics on the listening RPC socket unix:/tmp/dist-test-taskbtdQHq/test-tmp/rpc-test-2a2f5178d0494a49ab7fa81e42642b30.sock every 8 connection(s)
I20260928 14:37:02.734257  5219 acceptor_pool.cc:254] collecting diagnostics on the listening RPC socket unix:/tmp/dist-test-taskbtdQHq/test-tmp/rpc-test-2a2f5178d0494a49ab7fa81e42642b30.sock every 8 connection(s)
/data0/somelongdirectorytoavoidrpathissues/src/kudu/src/kudu/rpc/rpc-test.cc:303: Failure
Failed
Bad status: Runtime error: could not verify certificate chain (error with cert: subject=CN = localhost, ST = sadfjas, C = AS, emailAddress = sdflkdsajf, O = lskdfjlsad, OU = sldfkja, issuer=C = AS, ST = ASDfkjdhf, L = lskdjf, O = saldfja, OU = skdjf, CN = localhost, emailAddress = sadjflkadsj): : certificate has expired
Google Test trace:
/data0/somelongdirectorytoavoidrpathissues/src/kudu/src/kudu/rpc/rpc-test.cc:300: Connecting to unix:/tmp/dist-test-taskbtdQHq/test-tmp/rpc-test-2a2f5178d0494a49ab7fa81e42642b30.sock
I20260928 14:37:02.752326  5110 test_util.cc:175] -----------------------------------------------
I20260928 14:37:02.752513  5110 test_util.cc:176] Had fatal failures, leaving test files at /tmp/dist-test-taskbtdQHq/test-tmp/rpc-test.2.Parameters_TestRpc.TestCallWithChainCertAndRootCA_SSL_UnixSocket.1790606219227403-5110-0
[  FAILED  ] Parameters/TestRpc.TestCallWithChainCertAndRootCA/SSL_UnixSocket, where GetParam() = (true, true) (44 ms)
[ RUN      ] Parameters/TestRpc.TestCallWithBadPasswordProtectedKey/SSL_UnixSocket
[       OK ] Parameters/TestRpc.TestCallWithBadPasswordProtectedKey/SSL_UnixSocket (28 ms)
[ RUN      ] Parameters/TestRpc.TestInvalidMethodCall/SSL_UnixSocket
I20260928 14:37:02.796818  5256 acceptor_pool.cc:254] collecting diagnostics on the listening RPC socket unix:/tmp/dist-test-taskbtdQHq/test-tmp/rpc-test-7a506fc58319448b8ae15022b639b58f.sock every 8 connection(s)
I20260928 14:37:02.797708  5257 acceptor_pool.cc:254] collecting diagnostics on the listening RPC socket unix:/tmp/dist-test-taskbtdQHq/test-tmp/rpc-test-7a506fc58319448b8ae15022b639b58f.sock every 8 connection(s)
I20260928 14:37:02.800920  5110 rpc-test.cc:406] Connecting to unix:/tmp/dist-test-taskbtdQHq/test-tmp/rpc-test-7a506fc58319448b8ae15022b639b58f.sock
[       OK ] Parameters/TestRpc.TestInvalidMethodCall/SSL_UnixSocket (66 ms)
[ RUN      ] Parameters/TestRpc.TestHighFDs/SSL_UnixSocket
I20260928 14:37:03.040800  5281 acceptor_pool.cc:254] collecting diagnostics on the listening RPC socket unix:/tmp/dist-test-taskbtdQHq/test-tmp/rpc-test-1aefc8a5a7b94a53a54c66784443194e.sock every 8 connection(s)
I20260928 14:37:03.041599  5282 acceptor_pool.cc:254] collecting diagnostics on the listening RPC socket unix:/tmp/dist-test-taskbtdQHq/test-tmp/rpc-test-1aefc8a5a7b94a53a54c66784443194e.sock every 8 connection(s)
W20260928 14:37:03.068560  5278 connection.cc:196] Error closing socket: Network error: TlsSocket::Close: Broken pipe
[       OK ] Parameters/TestRpc.TestHighFDs/SSL_UnixSocket (232 ms)
[ RUN      ] Parameters/TestRpc.TestConnectionAlwaysKeepalive/SSL_UnixSocket
I20260928 14:37:03.097218  5304 acceptor_pool.cc:254] collecting diagnostics on the listening RPC socket unix:/tmp/dist-test-taskbtdQHq/test-tmp/rpc-test-12b6773353454724b5f5269efecb0bf0.sock every 8 connection(s)
I20260928 14:37:03.097956  5305 acceptor_pool.cc:254] collecting diagnostics on the listening RPC socket unix:/tmp/dist-test-taskbtdQHq/test-tmp/rpc-test-12b6773353454724b5f5269efecb0bf0.sock every 8 connection(s)
I20260928 14:37:03.100862  5110 rpc-test.cc:532] Connecting to unix:/tmp/dist-test-taskbtdQHq/test-tmp/rpc-test-12b6773353454724b5f5269efecb0bf0.sock
W20260928 14:37:06.129195  5303 connection.cc:196] Error closing socket: Network error: TlsSocket::Close: Broken pipe
[       OK ] Parameters/TestRpc.TestConnectionAlwaysKeepalive/SSL_UnixSocket (3052 ms)
[ RUN      ] Parameters/TestRpc.TestReopenOutboundConnections/SSL_UnixSocket
I20260928 14:37:06.173676  5327 acceptor_pool.cc:254] collecting diagnostics on the listening RPC socket unix:/tmp/dist-test-taskbtdQHq/test-tmp/rpc-test-9c80fc907cf74bc2a7d98c9189e3456c.sock every 8 connection(s)
I20260928 14:37:06.174367  5328 acceptor_pool.cc:254] collecting diagnostics on the listening RPC socket unix:/tmp/dist-test-taskbtdQHq/test-tmp/rpc-test-9c80fc907cf74bc2a7d98c9189e3456c.sock every 8 connection(s)
I20260928 14:37:06.177424  5110 rpc-test.cc:658] Connecting to unix:/tmp/dist-test-taskbtdQHq/test-tmp/rpc-test-9c80fc907cf74bc2a7d98c9189e3456c.sock
W20260928 14:37:06.210165  5326 connection.cc:196] Error closing socket: Network error: TlsSocket::Close: Broken pipe
W20260928 14:37:06.220230  5326 connection.cc:196] Error closing socket: Network error: TlsSocket::Close: Broken pipe
W20260928 14:37:06.229688  5326 connection.cc:196] Error closing socket: Network error: TlsSocket::Close: Broken pipe
W20260928 14:37:06.238411  5326 connection.cc:196] Error closing socket: Network error: TlsSocket::Close: Broken pipe
W20260928 14:37:06.247964  5326 connection.cc:196] Error closing socket: Network error: TlsSocket::Close: Broken pipe
W20260928 14:37:06.257795  5326 connection.cc:196] Error closing socket: Network error: TlsSocket::Close: Broken pipe
W20260928 14:37:06.267566  5326 connection.cc:196] Error closing socket: Network error: TlsSocket::Close: Broken pipe
W20260928 14:37:06.277585  5326 connection.cc:196] Error closing socket: Network error: TlsSocket::Close: Broken pipe
W20260928 14:37:06.287462  5326 connection.cc:196] Error closing socket: Network error: TlsSocket::Close: Broken pipe
W20260928 14:37:06.297345  5326 connection.cc:196] Error closing socket: Network error: TlsSocket::Close: Broken pipe
W20260928 14:37:06.307163  5326 connection.cc:196] Error closing socket: Network error: TlsSocket::Close: Broken pipe
W20260928 14:37:06.317019  5326 connection.cc:196] Error closing socket: Network error: TlsSocket::Close: Broken pipe
W20260928 14:37:06.326792  5326 connection.cc:196] Error closing socket: Network error: TlsSocket::Close: Broken pipe
W20260928 14:37:06.335340  5326 connection.cc:196] Error closing socket: Network error: TlsSocket::Close: Broken pipe
W20260928 14:37:06.335377  5327 acceptor_pool.cc:285] unable to collect diagnostics on RPC socket unix:/tmp/dist-test-taskbtdQHq/test-tmp/rpc-test-9c80fc907cf74bc2a7d98c9189e3456c.sock: Not implemented: netlink diagnostics is currently supported only on IPv4 TCP sockets
W20260928 14:37:06.343842  5326 connection.cc:196] Error closing socket: Network error: TlsSocket::Close: Broken pipe
W20260928 14:37:06.353747  5326 connection.cc:196] Error closing socket: Network error: TlsSocket::Close: Broken pipe
W20260928 14:37:06.363560  5326 connection.cc:196] Error closing socket: Network error: TlsSocket::Close: Broken pipe
W20260928 14:37:06.373134  5326 connection.cc:196] Error closing socket: Network error: TlsSocket::Close: Broken pipe
W20260928 14:37:06.382876  5326 connection.cc:196] Error closing socket: Network error: TlsSocket::Close: Broken pipe
W20260928 14:37:06.392359  5326 connection.cc:196] Error closing socket: Network error: TlsSocket::Close: Broken pipe
W20260928 14:37:06.401974  5326 connection.cc:196] Error closing socket: Network error: TlsSocket::Close: Broken pipe
W20260928 14:37:06.411762  5326 connection.cc:196] Error closing socket: Network error: TlsSocket::Close: Broken pipe
W20260928 14:37:06.421545  5326 connection.cc:196] Error closing socket: Network error: TlsSocket::Close: Broken pipe
W20260928 14:37:06.431331  5326 connection.cc:196] Error closing socket: Network error: TlsSocket::Close: Broken pipe
W20260928 14:37:06.440814  5326 connection.cc:196] Error closing socket: Network error: TlsSocket::Close: Broken pipe
W20260928 14:37:06.449935  5326 connection.cc:196] Error closing socket: Network error: TlsSocket::Close: Broken pipe
W20260928 14:37:06.458830  5326 connection.cc:196] Error closing socket: Network error: TlsSocket::Close: Broken pipe
W20260928 14:37:06.467862  5326 connection.cc:196] Error closing socket: Network error: TlsSocket::Close: Broken pipe
W20260928 14:37:06.477277  5326 connection.cc:196] Error closing socket: Network error: TlsSocket::Close: Broken pipe
W20260928 14:37:06.486198  5326 connection.cc:196] Error closing socket: Network error: TlsSocket::Close: Broken pipe
W20260928 14:37:06.495919  5326 connection.cc:196] Error closing socket: Network error: TlsSocket::Close: Broken pipe
W20260928 14:37:06.505738  5326 connection.cc:196] Error closing socket: Network error: TlsSocket::Close: Broken pipe
[       OK ] Parameters/TestRpc.TestReopenOutboundConnections/SSL_UnixSocket (376 ms)
[ RUN      ] Parameters/TestRpc.TestConnectionNetworkPlane/SSL_UnixSocket
I20260928 14:37:06.535276  5350 acceptor_pool.cc:254] collecting diagnostics on the listening RPC socket unix:/tmp/dist-test-taskbtdQHq/test-tmp/rpc-test-9f605da20ed64d4bb26e1f6fc1b47b1c.sock every 8 connection(s)
I20260928 14:37:06.535952  5351 acceptor_pool.cc:254] collecting diagnostics on the listening RPC socket unix:/tmp/dist-test-taskbtdQHq/test-tmp/rpc-test-9f605da20ed64d4bb26e1f6fc1b47b1c.sock every 8 connection(s)
I20260928 14:37:06.538913  5110 rpc-test.cc:772] Connecting to unix:/tmp/dist-test-taskbtdQHq/test-tmp/rpc-test-9f605da20ed64d4bb26e1f6fc1b47b1c.sock
W20260928 14:37:06.580562  5349 connection.cc:196] Error closing socket: Network error: TlsSocket::Close: Broken pipe
[       OK ] Parameters/TestRpc.TestConnectionNetworkPlane/SSL_UnixSocket (74 ms)
[ RUN      ] Parameters/TestRpc.TestTCPKeepalive/SSL_UnixSocket
I20260928 14:37:06.606457  5375 acceptor_pool.cc:254] collecting diagnostics on the listening RPC socket unix:/tmp/dist-test-taskbtdQHq/test-tmp/rpc-test-c7f3fbac99314d36b05c482531006edd.sock every 8 connection(s)
I20260928 14:37:06.607138  5376 acceptor_pool.cc:254] collecting diagnostics on the listening RPC socket unix:/tmp/dist-test-taskbtdQHq/test-tmp/rpc-test-c7f3fbac99314d36b05c482531006edd.sock every 8 connection(s)
I20260928 14:37:06.642534  5379 rpc-test-base.h:222] got call: sleep_micros: 8000000 deferred: true
I20260928 14:37:14.646360  5379 rpcz_store.cc:275] Call kudu.rpc.GenericCalculatorService.Sleep from unix:<unnamed> (request call id 0) took 8003 ms. Trace:
I20260928 14:37:14.646752  5379 rpcz_store.cc:276] 0928 14:37:06.642370 (+     0us) service_pool.cc:170] Inserting onto call queue
0928 14:37:06.642474 (+   104us) service_pool.cc:227] Handling call
0928 14:37:14.646180 (+8003706us) inbound_call.cc:173] Queueing success response
Metrics: {}
W20260928 14:37:14.653049  5372 connection.cc:196] Error closing socket: Network error: TlsSocket::Close: Broken pipe
[       OK ] Parameters/TestRpc.TestTCPKeepalive/SSL_UnixSocket (8074 ms)
[ RUN      ] Parameters/TestRpc.TestMaxSmallSidecars/SSL_UnixSocket
I20260928 14:37:14.688146  5401 acceptor_pool.cc:254] collecting diagnostics on the listening RPC socket unix:/tmp/dist-test-taskbtdQHq/test-tmp/rpc-test-e63804a2314042fab4275e78c34cd79c.sock every 8 connection(s)
I20260928 14:37:14.688979  5402 acceptor_pool.cc:254] collecting diagnostics on the listening RPC socket unix:/tmp/dist-test-taskbtdQHq/test-tmp/rpc-test-e63804a2314042fab4275e78c34cd79c.sock every 8 connection(s)
W20260928 14:37:14.849874  5398 connection.cc:196] Error closing socket: Network error: TlsSocket::Close: Broken pipe
[       OK ] Parameters/TestRpc.TestMaxSmallSidecars/SSL_UnixSocket (194 ms)
[ RUN      ] Parameters/TestRpc.TestCallTimeout/SSL_UnixSocket
I20260928 14:37:14.875466  5426 acceptor_pool.cc:254] collecting diagnostics on the listening RPC socket unix:/tmp/dist-test-taskbtdQHq/test-tmp/rpc-test-3ffe3de777b2428681895979f0e52db5.sock every 8 connection(s)
I20260928 14:37:14.876214  5427 acceptor_pool.cc:254] collecting diagnostics on the listening RPC socket unix:/tmp/dist-test-taskbtdQHq/test-tmp/rpc-test-3ffe3de777b2428681895979f0e52db5.sock every 8 connection(s)
I20260928 14:37:14.897682  5110 rpc-test-base.h:595] status: Timed out: connection negotiation to unix:/tmp/dist-test-taskbtdQHq/test-tmp/rpc-test-3ffe3de777b2428681895979f0e52db5.sock for RPC Sleep timed out after 0.000s (ON_OUTBOUND_QUEUE), seconds elapsed: 0.00246071
I20260928 14:37:14.904511  5430 rpc-test-base.h:222] got call: sleep_micros: 700000
I20260928 14:37:15.099210  5110 rpc-test-base.h:595] status: Timed out: Sleep RPC to unix:/tmp/dist-test-taskbtdQHq/test-tmp/rpc-test-3ffe3de777b2428681895979f0e52db5.sock timed out after 0.200s (SENT), seconds elapsed: 0.201221
I20260928 14:37:15.100580  5429 rpc-test-base.h:222] got call: sleep_micros: 2000000
W20260928 14:37:15.605194  5430 rpcz_store.cc:267] Call kudu.rpc.GenericCalculatorService.Sleep from unix:<unnamed> (request call id 1) took 700 ms (client timeout 200 ms). Trace:
W20260928 14:37:15.605604  5430 rpcz_store.cc:269] 0928 14:37:14.904372 (+     0us) service_pool.cc:170] Inserting onto call queue
0928 14:37:14.904469 (+    97us) service_pool.cc:227] Handling call
0928 14:37:15.605137 (+700668us) inbound_call.cc:173] Queueing success response
Metrics: {}
I20260928 14:37:16.601959  5110 rpc-test-base.h:595] status: Timed out: Sleep RPC to unix:/tmp/dist-test-taskbtdQHq/test-tmp/rpc-test-3ffe3de777b2428681895979f0e52db5.sock timed out after 1.500s (SENT), seconds elapsed: 1.50241
W20260928 14:37:16.604137  5423 connection.cc:196] Error closing socket: Network error: TlsSocket::Close: Broken pipe
W20260928 14:37:17.101096  5429 rpcz_store.cc:267] Call kudu.rpc.GenericCalculatorService.Sleep from unix:<unnamed> (request call id 2) took 2000 ms (client timeout 1500 ms). Trace:
W20260928 14:37:17.101392  5429 rpcz_store.cc:269] 0928 14:37:15.100400 (+     0us) service_pool.cc:170] Inserting onto call queue
0928 14:37:15.100523 (+   123us) service_pool.cc:227] Handling call
0928 14:37:17.101043 (+2000520us) inbound_call.cc:173] Queueing success response
Metrics: {}
W20260928 14:37:17.101922  5423 connection.cc:441] server connection from unix:<unnamed> torn down before Call kudu.rpc.GenericCalculatorService.Sleep from unix:<unnamed> (request call id 2) could send its response
[       OK ] Parameters/TestRpc.TestCallTimeout/SSL_UnixSocket (2252 ms)
[ RUN      ] Parameters/TestRpc.TestServerShutsDown/SSL_UnixSocket
I20260928 14:37:17.109040  5110 rpc-test.cc:1125] Connecting to 0.0.0.0:43817
W20260928 14:37:17.117810  5443 negotiation.cc:337] Failed RPC negotiation. Trace:
0928 14:37:17.116338 (+     0us) reactor.cc:625] Submitting negotiation task for client connection to 0.0.0.0:43817 (local address 127.0.0.1:53654)
0928 14:37:17.116761 (+   423us) negotiation.cc:107] Waiting for socket to connect
0928 14:37:17.116797 (+    36us) client_negotiation.cc:174] Beginning negotiation
0928 14:37:17.117015 (+   218us) client_negotiation.cc:252] Sending NEGOTIATE NegotiatePB request
0928 14:37:17.117219 (+   204us) negotiation.cc:327] Negotiation complete: Network error: Client connection negotiation failed: client connection to 0.0.0.0:43817: BlockingWrite error: write error: Broken pipe (error 32)
Metrics: {"client-negotiator.queue_time_us":100}
[       OK ] Parameters/TestRpc.TestServerShutsDown/SSL_UnixSocket (13 ms)
[ RUN      ] Parameters/TestRpc.TimedOutOnResponseMetric/SSL_UnixSocket
I20260928 14:37:17.154290  5460 acceptor_pool.cc:254] collecting diagnostics on the listening RPC socket unix:/tmp/dist-test-taskbtdQHq/test-tmp/rpc-test-8b8a1429f27e41b1a68ed8feff76f4e8.sock every 8 connection(s)
I20260928 14:37:17.154995  5461 acceptor_pool.cc:254] collecting diagnostics on the listening RPC socket unix:/tmp/dist-test-taskbtdQHq/test-tmp/rpc-test-8b8a1429f27e41b1a68ed8feff76f4e8.sock every 8 connection(s)
W20260928 14:37:17.390954  5464 rpcz_store.cc:267] Call kudu.rpc_test.CalculatorService.Sleep from unix:<unnamed> (request call id 3) took 50 ms (client timeout 25 ms). Trace:
W20260928 14:37:17.391227  5464 rpcz_store.cc:269] 0928 14:37:17.340397 (+     0us) service_pool.cc:170] Inserting onto call queue
0928 14:37:17.340489 (+    92us) service_pool.cc:227] Handling call
0928 14:37:17.390876 (+ 50387us) inbound_call.cc:173] Queueing success response
Related trace 'test_child':
Metrics: {"test_sleep_us":50000,"child_traces":[["test_child",{"related_trace_metric":1}]]}
W20260928 14:37:17.450111  5464 rpcz_store.cc:267] Call kudu.rpc_test.CalculatorService.Sleep from unix:<unnamed> (request call id 4) took 50 ms (client timeout 50 ms). Trace:
W20260928 14:37:17.450384  5464 rpcz_store.cc:269] 0928 14:37:17.399500 (+     0us) service_pool.cc:170] Inserting onto call queue
0928 14:37:17.399604 (+   104us) service_pool.cc:227] Handling call
0928 14:37:17.450051 (+ 50447us) inbound_call.cc:173] Queueing success response
Related trace 'test_child':
Metrics: {"test_sleep_us":50000,"child_traces":[["test_child",{"related_trace_metric":1}]]}
W20260928 14:37:17.453549  5457 connection.cc:196] Error closing socket: Network error: TlsSocket::Close: Broken pipe
[       OK ] Parameters/TestRpc.TimedOutOnResponseMetric/SSL_UnixSocket (337 ms)
[ RUN      ] Parameters/TestRpc.AcceptorDispatchingTimesMetric/SSL_UnixSocket
I20260928 14:37:17.470086  5485 acceptor_pool.cc:254] collecting diagnostics on the listening RPC socket 0.0.0.0:42969 every 8 connection(s)
I20260928 14:37:17.470824  5486 acceptor_pool.cc:254] collecting diagnostics on the listening RPC socket 0.0.0.0:42969 every 8 connection(s)
W20260928 14:37:17.476644  5481 negotiation.cc:337] Failed RPC negotiation. Trace:
0928 14:37:17.474385 (+     0us) reactor.cc:625] Submitting negotiation task for server connection from 127.0.0.1:36248 (local address 127.0.0.1:42969)
0928 14:37:17.475066 (+   681us) server_negotiation.cc:206] Beginning negotiation
0928 14:37:17.475087 (+    21us) server_negotiation.cc:399] Waiting for connection header
0928 14:37:17.475486 (+   399us) negotiation.cc:327] Negotiation complete: Network error: Server connection negotiation failed: server connection from 127.0.0.1:36248: BlockingRecv error: recv got EOF from 127.0.0.1:36248 (error 108)
Metrics: {"server-negotiator.queue_time_us":121}
[       OK ] Parameters/TestRpc.AcceptorDispatchingTimesMetric/SSL_UnixSocket (20 ms)
[ RUN      ] Parameters/TestRpc.TestRpcCallbackDestroysMessenger/SSL_UnixSocket
[       OK ] Parameters/TestRpc.TestRpcCallbackDestroysMessenger/SSL_UnixSocket (23 ms)
[ RUN      ] Parameters/TestRpc.TestApplicationFeatureFlag/SSL_UnixSocket
I20260928 14:37:17.534354  5510 acceptor_pool.cc:254] collecting diagnostics on the listening RPC socket unix:/tmp/dist-test-taskbtdQHq/test-tmp/rpc-test-656de0ff29564db59dbefbab77c764d7.sock every 8 connection(s)
I20260928 14:37:17.535101  5511 acceptor_pool.cc:254] collecting diagnostics on the listening RPC socket unix:/tmp/dist-test-taskbtdQHq/test-tmp/rpc-test-656de0ff29564db59dbefbab77c764d7.sock every 8 connection(s)
W20260928 14:37:17.562292  5507 messenger.cc:357] Unable to handle RPC call: Not implemented: call requires unsupported application feature flags: 99
[       OK ] Parameters/TestRpc.TestApplicationFeatureFlag/SSL_UnixSocket (66 ms)
[ RUN      ] Parameters/TestRpc.TestCancellation/SSL_UnixSocket
I20260928 14:37:17.588596  5535 acceptor_pool.cc:254] collecting diagnostics on the listening RPC socket unix:/tmp/dist-test-taskbtdQHq/test-tmp/rpc-test-4cd25c6992be4ad38ae342423461e20c.sock every 8 connection(s)
I20260928 14:37:17.589274  5536 acceptor_pool.cc:254] collecting diagnostics on the listening RPC socket unix:/tmp/dist-test-taskbtdQHq/test-tmp/rpc-test-4cd25c6992be4ad38ae342423461e20c.sock every 8 connection(s)
I20260928 14:37:17.592195  5110 rpc-test.cc:1648] Connecting to unix:/tmp/dist-test-taskbtdQHq/test-tmp/rpc-test-4cd25c6992be4ad38ae342423461e20c.sock
I20260928 14:37:17.697566  5110 rpc-test-base.h:595] status: Aborted: Sleep RPC to unix:/tmp/dist-test-taskbtdQHq/test-tmp/rpc-test-4cd25c6992be4ad38ae342423461e20c.sock is cancelled in state READY, seconds elapsed: 0.000318618
I20260928 14:37:17.867415  5110 rpc-test-base.h:595] status: Aborted: Sleep RPC to unix:/tmp/dist-test-taskbtdQHq/test-tmp/rpc-test-4cd25c6992be4ad38ae342423461e20c.sock is cancelled in state SENT, seconds elapsed: 0.000950237
I20260928 14:37:17.867597  5538 rpc-test-base.h:222] got call: sleep_micros: 510000
I20260928 14:37:18.040731  5110 rpc-test-base.h:595] status: Aborted: Sleep RPC to unix:/tmp/dist-test-taskbtdQHq/test-tmp/rpc-test-4cd25c6992be4ad38ae342423461e20c.sock is cancelled in state SENT, seconds elapsed: 0.000834353
I20260928 14:37:18.040973  5537 rpc-test-base.h:222] got call: sleep_micros: 510000
I20260928 14:37:18.209471  5110 rpc-test-base.h:595] status: Aborted: Sleep RPC to unix:/tmp/dist-test-taskbtdQHq/test-tmp/rpc-test-4cd25c6992be4ad38ae342423461e20c.sock is cancelled in state SENT, seconds elapsed: 0.000860238
W20260928 14:37:18.219944  5539 rpcz_store.cc:267] Call kudu.rpc.GenericCalculatorService.Sleep from unix:<unnamed> (request call id 11) took 10 ms (client timeout 10 ms). Trace:
W20260928 14:37:18.220305  5539 rpcz_store.cc:269] 0928 14:37:18.209457 (+     0us) service_pool.cc:170] Inserting onto call queue
0928 14:37:18.219816 (+ 10359us) service_pool.cc:214] Skipping call since client already timed out
0928 14:37:18.219887 (+    71us) inbound_call.cc:173] Queueing failure response
Metrics: {}
I20260928 14:37:18.220850  5539 rpc-test-base.h:222] got call: sleep_micros: 1500000
W20260928 14:37:18.378181  5538 rpcz_store.cc:267] Call kudu.rpc.GenericCalculatorService.Sleep from unix:<unnamed> (request call id 3) took 510 ms (client timeout 10 ms). Trace:
W20260928 14:37:18.378449  5538 rpcz_store.cc:269] 0928 14:37:17.867434 (+     0us) service_pool.cc:170] Inserting onto call queue
0928 14:37:17.867547 (+   113us) service_pool.cc:227] Handling call
0928 14:37:18.378135 (+510588us) inbound_call.cc:173] Queueing success response
Metrics: {}
W20260928 14:37:18.551640  5537 rpcz_store.cc:267] Call kudu.rpc.GenericCalculatorService.Sleep from unix:<unnamed> (request call id 7) took 511 ms (client timeout 10 ms). Trace:
W20260928 14:37:18.551941  5537 rpcz_store.cc:269] 0928 14:37:18.040774 (+     0us) service_pool.cc:170] Inserting onto call queue
0928 14:37:18.040914 (+   140us) service_pool.cc:227] Handling call
0928 14:37:18.551583 (+510669us) inbound_call.cc:173] Queueing success response
Metrics: {}
I20260928 14:37:19.211180  5110 rpc-test-base.h:595] status: Timed out: Sleep RPC to unix:/tmp/dist-test-taskbtdQHq/test-tmp/rpc-test-4cd25c6992be4ad38ae342423461e20c.sock timed out after 1.000s (SENT), seconds elapsed: 1.00142
I20260928 14:37:19.212371  5537 rpc-test-base.h:222] got call: sleep_micros: 1500000
W20260928 14:37:19.721591  5539 rpcz_store.cc:267] Call kudu.rpc.GenericCalculatorService.Sleep from unix:<unnamed> (request call id 12) took 1511 ms (client timeout 1000 ms). Trace:
W20260928 14:37:19.722066  5539 rpcz_store.cc:269] 0928 14:37:18.210508 (+     0us) service_pool.cc:170] Inserting onto call queue
0928 14:37:18.220801 (+ 10293us) service_pool.cc:227] Handling call
0928 14:37:19.721436 (+1500635us) inbound_call.cc:173] Queueing success response
Metrics: {}
I20260928 14:37:20.213300  5110 rpc-test-base.h:595] status: Timed out: Sleep RPC to unix:/tmp/dist-test-taskbtdQHq/test-tmp/rpc-test-4cd25c6992be4ad38ae342423461e20c.sock timed out after 1.000s (SENT), seconds elapsed: 1.00174
W20260928 14:37:20.215158  5532 messenger.cc:357] Unable to handle RPC call: Not implemented: call requires unsupported application feature flags: 99, 1
W20260928 14:37:20.216728  5532 messenger.cc:357] Unable to handle RPC call: Not implemented: call requires unsupported application feature flags: 99, 1
W20260928 14:37:20.442929  5532 connection.cc:196] Error closing socket: Network error: TlsSocket::Close: Broken pipe
W20260928 14:37:20.712951  5537 rpcz_store.cc:267] Call kudu.rpc.GenericCalculatorService.Sleep from unix:<unnamed> (request call id 13) took 1500 ms (client timeout 1000 ms). Trace:
W20260928 14:37:20.713269  5537 rpcz_store.cc:269] 0928 14:37:19.212197 (+     0us) service_pool.cc:170] Inserting onto call queue
0928 14:37:19.212323 (+   126us) service_pool.cc:227] Handling call
0928 14:37:20.712809 (+1500486us) inbound_call.cc:173] Queueing success response
Metrics: {}
W20260928 14:37:20.713979  5532 connection.cc:441] server connection from unix:<unnamed> torn down before Call kudu.rpc.GenericCalculatorService.Sleep from unix:<unnamed> (request call id 13) could send its response
[       OK ] Parameters/TestRpc.TestCancellation/SSL_UnixSocket (3151 ms)
[ RUN      ] Parameters/TestRpc.TestCancellationMultiThreads/SSL_UnixSocket
I20260928 14:37:20.771797  5561 acceptor_pool.cc:254] collecting diagnostics on the listening RPC socket unix:/tmp/dist-test-taskbtdQHq/test-tmp/rpc-test-a142115d230b4b169655bf67b07cfec3.sock every 8 connection(s)
I20260928 14:37:20.772614  5562 acceptor_pool.cc:254] collecting diagnostics on the listening RPC socket unix:/tmp/dist-test-taskbtdQHq/test-tmp/rpc-test-a142115d230b4b169655bf67b07cfec3.sock every 8 connection(s)
I20260928 14:37:20.775709  5110 rpc-test.cc:1808] Connecting to unix:/tmp/dist-test-taskbtdQHq/test-tmp/rpc-test-a142115d230b4b169655bf67b07cfec3.sock
I20260928 14:37:20.936666  5575 test_util.cc:268] Using random seed: 15495767
I20260928 14:37:20.937760  5576 test_util.cc:268] Using random seed: 15496969
I20260928 14:37:20.939281  5577 test_util.cc:268] Using random seed: 15498373
I20260928 14:37:20.940640  5578 test_util.cc:268] Using random seed: 15499826
I20260928 14:37:20.942306  5579 test_util.cc:268] Using random seed: 15501357
I20260928 14:37:20.943694  5580 test_util.cc:268] Using random seed: 15502774
I20260928 14:37:20.945448  5581 test_util.cc:268] Using random seed: 15504460
I20260928 14:37:20.946866  5582 test_util.cc:268] Using random seed: 15505945
I20260928 14:37:20.948529  5583 test_util.cc:268] Using random seed: 15507592
I20260928 14:37:20.949930  5584 test_util.cc:268] Using random seed: 15508996
I20260928 14:37:20.951683  5585 test_util.cc:268] Using random seed: 15510737
I20260928 14:37:20.955484  5587 test_util.cc:268] Using random seed: 15514450
I20260928 14:37:20.956667  5586 test_util.cc:268] Using random seed: 15512718
I20260928 14:37:20.960992  5590 test_util.cc:268] Using random seed: 15519962
I20260928 14:37:20.959328  5589 test_util.cc:268] Using random seed: 15518366
I20260928 14:37:20.957784  5588 test_util.cc:268] Using random seed: 15516790
I20260928 14:37:20.962585  5591 test_util.cc:268] Using random seed: 15521660
I20260928 14:37:20.965806  5593 test_util.cc:268] Using random seed: 15524870
I20260928 14:37:20.964393  5592 test_util.cc:268] Using random seed: 15523414
I20260928 14:37:20.969223  5594 test_util.cc:268] Using random seed: 15528259
I20260928 14:37:20.971366  5595 test_util.cc:268] Using random seed: 15530411
I20260928 14:37:20.973222  5596 test_util.cc:268] Using random seed: 15532227
I20260928 14:37:20.978363  5597 test_util.cc:268] Using random seed: 15537398
I20260928 14:37:20.980120  5598 test_util.cc:268] Using random seed: 15539100
I20260928 14:37:20.982030  5599 test_util.cc:268] Using random seed: 15541024
I20260928 14:37:20.983944  5600 test_util.cc:268] Using random seed: 15542970
I20260928 14:37:20.985534  5601 test_util.cc:268] Using random seed: 15544593
I20260928 14:37:20.988229  5602 test_util.cc:268] Using random seed: 15547250
I20260928 14:37:20.989861  5603 test_util.cc:268] Using random seed: 15548862
I20260928 14:37:20.991588  5604 test_util.cc:268] Using random seed: 15550669
W20260928 14:37:40.616909  5558 connection.cc:196] Error closing socket: Network error: TlsSocket::Close: Broken pipe
[       OK ] Parameters/TestRpc.TestCancellationMultiThreads/SSL_UnixSocket (19912 ms)
[ RUN      ] Parameters/TestRpc.TestCallId/SSL_UnixSocket
I20260928 14:37:40.650785  5618 acceptor_pool.cc:254] collecting diagnostics on the listening RPC socket unix:/tmp/dist-test-taskbtdQHq/test-tmp/rpc-test-1ead24345df440358eefef666200c9cf.sock every 8 connection(s)
I20260928 14:37:40.651645  5619 acceptor_pool.cc:254] collecting diagnostics on the listening RPC socket unix:/tmp/dist-test-taskbtdQHq/test-tmp/rpc-test-1ead24345df440358eefef666200c9cf.sock every 8 connection(s)
[       OK ] Parameters/TestRpc.TestCallId/SSL_UnixSocket (81 ms)
[----------] 20 tests from Parameters/TestRpc (38252 ms total)

[----------] Global test environment tear-down
[==========] 21 tests from 2 test suites ran. (41440 ms total)
[  PASSED  ] 20 tests.
[  FAILED  ] 1 test, listed below:
[  FAILED  ] Parameters/TestRpc.TestCallWithChainCertAndRootCA/SSL_UnixSocket, where GetParam() = (true, true)

 1 FAILED TEST
I20260928 14:37:40.732391  5110 logging.cc:424] LogThrottler /data0/somelongdirectorytoavoidrpathissues/src/kudu/src/kudu/rpc/acceptor_pool.cc:285: suppressed but not reported on 3 messages since previous log ~34 seconds ago