Diagnosed failure

Parameters/TestRpc.TestCallWithChainCertAndChainCA/SSL_TCP: /data0/somelongdirectorytoavoidrpathissues/src/kudu/src/kudu/rpc/rpc-test.cc:270: Failure
Failed
Bad status: Runtime error: could not verify certificate chain (error with cert: subject=CN = localhost, ST = sadfjas, C = AS, emailAddress = sdflkdsajf, O = lskdfjlsad, OU = sldfkja, issuer=C = AS, ST = ASDfkjdhf, L = lskdjf, O = saldfja, OU = skdjf, CN = localhost, emailAddress = sadjflkadsj): : certificate has expired
Google Test trace:
/data0/somelongdirectorytoavoidrpathissues/src/kudu/src/kudu/rpc/rpc-test.cc:267: Connecting to 0.0.0.0:38833
I20260929 11:22:22.592000   765 test_util.cc:175] -----------------------------------------------
I20260929 11:22:22.592095   765 test_util.cc:176] Had fatal failures, leaving test files at /tmp/dist-test-taskUA4myO/test-tmp/rpc-test.5.Parameters_TestRpc.TestCallWithChainCertAndChainCA_SSL_TCP.1790680942487610-765-0

Full log

Note: This is test shard 6 of 8.
[==========] Running 21 tests from 2 test suites.
[----------] Global test environment set-up.
[----------] 20 tests from Parameters/TestRpc
[ RUN      ] Parameters/TestRpc.TestMessengerCreateDestroy/SSL_TCP
WARNING: Logging before InitGoogleLogging() is written to STDERR
I20260929 11:22:22.528573   765 rpc-test.cc:169] started messenger TestCreateDestroy
[       OK ] Parameters/TestRpc.TestMessengerCreateDestroy/SSL_TCP (24 ms)
[ RUN      ] Parameters/TestRpc.TestNegotiationDeadlock/SSL_TCP
I20260929 11:22:22.547322   785 acceptor_pool.cc:254] collecting diagnostics on the listening RPC socket 0.0.0.0:38507 every 8 connection(s)
I20260929 11:22:22.547613   786 acceptor_pool.cc:254] collecting diagnostics on the listening RPC socket 0.0.0.0:38507 every 8 connection(s)
[       OK ] Parameters/TestRpc.TestNegotiationDeadlock/SSL_TCP (35 ms)
[ RUN      ] Parameters/TestRpc.TestCallWithChainCertAndChainCA/SSL_TCP
I20260929 11:22:22.580718   801 acceptor_pool.cc:254] collecting diagnostics on the listening RPC socket 0.0.0.0:38833 every 8 connection(s)
I20260929 11:22:22.581087   802 acceptor_pool.cc:254] collecting diagnostics on the listening RPC socket 0.0.0.0:38833 every 8 connection(s)
/data0/somelongdirectorytoavoidrpathissues/src/kudu/src/kudu/rpc/rpc-test.cc:270: Failure
Failed
Bad status: Runtime error: could not verify certificate chain (error with cert: subject=CN = localhost, ST = sadfjas, C = AS, emailAddress = sdflkdsajf, O = lskdfjlsad, OU = sldfkja, issuer=C = AS, ST = ASDfkjdhf, L = lskdjf, O = saldfja, OU = skdjf, CN = localhost, emailAddress = sadjflkadsj): : certificate has expired
Google Test trace:
/data0/somelongdirectorytoavoidrpathissues/src/kudu/src/kudu/rpc/rpc-test.cc:267: Connecting to 0.0.0.0:38833
I20260929 11:22:22.592000   765 test_util.cc:175] -----------------------------------------------
I20260929 11:22:22.592095   765 test_util.cc:176] Had fatal failures, leaving test files at /tmp/dist-test-taskUA4myO/test-tmp/rpc-test.5.Parameters_TestRpc.TestCallWithChainCertAndChainCA_SSL_TCP.1790680942487610-765-0
[  FAILED  ] Parameters/TestRpc.TestCallWithChainCertAndChainCA/SSL_TCP, where GetParam() = (true, false) (24 ms)
[ RUN      ] Parameters/TestRpc.TestCallWithPasswordProtectedKey/SSL_TCP
I20260929 11:22:22.600361   826 acceptor_pool.cc:254] collecting diagnostics on the listening RPC socket 0.0.0.0:38893 every 8 connection(s)
I20260929 11:22:22.600605   827 acceptor_pool.cc:254] collecting diagnostics on the listening RPC socket 0.0.0.0:38893 every 8 connection(s)
[       OK ] Parameters/TestRpc.TestCallWithPasswordProtectedKey/SSL_TCP (43 ms)
[ RUN      ] Parameters/TestRpc.TestCallToBadServer/SSL_TCP
I20260929 11:22:22.646395   765 rpc-test.cc:394] Status: Network error: Client connection negotiation failed: client connection to 0.0.0.0:0: connect: Connection refused (error 111)
I20260929 11:22:22.647040   765 rpc-test.cc:394] Status: Network error: Client connection negotiation failed: client connection to 0.0.0.0:0: connect: Connection refused (error 111)
I20260929 11:22:22.647603   765 rpc-test.cc:394] Status: Network error: Client connection negotiation failed: client connection to 0.0.0.0:0: connect: Connection refused (error 111)
I20260929 11:22:22.648138   765 rpc-test.cc:394] Status: Network error: Client connection negotiation failed: client connection to 0.0.0.0:0: connect: Connection refused (error 111)
I20260929 11:22:22.648695   765 rpc-test.cc:394] Status: Network error: Client connection negotiation failed: client connection to 0.0.0.0:0: connect: Connection refused (error 111)
[       OK ] Parameters/TestRpc.TestCallToBadServer/SSL_TCP (15 ms)
[ RUN      ] Parameters/TestRpc.TestWrongService/SSL_TCP
I20260929 11:22:22.660019   861 acceptor_pool.cc:254] collecting diagnostics on the listening RPC socket 0.0.0.0:40335 every 8 connection(s)
I20260929 11:22:22.660311   862 acceptor_pool.cc:254] collecting diagnostics on the listening RPC socket 0.0.0.0:40335 every 8 connection(s)
I20260929 11:22:22.687472   858 messenger.cc:345] service WrongServiceName not registered on TestServer
[       OK ] Parameters/TestRpc.TestWrongService/SSL_TCP (41 ms)
[ RUN      ] Parameters/TestRpc.TestConnectionKeepalive/SSL_TCP
I20260929 11:22:22.710278   884 acceptor_pool.cc:254] collecting diagnostics on the listening RPC socket 0.0.0.0:44439 every 8 connection(s)
I20260929 11:22:22.710528   885 acceptor_pool.cc:254] collecting diagnostics on the listening RPC socket 0.0.0.0:44439 every 8 connection(s)
I20260929 11:22:22.711517   765 rpc-test.cc:488] Connecting to 0.0.0.0:44439
[       OK ] Parameters/TestRpc.TestConnectionKeepalive/SSL_TCP (1089 ms)
[ RUN      ] Parameters/TestRpc.TestClientConnectionMetrics/SSL_TCP
I20260929 11:22:23.808782   909 acceptor_pool.cc:254] collecting diagnostics on the listening RPC socket 0.0.0.0:44123 every 8 connection(s)
I20260929 11:22:23.809058   910 acceptor_pool.cc:254] collecting diagnostics on the listening RPC socket 0.0.0.0:44123 every 8 connection(s)
I20260929 11:22:23.810003   765 rpc-test.cc:569] Connecting to 0.0.0.0:44123
[       OK ] Parameters/TestRpc.TestClientConnectionMetrics/SSL_TCP (19998 ms)
[ RUN      ] Parameters/TestRpc.TestCredentialsPolicy/SSL_TCP
I20260929 11:22:43.808923   932 acceptor_pool.cc:254] collecting diagnostics on the listening RPC socket 0.0.0.0:46871 every 8 connection(s)
I20260929 11:22:43.809175   933 acceptor_pool.cc:254] collecting diagnostics on the listening RPC socket 0.0.0.0:46871 every 8 connection(s)
I20260929 11:22:43.810168   765 rpc-test.cc:700] Connecting to 0.0.0.0:46871
[       OK ] Parameters/TestRpc.TestCredentialsPolicy/SSL_TCP (80 ms)
[ RUN      ] Parameters/TestRpc.TestCallLongerThanKeepalive/SSL_TCP
I20260929 11:22:43.881006   957 acceptor_pool.cc:254] collecting diagnostics on the listening RPC socket 0.0.0.0:33355 every 8 connection(s)
I20260929 11:22:43.881379   958 acceptor_pool.cc:254] collecting diagnostics on the listening RPC socket 0.0.0.0:33355 every 8 connection(s)
I20260929 11:22:43.904569   961 rpc-test-base.h:222] got call: sleep_micros: 3000000 deferred: true
I20260929 11:22:46.906432   961 rpcz_store.cc:275] Call kudu.rpc.GenericCalculatorService.Sleep from 127.0.0.1:42824 (request call id 0) took 3002 ms. Trace:
I20260929 11:22:46.906610   961 rpcz_store.cc:276] 0929 11:22:43.904427 (+     0us) service_pool.cc:170] Inserting onto call queue
0929 11:22:43.904513 (+    86us) service_pool.cc:227] Handling call
0929 11:22:46.906373 (+3001860us) inbound_call.cc:173] Queueing success response
Metrics: {}
[       OK ] Parameters/TestRpc.TestCallLongerThanKeepalive/SSL_TCP (3050 ms)
[ RUN      ] Parameters/TestRpc.TestRpcSidecar/SSL_TCP
I20260929 11:22:46.927817   982 acceptor_pool.cc:254] collecting diagnostics on the listening RPC socket 0.0.0.0:41465 every 8 connection(s)
I20260929 11:22:46.928050   983 acceptor_pool.cc:254] collecting diagnostics on the listening RPC socket 0.0.0.0:41465 every 8 connection(s)
[       OK ] Parameters/TestRpc.TestRpcSidecar/SSL_TCP (112 ms)
[ RUN      ] Parameters/TestRpc.TestRpcSidecarLimits/SSL_TCP
I20260929 11:22:49.259332  1007 acceptor_pool.cc:254] collecting diagnostics on the listening RPC socket 0.0.0.0:44383 every 8 connection(s)
I20260929 11:22:49.259582  1008 acceptor_pool.cc:254] collecting diagnostics on the listening RPC socket 0.0.0.0:44383 every 8 connection(s)
W20260929 11:22:49.300300   765 serialization.cc:72] Serialized kudu.rpc_test.PushStringsRequestPB (2147483654 bytes) is larger than the maximum configured RPC message size (52428800 bytes). Sending anyway, but peer may reject the data.
W20260929 11:22:49.307232  1006 connection.cc:535] server connection from 127.0.0.1:56332 recv error: Network error: RPC frame had a length of 2147483714, but we only support messages up to 52428800 bytes long.
W20260929 11:22:49.307402  1006 connection.cc:158] shutting down server connection from 127.0.0.1:56332 with pending inbound data: 4/2147483714 bytes received; last active 0 ns ago: status Network error: RPC frame had a length of 2147483714, but we only support messages up to 52428800 bytes long.
W20260929 11:22:49.308069  1020 connection.cc:196] Error closing socket: Network error: TlsSocket::Close: Connection reset by peer
I20260929 11:22:49.328982  1032 acceptor_pool.cc:254] collecting diagnostics on the listening RPC socket 0.0.0.0:46063 every 8 connection(s)
I20260929 11:22:49.329382  1033 acceptor_pool.cc:254] collecting diagnostics on the listening RPC socket 0.0.0.0:46063 every 8 connection(s)
W20260929 11:22:54.846130  1031 connection.cc:577] server connection from 127.0.0.1:47786: received bad data: 'Corruption: Invalid packet: message had a length of 2147483710, but we only support messages up to 2147483647 bytes
'
[       OK ] Parameters/TestRpc.TestRpcSidecarLimits/SSL_TCP (8286 ms)
[ RUN      ] Parameters/TestRpc.TestCallTimeoutDoesntAffectNegotiation/SSL_TCP
I20260929 11:22:55.333189  1057 acceptor_pool.cc:254] collecting diagnostics on the listening RPC socket 0.0.0.0:33515 every 8 connection(s)
I20260929 11:22:55.333465  1058 acceptor_pool.cc:254] collecting diagnostics on the listening RPC socket 0.0.0.0:33515 every 8 connection(s)
W20260929 11:22:55.354408  1053 negotiation.cc:266] Injecting 500ms delay in negotiation
I20260929 11:22:55.404925   765 rpc-test-base.h:595] status: Timed out: connection negotiation to 0.0.0.0:33515 for RPC Sleep timed out after 0.050s (ON_OUTBOUND_QUEUE), seconds elapsed: 0.0511981
[       OK ] Parameters/TestRpc.TestCallTimeoutDoesntAffectNegotiation/SSL_TCP (553 ms)
[ RUN      ] Parameters/TestRpc.TestRpcHandlerLatencyMetric/SSL_TCP
I20260929 11:22:55.886533  1082 acceptor_pool.cc:254] collecting diagnostics on the listening RPC socket 0.0.0.0:38075 every 8 connection(s)
I20260929 11:22:55.886770  1083 acceptor_pool.cc:254] collecting diagnostics on the listening RPC socket 0.0.0.0:38075 every 8 connection(s)
I20260929 11:22:55.938613   765 rpc-test.cc:1236] Sleep() min lat: 20678
I20260929 11:22:55.938707   765 rpc-test.cc:1237] Sleep() mean lat: 20678
I20260929 11:22:55.938750   765 rpc-test.cc:1238] Sleep() max lat: 20678
I20260929 11:22:55.938844   765 rpc-test.cc:1239] Sleep() #calls: 1
[       OK ] Parameters/TestRpc.TestRpcHandlerLatencyMetric/SSL_TCP (78 ms)
[ RUN      ] Parameters/TestRpc.TimedOutOnResponseMetricServiceQueue/SSL_TCP
I20260929 11:22:55.966431  1108 acceptor_pool.cc:254] collecting diagnostics on the listening RPC socket 0.0.0.0:37571 every 8 connection(s)
I20260929 11:22:55.966566  1109 acceptor_pool.cc:254] collecting diagnostics on the listening RPC socket 0.0.0.0:37571 every 8 connection(s)
W20260929 11:22:56.028759  1110 rpcz_store.cc:267] Call kudu.rpc_test.CalculatorService.Sleep from 127.0.0.1:47558 (request call id 2) took 20 ms (client timeout 20 ms). Trace:
W20260929 11:22:56.028949  1110 rpcz_store.cc:269] 0929 11:22:56.008263 (+     0us) service_pool.cc:170] Inserting onto call queue
0929 11:22:56.028687 (+ 20424us) service_pool.cc:214] Skipping call since client already timed out
0929 11:22:56.028726 (+    39us) inbound_call.cc:173] Queueing failure response
Metrics: {}
[       OK ] Parameters/TestRpc.TimedOutOnResponseMetricServiceQueue/SSL_TCP (89 ms)
[ RUN      ] Parameters/TestRpc.RpcPendingConnectionsMetric/SSL_TCP
I20260929 11:22:56.040585  1131 acceptor_pool.cc:254] collecting diagnostics on the listening RPC socket 0.0.0.0:42853 every 8 connection(s)
I20260929 11:22:56.040815  1132 acceptor_pool.cc:254] collecting diagnostics on the listening RPC socket 0.0.0.0:42853 every 8 connection(s)
W20260929 11:22:56.055811  1127 negotiation.cc:337] Failed RPC negotiation. Trace:
0929 11:22:56.054828 (+     0us) reactor.cc:625] Submitting negotiation task for server connection from 127.0.0.1:33316 (local address 127.0.0.1:42853)
0929 11:22:56.055067 (+   239us) server_negotiation.cc:206] Beginning negotiation
0929 11:22:56.055072 (+     5us) server_negotiation.cc:399] Waiting for connection header
0929 11:22:56.055313 (+   241us) negotiation.cc:327] Negotiation complete: Network error: Server connection negotiation failed: server connection from 127.0.0.1:33316: BlockingRecv error: recv got EOF from 127.0.0.1:33316 (error 108)
Metrics: {"server-negotiator.queue_time_us":55}
[       OK ] Parameters/TestRpc.RpcPendingConnectionsMetric/SSL_TCP (34 ms)
[ RUN      ] Parameters/TestRpc.TestRpcContextClientDeadline/SSL_TCP
I20260929 11:22:56.091629  1147 acceptor_pool.cc:254] collecting diagnostics on the listening RPC socket 0.0.0.0:44057 every 8 connection(s)
I20260929 11:22:56.091888  1148 acceptor_pool.cc:254] collecting diagnostics on the listening RPC socket 0.0.0.0:44057 every 8 connection(s)
[       OK ] Parameters/TestRpc.TestRpcContextClientDeadline/SSL_TCP (83 ms)
[ RUN      ] Parameters/TestRpc.TestApplicationFeatureFlagUnsupportedServer/SSL_TCP
I20260929 11:22:56.172252  1172 acceptor_pool.cc:254] collecting diagnostics on the listening RPC socket 0.0.0.0:46055 every 8 connection(s)
I20260929 11:22:56.172535  1173 acceptor_pool.cc:254] collecting diagnostics on the listening RPC socket 0.0.0.0:46055 every 8 connection(s)
[       OK ] Parameters/TestRpc.TestApplicationFeatureFlagUnsupportedServer/SSL_TCP (62 ms)
[ RUN      ] Parameters/TestRpc.TestCancellationAsync/SSL_TCP
I20260929 11:22:56.231190  1197 acceptor_pool.cc:254] collecting diagnostics on the listening RPC socket 0.0.0.0:43791 every 8 connection(s)
I20260929 11:22:56.231546  1198 acceptor_pool.cc:254] collecting diagnostics on the listening RPC socket 0.0.0.0:43791 every 8 connection(s)
I20260929 11:22:56.232401   765 rpc-test.cc:1716] Connecting to 0.0.0.0:43791
I20260929 11:22:56.245281   765 test_util.cc:268] Using random seed: 1736360450
I20260929 11:22:56.282359  1201 rpc-test-base.h:240] got call: sleep_micros: 500 pattern: 4294967295 num_repetitions: 2097152 sidecar_idx: 0
I20260929 11:22:56.302697  1200 rpc-test-base.h:240] got call: sleep_micros: 500 pattern: 4294967295 num_repetitions: 2097152 sidecar_idx: 0
I20260929 11:22:56.328943  1199 rpc-test-base.h:240] got call: sleep_micros: 500 pattern: 4294967295 num_repetitions: 2097152 sidecar_idx: 0
I20260929 11:22:56.360939  1201 rpc-test-base.h:240] got call: sleep_micros: 500 pattern: 4294967295 num_repetitions: 2097152 sidecar_idx: 0
I20260929 11:22:56.387148  1200 rpc-test-base.h:240] got call: sleep_micros: 500 pattern: 4294967295 num_repetitions: 2097152 sidecar_idx: 0
I20260929 11:22:56.425392  1201 rpc-test-base.h:240] got call: sleep_micros: 500 pattern: 4294967295 num_repetitions: 2097152 sidecar_idx: 0
W20260929 11:22:56.451156  1194 connection.cc:196] Error closing socket: Network error: TlsSocket::Close: Broken pipe
W20260929 11:22:56.452760  1194 connection.cc:441] server connection from 127.0.0.1:39634 torn down before Call kudu.rpc.GenericCalculatorService.SleepWithSidecar from 127.0.0.1:39634 (request call id 7) could send its response
W20260929 11:22:56.472196  1194 connection.cc:441] server connection from 127.0.0.1:39634 torn down before Call kudu.rpc.GenericCalculatorService.SleepWithSidecar from 127.0.0.1:39634 (request call id 8) could send its response
[       OK ] Parameters/TestRpc.TestCancellationAsync/SSL_TCP (260 ms)
[ RUN      ] Parameters/TestRpc.TestPerformanceBySocketType/SSL_TCP
I20260929 11:22:56.512622  1222 acceptor_pool.cc:254] collecting diagnostics on the listening RPC socket 0.0.0.0:41437 every 8 connection(s)
I20260929 11:22:56.512836  1223 acceptor_pool.cc:254] collecting diagnostics on the listening RPC socket 0.0.0.0:41437 every 8 connection(s)
I20260929 11:22:56.513826   765 rpc-test.cc:1846] Connecting to 0.0.0.0:41437
I20260929 11:22:59.633244   765 rpc-test.cc:1859] Sending 1024MB via ssl-enabled tcp socket: real 3.104s	user 2.851s	sys 2.294s
I20260929 11:23:02.737748   765 rpc-test.cc:1859] Sending 1024MB via ssl-enabled tcp socket: real 3.104s	user 2.935s	sys 2.270s
I20260929 11:23:05.946717   765 rpc-test.cc:1859] Sending 1024MB via ssl-enabled tcp socket: real 3.209s	user 3.004s	sys 2.387s
I20260929 11:23:09.034403   765 rpc-test.cc:1859] Sending 1024MB via ssl-enabled tcp socket: real 3.088s	user 2.888s	sys 2.260s
I20260929 11:23:12.074534   765 rpc-test.cc:1859] Sending 1024MB via ssl-enabled tcp socket: real 3.040s	user 2.745s	sys 2.303s
[       OK ] Parameters/TestRpc.TestPerformanceBySocketType/SSL_TCP (15607 ms)
[----------] 20 tests from Parameters/TestRpc (49576 ms total)

[----------] 1 test from Parameters/TestRpcSocketTxRxQueue
[ RUN      ] Parameters/TestRpcSocketTxRxQueue.OverCapacity/0
W20260929 11:23:12.390611  1239 negotiation.cc:337] Failed RPC negotiation. Trace:
0929 11:23:12.093326 (+     0us) reactor.cc:625] Submitting negotiation task for client connection to 0.0.0.0:35789 (local address 127.0.0.1:45686)
0929 11:23:12.093665 (+   339us) negotiation.cc:107] Waiting for socket to connect
0929 11:23:12.093684 (+    19us) client_negotiation.cc:174] Beginning negotiation
0929 11:23:12.093816 (+   132us) client_negotiation.cc:252] Sending NEGOTIATE NegotiatePB request
0929 11:23:12.390145 (+296329us) negotiation.cc:327] Negotiation complete: Network error: Client connection negotiation failed: client connection to 0.0.0.0:35789: BlockingRecv error: recv error from unknown peer: Transport endpoint is not connected (error 107)
Metrics: {"client-negotiator.queue_time_us":167}
W20260929 11:23:12.390753  1257 negotiation.cc:337] Failed RPC negotiation. Trace:
0929 11:23:12.099195 (+     0us) reactor.cc:625] Submitting negotiation task for client connection to 0.0.0.0:35789 (local address 127.0.0.1:45716)
0929 11:23:12.099430 (+   235us) negotiation.cc:107] Waiting for socket to connect
0929 11:23:12.099448 (+    18us) client_negotiation.cc:174] Beginning negotiation
0929 11:23:12.099600 (+   152us) client_negotiation.cc:252] Sending NEGOTIATE NegotiatePB request
0929 11:23:12.390240 (+290640us) negotiation.cc:327] Negotiation complete: Network error: Client connection negotiation failed: client connection to 0.0.0.0:35789: BlockingRecv error: recv error from unknown peer: Transport endpoint is not connected (error 107)
Metrics: {"client-negotiator.queue_time_us":57}
W20260929 11:23:12.391165  1284 negotiation.cc:337] Failed RPC negotiation. Trace:
0929 11:23:12.108695 (+     0us) reactor.cc:625] Submitting negotiation task for client connection to 0.0.0.0:35789 (local address 127.0.0.1:45746)
0929 11:23:12.108936 (+   241us) negotiation.cc:107] Waiting for socket to connect
0929 11:23:12.108954 (+    18us) client_negotiation.cc:174] Beginning negotiation
0929 11:23:12.109112 (+   158us) client_negotiation.cc:252] Sending NEGOTIATE NegotiatePB request
0929 11:23:12.390698 (+281586us) negotiation.cc:327] Negotiation complete: Network error: Client connection negotiation failed: client connection to 0.0.0.0:35789: BlockingRecv error: recv error from unknown peer: Transport endpoint is not connected (error 107)
Metrics: {"client-negotiator.queue_time_us":63}
W20260929 11:23:12.391837  1248 negotiation.cc:337] Failed RPC negotiation. Trace:
0929 11:23:12.096412 (+     0us) reactor.cc:625] Submitting negotiation task for client connection to 0.0.0.0:35789 (local address 127.0.0.1:45700)
0929 11:23:12.096584 (+   172us) negotiation.cc:107] Waiting for socket to connect
0929 11:23:12.096601 (+    17us) client_negotiation.cc:174] Beginning negotiation
0929 11:23:12.096726 (+   125us) client_negotiation.cc:252] Sending NEGOTIATE NegotiatePB request
0929 11:23:12.390301 (+293575us) negotiation.cc:327] Negotiation complete: Network error: Client connection negotiation failed: client connection to 0.0.0.0:35789: BlockingRecv error: recv error from unknown peer: Transport endpoint is not connected (error 107)
Metrics: {"client-negotiator.queue_time_us":51}
W20260929 11:23:12.391937  1275 negotiation.cc:337] Failed RPC negotiation. Trace:
0929 11:23:12.105710 (+     0us) reactor.cc:625] Submitting negotiation task for client connection to 0.0.0.0:35789 (local address 127.0.0.1:45742)
0929 11:23:12.105947 (+   237us) negotiation.cc:107] Waiting for socket to connect
0929 11:23:12.105965 (+    18us) client_negotiation.cc:174] Beginning negotiation
0929 11:23:12.106085 (+   120us) client_negotiation.cc:252] Sending NEGOTIATE NegotiatePB request
0929 11:23:12.390359 (+284274us) negotiation.cc:327] Negotiation complete: Network error: Client connection negotiation failed: client connection to 0.0.0.0:35789: BlockingRecv error: recv error from unknown peer: Transport endpoint is not connected (error 107)
Metrics: {"client-negotiator.queue_time_us":94}
W20260929 11:23:12.392508  1266 negotiation.cc:337] Failed RPC negotiation. Trace:
0929 11:23:12.102248 (+     0us) reactor.cc:625] Submitting negotiation task for client connection to 0.0.0.0:35789 (local address 127.0.0.1:45726)
0929 11:23:12.102605 (+   357us) negotiation.cc:107] Waiting for socket to connect
0929 11:23:12.102627 (+    22us) client_negotiation.cc:174] Beginning negotiation
0929 11:23:12.102766 (+   139us) client_negotiation.cc:252] Sending NEGOTIATE NegotiatePB request
0929 11:23:12.390125 (+287359us) negotiation.cc:327] Negotiation complete: Network error: Client connection negotiation failed: client connection to 0.0.0.0:35789: BlockingRecv error: recv error from unknown peer: Transport endpoint is not connected (error 107)
Metrics: {"client-negotiator.queue_time_us":212}
[       OK ] Parameters/TestRpcSocketTxRxQueue.OverCapacity/0 (1071 ms)
[----------] 1 test from Parameters/TestRpcSocketTxRxQueue (1071 ms total)

[----------] Global test environment tear-down
[==========] 21 tests from 2 test suites ran. (50647 ms total)
[  PASSED  ] 20 tests.
[  FAILED  ] 1 test, listed below:
[  FAILED  ] Parameters/TestRpc.TestCallWithChainCertAndChainCA/SSL_TCP, where GetParam() = (true, false)

 1 FAILED TEST