Diagnosed failure

Parameters/TestRpc.TestCallWithChainCertAndChainCA/SSL_TCP: /data0/somelongdirectorytoavoidrpathissues/src/kudu/src/kudu/rpc/rpc-test.cc:270: Failure
Failed
Bad status: Runtime error: could not verify certificate chain (error with cert: subject=CN = localhost, ST = sadfjas, C = AS, emailAddress = sdflkdsajf, O = lskdfjlsad, OU = sldfkja, issuer=C = AS, ST = ASDfkjdhf, L = lskdjf, O = saldfja, OU = skdjf, CN = localhost, emailAddress = sadjflkadsj): : certificate has expired
Google Test trace:
/data0/somelongdirectorytoavoidrpathissues/src/kudu/src/kudu/rpc/rpc-test.cc:267: Connecting to 0.0.0.0:39275
I20260928 18:11:34.577857   379 test_util.cc:175] -----------------------------------------------
I20260928 18:11:34.577970   379 test_util.cc:176] Had fatal failures, leaving test files at /tmp/dist-test-taskhafnj7/test-tmp/rpc-test.5.Parameters_TestRpc.TestCallWithChainCertAndChainCA_SSL_TCP.1790619094438859-379-0

Full log

Note: This is test shard 6 of 8.
[==========] Running 21 tests from 2 test suites.
[----------] Global test environment set-up.
[----------] 20 tests from Parameters/TestRpc
[ RUN      ] Parameters/TestRpc.TestMessengerCreateDestroy/SSL_TCP
WARNING: Logging before InitGoogleLogging() is written to STDERR
I20260928 18:11:34.500281   379 rpc-test.cc:169] started messenger TestCreateDestroy
[       OK ] Parameters/TestRpc.TestMessengerCreateDestroy/SSL_TCP (43 ms)
[ RUN      ] Parameters/TestRpc.TestNegotiationDeadlock/SSL_TCP
I20260928 18:11:34.518307   399 acceptor_pool.cc:254] collecting diagnostics on the listening RPC socket 0.0.0.0:35305 every 8 connection(s)
I20260928 18:11:34.518616   400 acceptor_pool.cc:254] collecting diagnostics on the listening RPC socket 0.0.0.0:35305 every 8 connection(s)
[       OK ] Parameters/TestRpc.TestNegotiationDeadlock/SSL_TCP (36 ms)
[ RUN      ] Parameters/TestRpc.TestCallWithChainCertAndChainCA/SSL_TCP
I20260928 18:11:34.566309   415 acceptor_pool.cc:254] collecting diagnostics on the listening RPC socket 0.0.0.0:39275 every 8 connection(s)
I20260928 18:11:34.566654   416 acceptor_pool.cc:254] collecting diagnostics on the listening RPC socket 0.0.0.0:39275 every 8 connection(s)
/data0/somelongdirectorytoavoidrpathissues/src/kudu/src/kudu/rpc/rpc-test.cc:270: Failure
Failed
Bad status: Runtime error: could not verify certificate chain (error with cert: subject=CN = localhost, ST = sadfjas, C = AS, emailAddress = sdflkdsajf, O = lskdfjlsad, OU = sldfkja, issuer=C = AS, ST = ASDfkjdhf, L = lskdjf, O = saldfja, OU = skdjf, CN = localhost, emailAddress = sadjflkadsj): : certificate has expired
Google Test trace:
/data0/somelongdirectorytoavoidrpathissues/src/kudu/src/kudu/rpc/rpc-test.cc:267: Connecting to 0.0.0.0:39275
I20260928 18:11:34.577857   379 test_util.cc:175] -----------------------------------------------
I20260928 18:11:34.577970   379 test_util.cc:176] Had fatal failures, leaving test files at /tmp/dist-test-taskhafnj7/test-tmp/rpc-test.5.Parameters_TestRpc.TestCallWithChainCertAndChainCA_SSL_TCP.1790619094438859-379-0
[  FAILED  ] Parameters/TestRpc.TestCallWithChainCertAndChainCA/SSL_TCP, where GetParam() = (true, false) (37 ms)
[ RUN      ] Parameters/TestRpc.TestCallWithPasswordProtectedKey/SSL_TCP
I20260928 18:11:34.588326   440 acceptor_pool.cc:254] collecting diagnostics on the listening RPC socket 0.0.0.0:46769 every 8 connection(s)
I20260928 18:11:34.588528   441 acceptor_pool.cc:254] collecting diagnostics on the listening RPC socket 0.0.0.0:46769 every 8 connection(s)
[       OK ] Parameters/TestRpc.TestCallWithPasswordProtectedKey/SSL_TCP (49 ms)
[ RUN      ] Parameters/TestRpc.TestCallToBadServer/SSL_TCP
I20260928 18:11:34.638510   379 rpc-test.cc:394] Status: Network error: Client connection negotiation failed: client connection to 0.0.0.0:0: connect: Connection refused (error 111)
I20260928 18:11:34.639506   379 rpc-test.cc:394] Status: Network error: Client connection negotiation failed: client connection to 0.0.0.0:0: connect: Connection refused (error 111)
I20260928 18:11:34.640337   379 rpc-test.cc:394] Status: Network error: Client connection negotiation failed: client connection to 0.0.0.0:0: connect: Connection refused (error 111)
I20260928 18:11:34.641099   379 rpc-test.cc:394] Status: Network error: Client connection negotiation failed: client connection to 0.0.0.0:0: connect: Connection refused (error 111)
I20260928 18:11:34.641778   379 rpc-test.cc:394] Status: Network error: Client connection negotiation failed: client connection to 0.0.0.0:0: connect: Connection refused (error 111)
[       OK ] Parameters/TestRpc.TestCallToBadServer/SSL_TCP (17 ms)
[ RUN      ] Parameters/TestRpc.TestWrongService/SSL_TCP
I20260928 18:11:34.661369   475 acceptor_pool.cc:254] collecting diagnostics on the listening RPC socket 0.0.0.0:35737 every 8 connection(s)
I20260928 18:11:34.661609   476 acceptor_pool.cc:254] collecting diagnostics on the listening RPC socket 0.0.0.0:35737 every 8 connection(s)
I20260928 18:11:34.684942   472 messenger.cc:345] service WrongServiceName not registered on TestServer
[       OK ] Parameters/TestRpc.TestWrongService/SSL_TCP (46 ms)
[ RUN      ] Parameters/TestRpc.TestConnectionKeepalive/SSL_TCP
I20260928 18:11:34.702111   498 acceptor_pool.cc:254] collecting diagnostics on the listening RPC socket 0.0.0.0:37499 every 8 connection(s)
I20260928 18:11:34.702416   499 acceptor_pool.cc:254] collecting diagnostics on the listening RPC socket 0.0.0.0:37499 every 8 connection(s)
I20260928 18:11:34.703436   379 rpc-test.cc:488] Connecting to 0.0.0.0:37499
[       OK ] Parameters/TestRpc.TestConnectionKeepalive/SSL_TCP (1056 ms)
[ RUN      ] Parameters/TestRpc.TestClientConnectionMetrics/SSL_TCP
I20260928 18:11:35.764216   523 acceptor_pool.cc:254] collecting diagnostics on the listening RPC socket 0.0.0.0:38289 every 8 connection(s)
I20260928 18:11:35.764451   524 acceptor_pool.cc:254] collecting diagnostics on the listening RPC socket 0.0.0.0:38289 every 8 connection(s)
I20260928 18:11:35.765412   379 rpc-test.cc:569] Connecting to 0.0.0.0:38289
[       OK ] Parameters/TestRpc.TestClientConnectionMetrics/SSL_TCP (20267 ms)
[ RUN      ] Parameters/TestRpc.TestCredentialsPolicy/SSL_TCP
I20260928 18:11:56.026556   546 acceptor_pool.cc:254] collecting diagnostics on the listening RPC socket 0.0.0.0:33613 every 8 connection(s)
I20260928 18:11:56.027051   547 acceptor_pool.cc:254] collecting diagnostics on the listening RPC socket 0.0.0.0:33613 every 8 connection(s)
I20260928 18:11:56.028394   379 rpc-test.cc:700] Connecting to 0.0.0.0:33613
[       OK ] Parameters/TestRpc.TestCredentialsPolicy/SSL_TCP (47 ms)
[ RUN      ] Parameters/TestRpc.TestCallLongerThanKeepalive/SSL_TCP
I20260928 18:11:56.080885   571 acceptor_pool.cc:254] collecting diagnostics on the listening RPC socket 0.0.0.0:38391 every 8 connection(s)
I20260928 18:11:56.081169   572 acceptor_pool.cc:254] collecting diagnostics on the listening RPC socket 0.0.0.0:38391 every 8 connection(s)
I20260928 18:11:56.131826   575 rpc-test-base.h:222] got call: sleep_micros: 3000000 deferred: true
I20260928 18:11:59.133739   575 rpcz_store.cc:275] Call kudu.rpc.GenericCalculatorService.Sleep from 127.0.0.1:50436 (request call id 0) took 3002 ms. Trace:
I20260928 18:11:59.133932   575 rpcz_store.cc:276] 0928 18:11:56.131629 (+     0us) service_pool.cc:170] Inserting onto call queue
0928 18:11:56.131764 (+   135us) service_pool.cc:227] Handling call
0928 18:11:59.133693 (+3001929us) inbound_call.cc:173] Queueing success response
Metrics: {}
[       OK ] Parameters/TestRpc.TestCallLongerThanKeepalive/SSL_TCP (3077 ms)
[ RUN      ] Parameters/TestRpc.TestRpcSidecar/SSL_TCP
I20260928 18:11:59.183138   596 acceptor_pool.cc:254] collecting diagnostics on the listening RPC socket 0.0.0.0:38735 every 8 connection(s)
I20260928 18:11:59.183398   597 acceptor_pool.cc:254] collecting diagnostics on the listening RPC socket 0.0.0.0:38735 every 8 connection(s)
[       OK ] Parameters/TestRpc.TestRpcSidecar/SSL_TCP (143 ms)
[ RUN      ] Parameters/TestRpc.TestRpcSidecarLimits/SSL_TCP
I20260928 18:12:01.459573   621 acceptor_pool.cc:254] collecting diagnostics on the listening RPC socket 0.0.0.0:34667 every 8 connection(s)
I20260928 18:12:01.459780   622 acceptor_pool.cc:254] collecting diagnostics on the listening RPC socket 0.0.0.0:34667 every 8 connection(s)
W20260928 18:12:01.476475   379 serialization.cc:72] Serialized kudu.rpc_test.PushStringsRequestPB (2147483654 bytes) is larger than the maximum configured RPC message size (52428800 bytes). Sending anyway, but peer may reject the data.
W20260928 18:12:01.482825   620 connection.cc:535] server connection from 127.0.0.1:60106 recv error: Network error: RPC frame had a length of 2147483714, but we only support messages up to 52428800 bytes long.
W20260928 18:12:01.483007   620 connection.cc:158] shutting down server connection from 127.0.0.1:60106 with pending inbound data: 4/2147483714 bytes received; last active 0 ns ago: status Network error: RPC frame had a length of 2147483714, but we only support messages up to 52428800 bytes long.
W20260928 18:12:01.483479   634 connection.cc:196] Error closing socket: Network error: TlsSocket::Close: Connection reset by peer
I20260928 18:12:01.497804   646 acceptor_pool.cc:254] collecting diagnostics on the listening RPC socket 0.0.0.0:39575 every 8 connection(s)
I20260928 18:12:01.497948   647 acceptor_pool.cc:254] collecting diagnostics on the listening RPC socket 0.0.0.0:39575 every 8 connection(s)
W20260928 18:12:07.049561   645 connection.cc:577] server connection from 127.0.0.1:59866: received bad data: 'Corruption: Invalid packet: message had a length of 2147483710, but we only support messages up to 2147483647 bytes
'
[       OK ] Parameters/TestRpc.TestRpcSidecarLimits/SSL_TCP (8185 ms)
[ RUN      ] Parameters/TestRpc.TestCallTimeoutDoesntAffectNegotiation/SSL_TCP
I20260928 18:12:07.489538   671 acceptor_pool.cc:254] collecting diagnostics on the listening RPC socket 0.0.0.0:40277 every 8 connection(s)
I20260928 18:12:07.489809   672 acceptor_pool.cc:254] collecting diagnostics on the listening RPC socket 0.0.0.0:40277 every 8 connection(s)
W20260928 18:12:07.504768   667 negotiation.cc:266] Injecting 500ms delay in negotiation
I20260928 18:12:07.555267   379 rpc-test-base.h:595] status: Timed out: connection negotiation to 0.0.0.0:40277 for RPC Sleep timed out after 0.050s (ON_OUTBOUND_QUEUE), seconds elapsed: 0.0512612
[       OK ] Parameters/TestRpc.TestCallTimeoutDoesntAffectNegotiation/SSL_TCP (545 ms)
[ RUN      ] Parameters/TestRpc.TestRpcHandlerLatencyMetric/SSL_TCP
I20260928 18:12:08.038568   696 acceptor_pool.cc:254] collecting diagnostics on the listening RPC socket 0.0.0.0:38131 every 8 connection(s)
I20260928 18:12:08.038834   697 acceptor_pool.cc:254] collecting diagnostics on the listening RPC socket 0.0.0.0:38131 every 8 connection(s)
I20260928 18:12:08.091692   379 rpc-test.cc:1236] Sleep() min lat: 20680
I20260928 18:12:08.091790   379 rpc-test.cc:1237] Sleep() mean lat: 20680
I20260928 18:12:08.091830   379 rpc-test.cc:1238] Sleep() max lat: 20680
I20260928 18:12:08.091847   379 rpc-test.cc:1239] Sleep() #calls: 1
[       OK ] Parameters/TestRpc.TestRpcHandlerLatencyMetric/SSL_TCP (80 ms)
[ RUN      ] Parameters/TestRpc.TimedOutOnResponseMetricServiceQueue/SSL_TCP
I20260928 18:12:08.129125   722 acceptor_pool.cc:254] collecting diagnostics on the listening RPC socket 0.0.0.0:44407 every 8 connection(s)
I20260928 18:12:08.129300   723 acceptor_pool.cc:254] collecting diagnostics on the listening RPC socket 0.0.0.0:44407 every 8 connection(s)
W20260928 18:12:08.194648   724 rpcz_store.cc:267] Call kudu.rpc_test.CalculatorService.Sleep from 127.0.0.1:37552 (request call id 2) took 20 ms (client timeout 20 ms). Trace:
W20260928 18:12:08.194829   724 rpcz_store.cc:269] 0928 18:12:08.174168 (+     0us) service_pool.cc:170] Inserting onto call queue
0928 18:12:08.194576 (+ 20408us) service_pool.cc:214] Skipping call since client already timed out
0928 18:12:08.194627 (+    51us) inbound_call.cc:173] Queueing failure response
Metrics: {}
[       OK ] Parameters/TestRpc.TimedOutOnResponseMetricServiceQueue/SSL_TCP (102 ms)
[ RUN      ] Parameters/TestRpc.RpcPendingConnectionsMetric/SSL_TCP
I20260928 18:12:08.203742   745 acceptor_pool.cc:254] collecting diagnostics on the listening RPC socket 0.0.0.0:35053 every 8 connection(s)
I20260928 18:12:08.203936   746 acceptor_pool.cc:254] collecting diagnostics on the listening RPC socket 0.0.0.0:35053 every 8 connection(s)
W20260928 18:12:08.215579   741 negotiation.cc:337] Failed RPC negotiation. Trace:
0928 18:12:08.214708 (+     0us) reactor.cc:625] Submitting negotiation task for server connection from 127.0.0.1:58432 (local address 127.0.0.1:35053)
0928 18:12:08.214948 (+   240us) server_negotiation.cc:206] Beginning negotiation
0928 18:12:08.214954 (+     6us) server_negotiation.cc:399] Waiting for connection header
0928 18:12:08.215148 (+   194us) negotiation.cc:327] Negotiation complete: Network error: Server connection negotiation failed: server connection from 127.0.0.1:58432: BlockingRecv error: recv got EOF from 127.0.0.1:58432 (error 108)
Metrics: {"server-negotiator.queue_time_us":67}
[       OK ] Parameters/TestRpc.RpcPendingConnectionsMetric/SSL_TCP (28 ms)
[ RUN      ] Parameters/TestRpc.TestRpcContextClientDeadline/SSL_TCP
I20260928 18:12:08.265733   761 acceptor_pool.cc:254] collecting diagnostics on the listening RPC socket 0.0.0.0:42839 every 8 connection(s)
I20260928 18:12:08.265939   762 acceptor_pool.cc:254] collecting diagnostics on the listening RPC socket 0.0.0.0:42839 every 8 connection(s)
[       OK ] Parameters/TestRpc.TestRpcContextClientDeadline/SSL_TCP (95 ms)
[ RUN      ] Parameters/TestRpc.TestApplicationFeatureFlagUnsupportedServer/SSL_TCP
I20260928 18:12:08.339664   786 acceptor_pool.cc:254] collecting diagnostics on the listening RPC socket 0.0.0.0:42835 every 8 connection(s)
I20260928 18:12:08.340054   787 acceptor_pool.cc:254] collecting diagnostics on the listening RPC socket 0.0.0.0:42835 every 8 connection(s)
[       OK ] Parameters/TestRpc.TestApplicationFeatureFlagUnsupportedServer/SSL_TCP (47 ms)
[ RUN      ] Parameters/TestRpc.TestCancellationAsync/SSL_TCP
I20260928 18:12:08.391160   811 acceptor_pool.cc:254] collecting diagnostics on the listening RPC socket 0.0.0.0:45717 every 8 connection(s)
I20260928 18:12:08.391369   812 acceptor_pool.cc:254] collecting diagnostics on the listening RPC socket 0.0.0.0:45717 every 8 connection(s)
I20260928 18:12:08.392218   379 rpc-test.cc:1716] Connecting to 0.0.0.0:45717
I20260928 18:12:08.417330   379 test_util.cc:268] Using random seed: 18074642
I20260928 18:12:08.456720   815 rpc-test-base.h:240] got call: sleep_micros: 500 pattern: 4294967295 num_repetitions: 2097152 sidecar_idx: 0
I20260928 18:12:08.484769   814 rpc-test-base.h:240] got call: sleep_micros: 500 pattern: 4294967295 num_repetitions: 2097152 sidecar_idx: 0
I20260928 18:12:08.509815   813 rpc-test-base.h:240] got call: sleep_micros: 500 pattern: 4294967295 num_repetitions: 2097152 sidecar_idx: 0
I20260928 18:12:08.535027   815 rpc-test-base.h:240] got call: sleep_micros: 500 pattern: 4294967295 num_repetitions: 2097152 sidecar_idx: 0
I20260928 18:12:08.569159   813 rpc-test-base.h:240] got call: sleep_micros: 500 pattern: 4294967295 num_repetitions: 2097152 sidecar_idx: 0
I20260928 18:12:08.596649   815 rpc-test-base.h:240] got call: sleep_micros: 500 pattern: 4294967295 num_repetitions: 2097152 sidecar_idx: 0
W20260928 18:12:08.617944   808 connection.cc:196] Error closing socket: Network error: TlsSocket::Close: Broken pipe
W20260928 18:12:08.624379   808 connection.cc:441] server connection from 127.0.0.1:35018 torn down before Call kudu.rpc.GenericCalculatorService.SleepWithSidecar from 127.0.0.1:35018 (request call id 7) could send its response
W20260928 18:12:08.642614   808 connection.cc:441] server connection from 127.0.0.1:35018 torn down before Call kudu.rpc.GenericCalculatorService.SleepWithSidecar from 127.0.0.1:35018 (request call id 8) could send its response
[       OK ] Parameters/TestRpc.TestCancellationAsync/SSL_TCP (274 ms)
[ RUN      ] Parameters/TestRpc.TestPerformanceBySocketType/SSL_TCP
I20260928 18:12:08.659844   836 acceptor_pool.cc:254] collecting diagnostics on the listening RPC socket 0.0.0.0:40439 every 8 connection(s)
I20260928 18:12:08.660073   837 acceptor_pool.cc:254] collecting diagnostics on the listening RPC socket 0.0.0.0:40439 every 8 connection(s)
I20260928 18:12:08.661005   379 rpc-test.cc:1846] Connecting to 0.0.0.0:40439
I20260928 18:12:11.837556   379 rpc-test.cc:1859] Sending 1024MB via ssl-enabled tcp socket: real 3.159s	user 2.811s	sys 2.418s
I20260928 18:12:15.119112   379 rpc-test.cc:1859] Sending 1024MB via ssl-enabled tcp socket: real 3.281s	user 3.187s	sys 2.255s
I20260928 18:12:18.307548   379 rpc-test.cc:1859] Sending 1024MB via ssl-enabled tcp socket: real 3.188s	user 2.918s	sys 2.380s
I20260928 18:12:21.540211   379 rpc-test.cc:1859] Sending 1024MB via ssl-enabled tcp socket: real 3.233s	user 2.894s	sys 2.466s
I20260928 18:12:24.557824   379 rpc-test.cc:1859] Sending 1024MB via ssl-enabled tcp socket: real 3.017s	user 2.770s	sys 2.229s
[       OK ] Parameters/TestRpc.TestPerformanceBySocketType/SSL_TCP (15920 ms)
[----------] 20 tests from Parameters/TestRpc (50106 ms total)

[----------] 1 test from Parameters/TestRpcSocketTxRxQueue
[ RUN      ] Parameters/TestRpcSocketTxRxQueue.OverCapacity/0
W20260928 18:12:24.871161   853 negotiation.cc:337] Failed RPC negotiation. Trace:
0928 18:12:24.576190 (+     0us) reactor.cc:625] Submitting negotiation task for client connection to 0.0.0.0:36665 (local address 127.0.0.1:50750)
0928 18:12:24.576351 (+   161us) negotiation.cc:107] Waiting for socket to connect
0928 18:12:24.576367 (+    16us) client_negotiation.cc:174] Beginning negotiation
0928 18:12:24.576476 (+   109us) client_negotiation.cc:252] Sending NEGOTIATE NegotiatePB request
0928 18:12:24.870364 (+293888us) negotiation.cc:327] Negotiation complete: Network error: Client connection negotiation failed: client connection to 0.0.0.0:36665: BlockingRecv error: recv error from unknown peer: Transport endpoint is not connected (error 107)
Metrics: {"client-negotiator.queue_time_us":52}
W20260928 18:12:24.871493   898 negotiation.cc:337] Failed RPC negotiation. Trace:
0928 18:12:24.590352 (+     0us) reactor.cc:625] Submitting negotiation task for client connection to 0.0.0.0:36665 (local address 127.0.0.1:50792)
0928 18:12:24.590560 (+   208us) negotiation.cc:107] Waiting for socket to connect
0928 18:12:24.590578 (+    18us) client_negotiation.cc:174] Beginning negotiation
0928 18:12:24.590714 (+   136us) client_negotiation.cc:252] Sending NEGOTIATE NegotiatePB request
0928 18:12:24.870642 (+279928us) negotiation.cc:327] Negotiation complete: Network error: Client connection negotiation failed: client connection to 0.0.0.0:36665: BlockingRecv error: recv error from unknown peer: Transport endpoint is not connected (error 107)
Metrics: {"client-negotiator.queue_time_us":58}
W20260928 18:12:24.871191   862 negotiation.cc:337] Failed RPC negotiation. Trace:
0928 18:12:24.578741 (+     0us) reactor.cc:625] Submitting negotiation task for client connection to 0.0.0.0:36665 (local address 127.0.0.1:50762)
0928 18:12:24.578997 (+   256us) negotiation.cc:107] Waiting for socket to connect
0928 18:12:24.579018 (+    21us) client_negotiation.cc:174] Beginning negotiation
0928 18:12:24.579134 (+   116us) client_negotiation.cc:252] Sending NEGOTIATE NegotiatePB request
0928 18:12:24.870303 (+291169us) negotiation.cc:327] Negotiation complete: Network error: Client connection negotiation failed: client connection to 0.0.0.0:36665: BlockingRecv error: recv error from unknown peer: Transport endpoint is not connected (error 107)
Metrics: {"client-negotiator.queue_time_us":59}
W20260928 18:12:24.871172   880 negotiation.cc:337] Failed RPC negotiation. Trace:
0928 18:12:24.584553 (+     0us) reactor.cc:625] Submitting negotiation task for client connection to 0.0.0.0:36665 (local address 127.0.0.1:50786)
0928 18:12:24.584745 (+   192us) negotiation.cc:107] Waiting for socket to connect
0928 18:12:24.584760 (+    15us) client_negotiation.cc:174] Beginning negotiation
0928 18:12:24.584864 (+   104us) client_negotiation.cc:252] Sending NEGOTIATE NegotiatePB request
0928 18:12:24.870303 (+285439us) negotiation.cc:327] Negotiation complete: Network error: Client connection negotiation failed: client connection to 0.0.0.0:36665: BlockingRecv error: recv error from unknown peer: Transport endpoint is not connected (error 107)
Metrics: {"client-negotiator.queue_time_us":68}
W20260928 18:12:24.873173   871 negotiation.cc:337] Failed RPC negotiation. Trace:
0928 18:12:24.581709 (+     0us) reactor.cc:625] Submitting negotiation task for client connection to 0.0.0.0:36665 (local address 127.0.0.1:50778)
0928 18:12:24.581907 (+   198us) negotiation.cc:107] Waiting for socket to connect
0928 18:12:24.581926 (+    19us) client_negotiation.cc:174] Beginning negotiation
0928 18:12:24.582051 (+   125us) client_negotiation.cc:252] Sending NEGOTIATE NegotiatePB request
0928 18:12:24.870303 (+288252us) negotiation.cc:327] Negotiation complete: Network error: Client connection negotiation failed: client connection to 0.0.0.0:36665: BlockingRecv error: recv error from unknown peer: Transport endpoint is not connected (error 107)
Metrics: {"client-negotiator.queue_time_us":60}
W20260928 18:12:24.874599   889 negotiation.cc:337] Failed RPC negotiation. Trace:
0928 18:12:24.587383 (+     0us) reactor.cc:625] Submitting negotiation task for client connection to 0.0.0.0:36665 (local address 127.0.0.1:50788)
0928 18:12:24.587561 (+   178us) negotiation.cc:107] Waiting for socket to connect
0928 18:12:24.587579 (+    18us) client_negotiation.cc:174] Beginning negotiation
0928 18:12:24.587693 (+   114us) client_negotiation.cc:252] Sending NEGOTIATE NegotiatePB request
0928 18:12:24.871035 (+283342us) negotiation.cc:327] Negotiation complete: Network error: Client connection negotiation failed: client connection to 0.0.0.0:36665: BlockingRecv error: recv error from unknown peer: Transport endpoint is not connected (error 107)
Metrics: {"client-negotiator.queue_time_us":55}
[       OK ] Parameters/TestRpcSocketTxRxQueue.OverCapacity/0 (1082 ms)
[----------] 1 test from Parameters/TestRpcSocketTxRxQueue (1082 ms total)

[----------] Global test environment tear-down
[==========] 21 tests from 2 test suites ran. (51188 ms total)
[  PASSED  ] 20 tests.
[  FAILED  ] 1 test, listed below:
[  FAILED  ] Parameters/TestRpc.TestCallWithChainCertAndChainCA/SSL_TCP, where GetParam() = (true, false)

 1 FAILED TEST