Diagnosed failure

Parameters/TestRpc.TestCallWithChainCertAndChainCA/SSL_UnixSocket: /data0/somelongdirectorytoavoidrpathissues/src/kudu/src/kudu/rpc/rpc-test.cc:270: Failure
Failed
Bad status: Runtime error: could not verify certificate chain (error with cert: subject=CN = localhost, ST = sadfjas, C = AS, emailAddress = sdflkdsajf, O = lskdfjlsad, OU = sldfkja, issuer=C = AS, ST = ASDfkjdhf, L = lskdjf, O = saldfja, OU = skdjf, CN = localhost, emailAddress = sadjflkadsj): : certificate has expired
Google Test trace:
/data0/somelongdirectorytoavoidrpathissues/src/kudu/src/kudu/rpc/rpc-test.cc:267: Connecting to unix:/tmp/dist-test-taskesLttF/test-tmp/rpc-test-1e7ac7c9635645e1985e37e354ff0a14.sock
I20260927 03:54:12.309508  8549 test_util.cc:175] -----------------------------------------------
I20260927 03:54:12.309553  8549 test_util.cc:176] Had fatal failures, leaving test files at /tmp/dist-test-taskesLttF/test-tmp/rpc-test.6.Parameters_TestRpc.TestCallWithChainCertAndChainCA_SSL_UnixSocket.1790481252260518-8549-0

Full log

Note: This is test shard 7 of 8.
[==========] Running 21 tests from 2 test suites.
[----------] Global test environment set-up.
[----------] 20 tests from Parameters/TestRpc
[ RUN      ] Parameters/TestRpc.TestMessengerCreateDestroy/SSL_UnixSocket
WARNING: Logging before InitGoogleLogging() is written to STDERR
I20260927 03:54:12.279031  8549 rpc-test.cc:169] started messenger TestCreateDestroy
[       OK ] Parameters/TestRpc.TestMessengerCreateDestroy/SSL_UnixSocket (16 ms)
[ RUN      ] Parameters/TestRpc.TestNegotiationDeadlock/SSL_UnixSocket
I20260927 03:54:12.287837  8569 acceptor_pool.cc:254] collecting diagnostics on the listening RPC socket unix:/tmp/dist-test-taskesLttF/test-tmp/rpc-test-bf65e9ef9ad948adaa9566119cf3563f.sock every 8 connection(s)
I20260927 03:54:12.287868  8570 acceptor_pool.cc:254] collecting diagnostics on the listening RPC socket unix:/tmp/dist-test-taskesLttF/test-tmp/rpc-test-bf65e9ef9ad948adaa9566119cf3563f.sock every 8 connection(s)
[       OK ] Parameters/TestRpc.TestNegotiationDeadlock/SSL_UnixSocket (13 ms)
[ RUN      ] Parameters/TestRpc.TestCallWithChainCertAndChainCA/SSL_UnixSocket
I20260927 03:54:12.306003  8585 acceptor_pool.cc:254] collecting diagnostics on the listening RPC socket unix:/tmp/dist-test-taskesLttF/test-tmp/rpc-test-1e7ac7c9635645e1985e37e354ff0a14.sock every 8 connection(s)
I20260927 03:54:12.306030  8586 acceptor_pool.cc:254] collecting diagnostics on the listening RPC socket unix:/tmp/dist-test-taskesLttF/test-tmp/rpc-test-1e7ac7c9635645e1985e37e354ff0a14.sock every 8 connection(s)
/data0/somelongdirectorytoavoidrpathissues/src/kudu/src/kudu/rpc/rpc-test.cc:270: Failure
Failed
Bad status: Runtime error: could not verify certificate chain (error with cert: subject=CN = localhost, ST = sadfjas, C = AS, emailAddress = sdflkdsajf, O = lskdfjlsad, OU = sldfkja, issuer=C = AS, ST = ASDfkjdhf, L = lskdjf, O = saldfja, OU = skdjf, CN = localhost, emailAddress = sadjflkadsj): : certificate has expired
Google Test trace:
/data0/somelongdirectorytoavoidrpathissues/src/kudu/src/kudu/rpc/rpc-test.cc:267: Connecting to unix:/tmp/dist-test-taskesLttF/test-tmp/rpc-test-1e7ac7c9635645e1985e37e354ff0a14.sock
I20260927 03:54:12.309508  8549 test_util.cc:175] -----------------------------------------------
I20260927 03:54:12.309553  8549 test_util.cc:176] Had fatal failures, leaving test files at /tmp/dist-test-taskesLttF/test-tmp/rpc-test.6.Parameters_TestRpc.TestCallWithChainCertAndChainCA_SSL_UnixSocket.1790481252260518-8549-0
[  FAILED  ] Parameters/TestRpc.TestCallWithChainCertAndChainCA/SSL_UnixSocket, where GetParam() = (true, true) (15 ms)
[ RUN      ] Parameters/TestRpc.TestCallWithPasswordProtectedKey/SSL_UnixSocket
I20260927 03:54:12.316534  8610 acceptor_pool.cc:254] collecting diagnostics on the listening RPC socket unix:/tmp/dist-test-taskesLttF/test-tmp/rpc-test-c69cefffb468426c8a6bc5c0069a130d.sock every 8 connection(s)
I20260927 03:54:12.316598  8611 acceptor_pool.cc:254] collecting diagnostics on the listening RPC socket unix:/tmp/dist-test-taskesLttF/test-tmp/rpc-test-c69cefffb468426c8a6bc5c0069a130d.sock every 8 connection(s)
W20260927 03:54:12.326538  8607 connection.cc:196] Error closing socket: Network error: TlsSocket::Close: Broken pipe
[       OK ] Parameters/TestRpc.TestCallWithPasswordProtectedKey/SSL_UnixSocket (18 ms)
[ RUN      ] Parameters/TestRpc.TestCallToBadServer/SSL_UnixSocket
I20260927 03:54:12.346963  8549 rpc-test.cc:394] Status: Network error: Client connection negotiation failed: client connection to 0.0.0.0:0: connect: Connection refused (error 111)
I20260927 03:54:12.347177  8549 rpc-test.cc:394] Status: Network error: Client connection negotiation failed: client connection to 0.0.0.0:0: connect: Connection refused (error 111)
I20260927 03:54:12.347316  8549 rpc-test.cc:394] Status: Network error: Client connection negotiation failed: client connection to 0.0.0.0:0: connect: Connection refused (error 111)
I20260927 03:54:12.347448  8549 rpc-test.cc:394] Status: Network error: Client connection negotiation failed: client connection to 0.0.0.0:0: connect: Connection refused (error 111)
I20260927 03:54:12.347579  8549 rpc-test.cc:394] Status: Network error: Client connection negotiation failed: client connection to 0.0.0.0:0: connect: Connection refused (error 111)
[       OK ] Parameters/TestRpc.TestCallToBadServer/SSL_UnixSocket (20 ms)
[ RUN      ] Parameters/TestRpc.TestWrongService/SSL_UnixSocket
I20260927 03:54:12.362435  8645 acceptor_pool.cc:254] collecting diagnostics on the listening RPC socket unix:/tmp/dist-test-taskesLttF/test-tmp/rpc-test-5060fac039324ad08f28995860fd62f1.sock every 8 connection(s)
I20260927 03:54:12.362476  8646 acceptor_pool.cc:254] collecting diagnostics on the listening RPC socket unix:/tmp/dist-test-taskesLttF/test-tmp/rpc-test-5060fac039324ad08f28995860fd62f1.sock every 8 connection(s)
I20260927 03:54:12.371107  8642 messenger.cc:345] service WrongServiceName not registered on TestServer
W20260927 03:54:12.371846  8642 connection.cc:196] Error closing socket: Network error: TlsSocket::Close: Broken pipe
[       OK ] Parameters/TestRpc.TestWrongService/SSL_UnixSocket (24 ms)
[ RUN      ] Parameters/TestRpc.TestConnectionKeepalive/SSL_UnixSocket
I20260927 03:54:12.397571  8668 acceptor_pool.cc:254] collecting diagnostics on the listening RPC socket unix:/tmp/dist-test-taskesLttF/test-tmp/rpc-test-ac6260701993412ea709ed026b65f36e.sock every 8 connection(s)
I20260927 03:54:12.397601  8669 acceptor_pool.cc:254] collecting diagnostics on the listening RPC socket unix:/tmp/dist-test-taskesLttF/test-tmp/rpc-test-ac6260701993412ea709ed026b65f36e.sock every 8 connection(s)
I20260927 03:54:12.397784  8549 rpc-test.cc:488] Connecting to unix:/tmp/dist-test-taskesLttF/test-tmp/rpc-test-ac6260701993412ea709ed026b65f36e.sock
W20260927 03:54:12.873632  8681 connection.cc:196] Error closing socket: Network error: TlsSocket::Close: Broken pipe
[       OK ] Parameters/TestRpc.TestConnectionKeepalive/SSL_UnixSocket (1045 ms)
[ RUN      ] Parameters/TestRpc.TestClientConnectionMetrics/SSL_UnixSocket
I20260927 03:54:13.438916  8693 acceptor_pool.cc:254] collecting diagnostics on the listening RPC socket unix:/tmp/dist-test-taskesLttF/test-tmp/rpc-test-746a22190c3f4704af182317820538eb.sock every 8 connection(s)
I20260927 03:54:13.438948  8694 acceptor_pool.cc:254] collecting diagnostics on the listening RPC socket unix:/tmp/dist-test-taskesLttF/test-tmp/rpc-test-746a22190c3f4704af182317820538eb.sock every 8 connection(s)
I20260927 03:54:13.439073  8549 rpc-test.cc:569] Connecting to unix:/tmp/dist-test-taskesLttF/test-tmp/rpc-test-746a22190c3f4704af182317820538eb.sock
W20260927 03:54:21.385151  8690 connection.cc:196] Error closing socket: Network error: TlsSocket::Close: Broken pipe
[       OK ] Parameters/TestRpc.TestClientConnectionMetrics/SSL_UnixSocket (7967 ms)
[ RUN      ] Parameters/TestRpc.TestCredentialsPolicy/SSL_UnixSocket
I20260927 03:54:21.399034  8716 acceptor_pool.cc:254] collecting diagnostics on the listening RPC socket unix:/tmp/dist-test-taskesLttF/test-tmp/rpc-test-5d750b51d554400da57f12f225d9dd37.sock every 8 connection(s)
I20260927 03:54:21.399080  8717 acceptor_pool.cc:254] collecting diagnostics on the listening RPC socket unix:/tmp/dist-test-taskesLttF/test-tmp/rpc-test-5d750b51d554400da57f12f225d9dd37.sock every 8 connection(s)
I20260927 03:54:21.399266  8549 rpc-test.cc:700] Connecting to unix:/tmp/dist-test-taskesLttF/test-tmp/rpc-test-5d750b51d554400da57f12f225d9dd37.sock
W20260927 03:54:21.421049  8715 connection.cc:196] Error closing socket: Network error: TlsSocket::Close: Broken pipe
W20260927 03:54:21.424094  8715 connection.cc:196] Error closing socket: Network error: TlsSocket::Close: Broken pipe
[       OK ] Parameters/TestRpc.TestCredentialsPolicy/SSL_UnixSocket (38 ms)
[ RUN      ] Parameters/TestRpc.TestCallLongerThanKeepalive/SSL_UnixSocket
I20260927 03:54:21.448498  8741 acceptor_pool.cc:254] collecting diagnostics on the listening RPC socket unix:/tmp/dist-test-taskesLttF/test-tmp/rpc-test-ea6cb487bd6c441c9e2460f36d001516.sock every 8 connection(s)
I20260927 03:54:21.448536  8742 acceptor_pool.cc:254] collecting diagnostics on the listening RPC socket unix:/tmp/dist-test-taskesLttF/test-tmp/rpc-test-ea6cb487bd6c441c9e2460f36d001516.sock every 8 connection(s)
I20260927 03:54:21.461707  8745 rpc-test-base.h:222] got call: sleep_micros: 3000000 deferred: true
I20260927 03:54:24.462350  8745 rpcz_store.cc:275] Call kudu.rpc.GenericCalculatorService.Sleep from unix:<unnamed> (request call id 0) took 3000 ms. Trace:
I20260927 03:54:24.462450  8745 rpcz_store.cc:276] 0927 03:54:21.461646 (+     0us) service_pool.cc:170] Inserting onto call queue
0927 03:54:21.461664 (+    18us) service_pool.cc:227] Handling call
0927 03:54:24.462335 (+3000671us) inbound_call.cc:173] Queueing success response
Metrics: {}
[       OK ] Parameters/TestRpc.TestCallLongerThanKeepalive/SSL_UnixSocket (3039 ms)
[ RUN      ] Parameters/TestRpc.TestRpcSidecar/SSL_UnixSocket
I20260927 03:54:24.478713  8766 acceptor_pool.cc:254] collecting diagnostics on the listening RPC socket unix:/tmp/dist-test-taskesLttF/test-tmp/rpc-test-2f94c241187949a6b9d620b8a78137a9.sock every 8 connection(s)
I20260927 03:54:24.478737  8767 acceptor_pool.cc:254] collecting diagnostics on the listening RPC socket unix:/tmp/dist-test-taskesLttF/test-tmp/rpc-test-2f94c241187949a6b9d620b8a78137a9.sock every 8 connection(s)
W20260927 03:54:24.530133  8763 connection.cc:196] Error closing socket: Network error: TlsSocket::Close: Broken pipe
[       OK ] Parameters/TestRpc.TestRpcSidecar/SSL_UnixSocket (66 ms)
[ RUN      ] Parameters/TestRpc.TestRpcSidecarLimits/SSL_UnixSocket
I20260927 03:54:26.179893  8791 acceptor_pool.cc:254] collecting diagnostics on the listening RPC socket unix:/tmp/dist-test-taskesLttF/test-tmp/rpc-test-e3a89682b7f24abd8de2abea8b81304e.sock every 8 connection(s)
I20260927 03:54:26.179908  8792 acceptor_pool.cc:254] collecting diagnostics on the listening RPC socket unix:/tmp/dist-test-taskesLttF/test-tmp/rpc-test-e3a89682b7f24abd8de2abea8b81304e.sock every 8 connection(s)
W20260927 03:54:26.196101  8549 serialization.cc:72] Serialized kudu.rpc_test.PushStringsRequestPB (2147483654 bytes) is larger than the maximum configured RPC message size (52428800 bytes). Sending anyway, but peer may reject the data.
W20260927 03:54:26.199026  8788 connection.cc:535] server connection from unix:<unnamed> recv error: Network error: RPC frame had a length of 2147483714, but we only support messages up to 52428800 bytes long.
W20260927 03:54:26.199090  8788 connection.cc:158] shutting down server connection from unix:<unnamed> with pending inbound data: 4/2147483714 bytes received; last active 0 ns ago: status Network error: RPC frame had a length of 2147483714, but we only support messages up to 52428800 bytes long.
W20260927 03:54:26.199224  8804 connection.cc:698] client connection to unix:/tmp/dist-test-taskesLttF/test-tmp/rpc-test-e3a89682b7f24abd8de2abea8b81304e.sock send error: Network error: failed to write to TLS socket: Broken pipe
W20260927 03:54:26.199325  8804 connection.cc:196] Error closing socket: Network error: TlsSocket::Close: Success
I20260927 03:54:26.220731  8816 acceptor_pool.cc:254] collecting diagnostics on the listening RPC socket unix:/tmp/dist-test-taskesLttF/test-tmp/rpc-test-e3a89682b7f24abd8de2abea8b81304e.sock every 8 connection(s)
I20260927 03:54:26.220752  8817 acceptor_pool.cc:254] collecting diagnostics on the listening RPC socket unix:/tmp/dist-test-taskesLttF/test-tmp/rpc-test-e3a89682b7f24abd8de2abea8b81304e.sock every 8 connection(s)
W20260927 03:54:30.535190  8813 connection.cc:577] server connection from unix:<unnamed>: received bad data: 'Corruption: Invalid packet: message had a length of 2147483710, but we only support messages up to 2147483647 bytes
'
W20260927 03:54:30.535465  8829 connection.cc:196] Error closing socket: Network error: TlsSocket::Close: Broken pipe
[       OK ] Parameters/TestRpc.TestRpcSidecarLimits/SSL_UnixSocket (6006 ms)
[ RUN      ] Parameters/TestRpc.TestCallTimeoutDoesntAffectNegotiation/SSL_UnixSocket
I20260927 03:54:30.560828  8841 acceptor_pool.cc:254] collecting diagnostics on the listening RPC socket unix:/tmp/dist-test-taskesLttF/test-tmp/rpc-test-f959a74b5c794aae83679af45859c50d.sock every 8 connection(s)
I20260927 03:54:30.560880  8842 acceptor_pool.cc:254] collecting diagnostics on the listening RPC socket unix:/tmp/dist-test-taskesLttF/test-tmp/rpc-test-f959a74b5c794aae83679af45859c50d.sock every 8 connection(s)
W20260927 03:54:30.593430  8837 negotiation.cc:266] Injecting 500ms delay in negotiation
I20260927 03:54:30.643606  8549 rpc-test-base.h:595] status: Timed out: connection negotiation to unix:/tmp/dist-test-taskesLttF/test-tmp/rpc-test-f959a74b5c794aae83679af45859c50d.sock for RPC Sleep timed out after 0.050s (ON_OUTBOUND_QUEUE), seconds elapsed: 0.050446
W20260927 03:54:31.097071  8838 connection.cc:196] Error closing socket: Network error: TlsSocket::Close: Broken pipe
[       OK ] Parameters/TestRpc.TestCallTimeoutDoesntAffectNegotiation/SSL_UnixSocket (561 ms)
[ RUN      ] Parameters/TestRpc.TestRpcHandlerLatencyMetric/SSL_UnixSocket
I20260927 03:54:31.108984  8866 acceptor_pool.cc:254] collecting diagnostics on the listening RPC socket unix:/tmp/dist-test-taskesLttF/test-tmp/rpc-test-bb858e37f5c545148177211ad7aaf80b.sock every 8 connection(s)
I20260927 03:54:31.109026  8867 acceptor_pool.cc:254] collecting diagnostics on the listening RPC socket unix:/tmp/dist-test-taskesLttF/test-tmp/rpc-test-bb858e37f5c545148177211ad7aaf80b.sock every 8 connection(s)
I20260927 03:54:31.141870  8549 rpc-test.cc:1236] Sleep() min lat: 20341
I20260927 03:54:31.141935  8549 rpc-test.cc:1237] Sleep() mean lat: 20341
I20260927 03:54:31.141959  8549 rpc-test.cc:1238] Sleep() max lat: 20341
I20260927 03:54:31.141971  8549 rpc-test.cc:1239] Sleep() #calls: 1
[       OK ] Parameters/TestRpc.TestRpcHandlerLatencyMetric/SSL_UnixSocket (44 ms)
[ RUN      ] Parameters/TestRpc.TimedOutOnResponseMetricServiceQueue/SSL_UnixSocket
I20260927 03:54:31.147490  8892 acceptor_pool.cc:254] collecting diagnostics on the listening RPC socket unix:/tmp/dist-test-taskesLttF/test-tmp/rpc-test-9185c70e3d74421d899a95b83d69b861.sock every 8 connection(s)
I20260927 03:54:31.147531  8893 acceptor_pool.cc:254] collecting diagnostics on the listening RPC socket unix:/tmp/dist-test-taskesLttF/test-tmp/rpc-test-9185c70e3d74421d899a95b83d69b861.sock every 8 connection(s)
W20260927 03:54:31.200031  8894 rpcz_store.cc:267] Call kudu.rpc_test.CalculatorService.Sleep from unix:<unnamed> (request call id 2) took 20 ms (client timeout 20 ms). Trace:
W20260927 03:54:31.200120  8894 rpcz_store.cc:269] 0927 03:54:31.179835 (+     0us) service_pool.cc:170] Inserting onto call queue
0927 03:54:31.200005 (+ 20170us) service_pool.cc:214] Skipping call since client already timed out
0927 03:54:31.200015 (+    10us) inbound_call.cc:173] Queueing failure response
Metrics: {}
[       OK ] Parameters/TestRpc.TimedOutOnResponseMetricServiceQueue/SSL_UnixSocket (58 ms)
[ RUN      ] Parameters/TestRpc.RpcPendingConnectionsMetric/SSL_UnixSocket
I20260927 03:54:31.203060  8915 acceptor_pool.cc:254] collecting diagnostics on the listening RPC socket 0.0.0.0:42367 every 8 connection(s)
I20260927 03:54:31.203109  8916 acceptor_pool.cc:254] collecting diagnostics on the listening RPC socket 0.0.0.0:42367 every 8 connection(s)
W20260927 03:54:31.203612  8911 negotiation.cc:337] Failed RPC negotiation. Trace:
0927 03:54:31.203459 (+     0us) reactor.cc:625] Submitting negotiation task for server connection from 127.0.0.1:39300 (local address 127.0.0.1:42367)
0927 03:54:31.203497 (+    38us) server_negotiation.cc:206] Beginning negotiation
0927 03:54:31.203498 (+     1us) server_negotiation.cc:399] Waiting for connection header
0927 03:54:31.203566 (+    68us) negotiation.cc:327] Negotiation complete: Network error: Server connection negotiation failed: server connection from 127.0.0.1:39300: BlockingRecv error: recv got EOF from 127.0.0.1:39300 (error 108)
Metrics: {"server-negotiator.queue_time_us":13}
[       OK ] Parameters/TestRpc.RpcPendingConnectionsMetric/SSL_UnixSocket (12 ms)
[ RUN      ] Parameters/TestRpc.TestRpcContextClientDeadline/SSL_UnixSocket
I20260927 03:54:31.227888  8931 acceptor_pool.cc:254] collecting diagnostics on the listening RPC socket unix:/tmp/dist-test-taskesLttF/test-tmp/rpc-test-12a5a0417f744c2eaf973fd3c9eeffbd.sock every 8 connection(s)
I20260927 03:54:31.227926  8932 acceptor_pool.cc:254] collecting diagnostics on the listening RPC socket unix:/tmp/dist-test-taskesLttF/test-tmp/rpc-test-12a5a0417f744c2eaf973fd3c9eeffbd.sock every 8 connection(s)
[       OK ] Parameters/TestRpc.TestRpcContextClientDeadline/SSL_UnixSocket (63 ms)
[ RUN      ] Parameters/TestRpc.TestApplicationFeatureFlagUnsupportedServer/SSL_UnixSocket
I20260927 03:54:31.287865  8956 acceptor_pool.cc:254] collecting diagnostics on the listening RPC socket unix:/tmp/dist-test-taskesLttF/test-tmp/rpc-test-440cebfc585347349fe7c22073a5bdcc.sock every 8 connection(s)
I20260927 03:54:31.287911  8957 acceptor_pool.cc:254] collecting diagnostics on the listening RPC socket unix:/tmp/dist-test-taskesLttF/test-tmp/rpc-test-440cebfc585347349fe7c22073a5bdcc.sock every 8 connection(s)
[       OK ] Parameters/TestRpc.TestApplicationFeatureFlagUnsupportedServer/SSL_UnixSocket (37 ms)
[ RUN      ] Parameters/TestRpc.TestCancellationAsync/SSL_UnixSocket
I20260927 03:54:31.333297  8981 acceptor_pool.cc:254] collecting diagnostics on the listening RPC socket unix:/tmp/dist-test-taskesLttF/test-tmp/rpc-test-62b78de6e2f4420e856f04fa9f8c4732.sock every 8 connection(s)
I20260927 03:54:31.333346  8982 acceptor_pool.cc:254] collecting diagnostics on the listening RPC socket unix:/tmp/dist-test-taskesLttF/test-tmp/rpc-test-62b78de6e2f4420e856f04fa9f8c4732.sock every 8 connection(s)
I20260927 03:54:31.333467  8549 rpc-test.cc:1716] Connecting to unix:/tmp/dist-test-taskesLttF/test-tmp/rpc-test-62b78de6e2f4420e856f04fa9f8c4732.sock
I20260927 03:54:31.366842  8549 test_util.cc:268] Using random seed: -400022344
I20260927 03:54:31.379918  8985 rpc-test-base.h:240] got call: sleep_micros: 500 pattern: 4294967295 num_repetitions: 2097152 sidecar_idx: 0
I20260927 03:54:31.391058  8985 rpc-test-base.h:240] got call: sleep_micros: 500 pattern: 4294967295 num_repetitions: 2097152 sidecar_idx: 0
I20260927 03:54:31.400878  8985 rpc-test-base.h:240] got call: sleep_micros: 500 pattern: 4294967295 num_repetitions: 2097152 sidecar_idx: 0
I20260927 03:54:31.410643  8985 rpc-test-base.h:240] got call: sleep_micros: 500 pattern: 4294967295 num_repetitions: 2097152 sidecar_idx: 0
I20260927 03:54:31.420583  8985 rpc-test-base.h:240] got call: sleep_micros: 500 pattern: 4294967295 num_repetitions: 2097152 sidecar_idx: 0
I20260927 03:54:31.430292  8985 rpc-test-base.h:240] got call: sleep_micros: 500 pattern: 4294967295 num_repetitions: 2097152 sidecar_idx: 0
I20260927 03:54:31.440042  8985 rpc-test-base.h:240] got call: sleep_micros: 500 pattern: 4294967295 num_repetitions: 2097152 sidecar_idx: 0
I20260927 03:54:31.449636  8985 rpc-test-base.h:240] got call: sleep_micros: 500 pattern: 4294967295 num_repetitions: 2097152 sidecar_idx: 0
W20260927 03:54:31.450778  8978 connection.cc:196] Error closing socket: Network error: TlsSocket::Close: Broken pipe
W20260927 03:54:31.452566  8978 connection.cc:441] server connection from unix:<unnamed> torn down before Call kudu.rpc.GenericCalculatorService.SleepWithSidecar from unix:<unnamed> (request call id 9) could send its response
[       OK ] Parameters/TestRpc.TestCancellationAsync/SSL_UnixSocket (137 ms)
[ RUN      ] Parameters/TestRpc.TestPerformanceBySocketType/SSL_UnixSocket
I20260927 03:54:31.464479  9006 acceptor_pool.cc:254] collecting diagnostics on the listening RPC socket unix:/tmp/dist-test-taskesLttF/test-tmp/rpc-test-fa221fe6627c45de8d326865e550d09e.sock every 8 connection(s)
I20260927 03:54:31.464535  9007 acceptor_pool.cc:254] collecting diagnostics on the listening RPC socket unix:/tmp/dist-test-taskesLttF/test-tmp/rpc-test-fa221fe6627c45de8d326865e550d09e.sock every 8 connection(s)
I20260927 03:54:31.464651  8549 rpc-test.cc:1846] Connecting to unix:/tmp/dist-test-taskesLttF/test-tmp/rpc-test-fa221fe6627c45de8d326865e550d09e.sock
I20260927 03:54:32.575604  8549 rpc-test.cc:1859] Sending 1024MB via ssl-enabled unix socket: real 1.102s	user 1.241s	sys 0.761s
I20260927 03:54:33.713984  8549 rpc-test.cc:1859] Sending 1024MB via ssl-enabled unix socket: real 1.138s	user 1.340s	sys 0.723s
I20260927 03:54:34.860360  8549 rpc-test.cc:1859] Sending 1024MB via ssl-enabled unix socket: real 1.146s	user 1.357s	sys 0.719s
I20260927 03:54:35.991398  8549 rpc-test.cc:1859] Sending 1024MB via ssl-enabled unix socket: real 1.131s	user 1.259s	sys 0.798s
I20260927 03:54:37.071166  8549 rpc-test.cc:1859] Sending 1024MB via ssl-enabled unix socket: real 1.080s	user 1.235s	sys 0.721s
W20260927 03:54:37.071890  9003 connection.cc:196] Error closing socket: Network error: TlsSocket::Close: Broken pipe
[       OK ] Parameters/TestRpc.TestPerformanceBySocketType/SSL_UnixSocket (5619 ms)
[----------] 20 tests from Parameters/TestRpc (24810 ms total)

[----------] 1 test from Parameters/TestRpcSocketTxRxQueue
[ RUN      ] Parameters/TestRpcSocketTxRxQueue.AcceptorRxQueueSizeMetric/0
I20260927 03:54:37.074970  9031 acceptor_pool.cc:254] collecting diagnostics on the listening RPC socket 0.0.0.0:32959 every 1 connection(s)
I20260927 03:54:37.075417  9032 acceptor_pool.cc:254] collecting diagnostics on the listening RPC socket 0.0.0.0:32959 every 1 connection(s)
W20260927 03:54:37.075547  9027 negotiation.cc:337] Failed RPC negotiation. Trace:
0927 03:54:37.075362 (+     0us) reactor.cc:625] Submitting negotiation task for server connection from 127.0.0.1:59616 (local address 127.0.0.1:32959)
0927 03:54:37.075428 (+    66us) server_negotiation.cc:206] Beginning negotiation
0927 03:54:37.075430 (+     2us) server_negotiation.cc:399] Waiting for connection header
0927 03:54:37.075515 (+    85us) negotiation.cc:327] Negotiation complete: Network error: Server connection negotiation failed: server connection from 127.0.0.1:59616: BlockingRecv error: recv got EOF from 127.0.0.1:59616 (error 108)
Metrics: {"server-negotiator.queue_time_us":16}
[       OK ] Parameters/TestRpcSocketTxRxQueue.AcceptorRxQueueSizeMetric/0 (9 ms)
[----------] 1 test from Parameters/TestRpcSocketTxRxQueue (9 ms total)

[----------] Global test environment tear-down
[==========] 21 tests from 2 test suites ran. (24819 ms total)
[  PASSED  ] 20 tests.
[  FAILED  ] 1 test, listed below:
[  FAILED  ] Parameters/TestRpc.TestCallWithChainCertAndChainCA/SSL_UnixSocket, where GetParam() = (true, true)

 1 FAILED TEST