Diagnosed failure

Parameters/TestRpc.TestCallWithChainCertAndChainCA/SSL_TCP: /data0/somelongdirectorytoavoidrpathissues/src/kudu/src/kudu/rpc/rpc-test.cc:270: Failure
Failed
Bad status: Runtime error: could not verify certificate chain (error with cert: subject=CN = localhost, ST = sadfjas, C = AS, emailAddress = sdflkdsajf, O = lskdfjlsad, OU = sldfkja, issuer=C = AS, ST = ASDfkjdhf, L = lskdjf, O = saldfja, OU = skdjf, CN = localhost, emailAddress = sadjflkadsj): : certificate has expired
Google Test trace:
/data0/somelongdirectorytoavoidrpathissues/src/kudu/src/kudu/rpc/rpc-test.cc:267: Connecting to 0.0.0.0:33833
I20260928 11:48:55.688920  6595 test_util.cc:175] -----------------------------------------------
I20260928 11:48:55.689106  6595 test_util.cc:176] Had fatal failures, leaving test files at /tmp/dist-test-taskGd7uaT/test-tmp/rpc-test.5.Parameters_TestRpc.TestCallWithChainCertAndChainCA_SSL_TCP.1790596134316189-6595-0

Full log

Note: This is test shard 6 of 8.
[==========] Running 21 tests from 2 test suites.
[----------] Global test environment set-up.
[----------] 20 tests from Parameters/TestRpc
[ RUN      ] Parameters/TestRpc.TestMessengerCreateDestroy/SSL_TCP
WARNING: Logging before InitGoogleLogging() is written to STDERR
I20260928 11:48:54.413851  6595 rpc-test.cc:169] started messenger TestCreateDestroy
[       OK ] Parameters/TestRpc.TestMessengerCreateDestroy/SSL_TCP (1168 ms)
[ RUN      ] Parameters/TestRpc.TestNegotiationDeadlock/SSL_TCP
I20260928 11:48:55.574811  6617 acceptor_pool.cc:254] collecting diagnostics on the listening RPC socket 0.0.0.0:40735 every 8 connection(s)
I20260928 11:48:55.575832  6618 acceptor_pool.cc:254] collecting diagnostics on the listening RPC socket 0.0.0.0:40735 every 8 connection(s)
[       OK ] Parameters/TestRpc.TestNegotiationDeadlock/SSL_TCP (92 ms)
[ RUN      ] Parameters/TestRpc.TestCallWithChainCertAndChainCA/SSL_TCP
I20260928 11:48:55.659417  6633 acceptor_pool.cc:254] collecting diagnostics on the listening RPC socket 0.0.0.0:33833 every 8 connection(s)
I20260928 11:48:55.661625  6634 acceptor_pool.cc:254] collecting diagnostics on the listening RPC socket 0.0.0.0:33833 every 8 connection(s)
/data0/somelongdirectorytoavoidrpathissues/src/kudu/src/kudu/rpc/rpc-test.cc:270: Failure
Failed
Bad status: Runtime error: could not verify certificate chain (error with cert: subject=CN = localhost, ST = sadfjas, C = AS, emailAddress = sdflkdsajf, O = lskdfjlsad, OU = sldfkja, issuer=C = AS, ST = ASDfkjdhf, L = lskdjf, O = saldfja, OU = skdjf, CN = localhost, emailAddress = sadjflkadsj): : certificate has expired
Google Test trace:
/data0/somelongdirectorytoavoidrpathissues/src/kudu/src/kudu/rpc/rpc-test.cc:267: Connecting to 0.0.0.0:33833
I20260928 11:48:55.688920  6595 test_util.cc:175] -----------------------------------------------
I20260928 11:48:55.689106  6595 test_util.cc:176] Had fatal failures, leaving test files at /tmp/dist-test-taskGd7uaT/test-tmp/rpc-test.5.Parameters_TestRpc.TestCallWithChainCertAndChainCA_SSL_TCP.1790596134316189-6595-0
[  FAILED  ] Parameters/TestRpc.TestCallWithChainCertAndChainCA/SSL_TCP, where GetParam() = (true, false) (59 ms)
[ RUN      ] Parameters/TestRpc.TestCallWithPasswordProtectedKey/SSL_TCP
I20260928 11:48:55.718232  6658 acceptor_pool.cc:254] collecting diagnostics on the listening RPC socket 0.0.0.0:40627 every 8 connection(s)
I20260928 11:48:55.719043  6659 acceptor_pool.cc:254] collecting diagnostics on the listening RPC socket 0.0.0.0:40627 every 8 connection(s)
[       OK ] Parameters/TestRpc.TestCallWithPasswordProtectedKey/SSL_TCP (78 ms)
[ RUN      ] Parameters/TestRpc.TestCallToBadServer/SSL_TCP
I20260928 11:48:55.794643  6595 rpc-test.cc:394] Status: Network error: Client connection negotiation failed: client connection to 0.0.0.0:0: connect: Connection refused (error 111)
I20260928 11:48:55.795979  6595 rpc-test.cc:394] Status: Network error: Client connection negotiation failed: client connection to 0.0.0.0:0: connect: Connection refused (error 111)
I20260928 11:48:55.797284  6595 rpc-test.cc:394] Status: Network error: Client connection negotiation failed: client connection to 0.0.0.0:0: connect: Connection refused (error 111)
I20260928 11:48:55.798590  6595 rpc-test.cc:394] Status: Network error: Client connection negotiation failed: client connection to 0.0.0.0:0: connect: Connection refused (error 111)
I20260928 11:48:55.799855  6595 rpc-test.cc:394] Status: Network error: Client connection negotiation failed: client connection to 0.0.0.0:0: connect: Connection refused (error 111)
[       OK ] Parameters/TestRpc.TestCallToBadServer/SSL_TCP (35 ms)
[ RUN      ] Parameters/TestRpc.TestWrongService/SSL_TCP
I20260928 11:48:55.843890  6693 acceptor_pool.cc:254] collecting diagnostics on the listening RPC socket 0.0.0.0:42785 every 8 connection(s)
I20260928 11:48:55.844683  6694 acceptor_pool.cc:254] collecting diagnostics on the listening RPC socket 0.0.0.0:42785 every 8 connection(s)
I20260928 11:48:55.874804  6692 messenger.cc:345] service WrongServiceName not registered on TestServer
[       OK ] Parameters/TestRpc.TestWrongService/SSL_TCP (80 ms)
[ RUN      ] Parameters/TestRpc.TestConnectionKeepalive/SSL_TCP
I20260928 11:48:55.929666  6716 acceptor_pool.cc:254] collecting diagnostics on the listening RPC socket 0.0.0.0:45387 every 8 connection(s)
I20260928 11:48:55.930498  6717 acceptor_pool.cc:254] collecting diagnostics on the listening RPC socket 0.0.0.0:45387 every 8 connection(s)
I20260928 11:48:55.933606  6595 rpc-test.cc:488] Connecting to 0.0.0.0:45387
[       OK ] Parameters/TestRpc.TestConnectionKeepalive/SSL_TCP (1091 ms)
[ RUN      ] Parameters/TestRpc.TestClientConnectionMetrics/SSL_TCP
I20260928 11:48:57.008317  6741 acceptor_pool.cc:254] collecting diagnostics on the listening RPC socket 0.0.0.0:43365 every 8 connection(s)
I20260928 11:48:57.009078  6742 acceptor_pool.cc:254] collecting diagnostics on the listening RPC socket 0.0.0.0:43365 every 8 connection(s)
I20260928 11:48:57.012286  6595 rpc-test.cc:569] Connecting to 0.0.0.0:43365
[       OK ] Parameters/TestRpc.TestClientConnectionMetrics/SSL_TCP (118570 ms)
[ RUN      ] Parameters/TestRpc.TestCredentialsPolicy/SSL_TCP
I20260928 11:50:55.580945  6776 acceptor_pool.cc:254] collecting diagnostics on the listening RPC socket 0.0.0.0:46735 every 8 connection(s)
I20260928 11:50:55.581770  6777 acceptor_pool.cc:254] collecting diagnostics on the listening RPC socket 0.0.0.0:46735 every 8 connection(s)
I20260928 11:50:55.585194  6595 rpc-test.cc:700] Connecting to 0.0.0.0:46735
[       OK ] Parameters/TestRpc.TestCredentialsPolicy/SSL_TCP (115 ms)
[ RUN      ] Parameters/TestRpc.TestCallLongerThanKeepalive/SSL_TCP
I20260928 11:50:55.699606  6801 acceptor_pool.cc:254] collecting diagnostics on the listening RPC socket 0.0.0.0:34997 every 8 connection(s)
I20260928 11:50:55.700390  6802 acceptor_pool.cc:254] collecting diagnostics on the listening RPC socket 0.0.0.0:34997 every 8 connection(s)
I20260928 11:50:55.727731  6805 rpc-test-base.h:222] got call: sleep_micros: 3000000 deferred: true
I20260928 11:50:58.732170  6805 rpcz_store.cc:275] Call kudu.rpc.GenericCalculatorService.Sleep from 127.0.0.1:48382 (request call id 0) took 3004 ms. Trace:
I20260928 11:50:58.732575  6805 rpcz_store.cc:276] 0928 11:50:55.727468 (+     0us) service_pool.cc:170] Inserting onto call queue
0928 11:50:55.727573 (+   105us) service_pool.cc:227] Handling call
0928 11:50:58.732113 (+3004540us) inbound_call.cc:173] Queueing success response
Metrics: {}
[       OK ] Parameters/TestRpc.TestCallLongerThanKeepalive/SSL_TCP (3081 ms)
[ RUN      ] Parameters/TestRpc.TestRpcSidecar/SSL_TCP
I20260928 11:50:58.761854  6826 acceptor_pool.cc:254] collecting diagnostics on the listening RPC socket 0.0.0.0:32873 every 8 connection(s)
I20260928 11:50:58.762709  6827 acceptor_pool.cc:254] collecting diagnostics on the listening RPC socket 0.0.0.0:32873 every 8 connection(s)
[       OK ] Parameters/TestRpc.TestRpcSidecar/SSL_TCP (531 ms)
[ RUN      ] Parameters/TestRpc.TestRpcSidecarLimits/SSL_TCP
I20260928 11:51:16.805482  6853 acceptor_pool.cc:254] collecting diagnostics on the listening RPC socket 0.0.0.0:39891 every 8 connection(s)
I20260928 11:51:16.806351  6854 acceptor_pool.cc:254] collecting diagnostics on the listening RPC socket 0.0.0.0:39891 every 8 connection(s)
W20260928 11:51:16.824705  6595 serialization.cc:72] Serialized kudu.rpc_test.PushStringsRequestPB (2147483654 bytes) is larger than the maximum configured RPC message size (52428800 bytes). Sending anyway, but peer may reject the data.
W20260928 11:51:16.837400  6851 connection.cc:535] server connection from 127.0.0.1:37752 recv error: Network error: RPC frame had a length of 2147483714, but we only support messages up to 52428800 bytes long.
W20260928 11:51:16.837743  6851 connection.cc:158] shutting down server connection from 127.0.0.1:37752 with pending inbound data: 4/2147483714 bytes received; last active 0 ns ago: status Network error: RPC frame had a length of 2147483714, but we only support messages up to 52428800 bytes long.
W20260928 11:51:16.838788  6866 connection.cc:698] client connection to 0.0.0.0:39891 send error: Network error: failed to write to TLS socket: Connection reset by peer
W20260928 11:51:16.839376  6866 connection.cc:196] Error closing socket: Network error: TlsSocket::Close: Success
[       OK ] Parameters/TestRpc.TestRpcSidecarLimits/SSL_TCP (18200 ms)
[ RUN      ] Parameters/TestRpc.TestCallTimeoutDoesntAffectNegotiation/SSL_TCP
I20260928 11:51:17.497740  6878 acceptor_pool.cc:254] collecting diagnostics on the listening RPC socket 0.0.0.0:35647 every 8 connection(s)
I20260928 11:51:17.498574  6879 acceptor_pool.cc:254] collecting diagnostics on the listening RPC socket 0.0.0.0:35647 every 8 connection(s)
W20260928 11:51:17.519208  6874 negotiation.cc:266] Injecting 500ms delay in negotiation
I20260928 11:51:17.569099  6595 rpc-test-base.h:595] status: Timed out: connection negotiation to 0.0.0.0:35647 for RPC Sleep timed out after 0.050s (ON_OUTBOUND_QUEUE), seconds elapsed: 0.0509949
[       OK ] Parameters/TestRpc.TestCallTimeoutDoesntAffectNegotiation/SSL_TCP (562 ms)
[ RUN      ] Parameters/TestRpc.TestRpcHandlerLatencyMetric/SSL_TCP
I20260928 11:51:18.060231  6903 acceptor_pool.cc:254] collecting diagnostics on the listening RPC socket 0.0.0.0:36627 every 8 connection(s)
I20260928 11:51:18.060945  6904 acceptor_pool.cc:254] collecting diagnostics on the listening RPC socket 0.0.0.0:36627 every 8 connection(s)
I20260928 11:51:18.111567  6595 rpc-test.cc:1236] Sleep() min lat: 21686
I20260928 11:51:18.111799  6595 rpc-test.cc:1237] Sleep() mean lat: 21686
I20260928 11:51:18.112007  6595 rpc-test.cc:1238] Sleep() max lat: 21686
I20260928 11:51:18.112162  6595 rpc-test.cc:1239] Sleep() #calls: 1
[       OK ] Parameters/TestRpc.TestRpcHandlerLatencyMetric/SSL_TCP (83 ms)
[ RUN      ] Parameters/TestRpc.TimedOutOnResponseMetricServiceQueue/SSL_TCP
I20260928 11:51:18.144441  6929 acceptor_pool.cc:254] collecting diagnostics on the listening RPC socket 0.0.0.0:35823 every 8 connection(s)
I20260928 11:51:18.145200  6930 acceptor_pool.cc:254] collecting diagnostics on the listening RPC socket 0.0.0.0:35823 every 8 connection(s)
W20260928 11:51:18.219777  6931 rpcz_store.cc:267] Call kudu.rpc_test.CalculatorService.Sleep from 127.0.0.1:52698 (request call id 2) took 20 ms (client timeout 20 ms). Trace:
W20260928 11:51:18.220140  6931 rpcz_store.cc:269] 0928 11:51:18.199241 (+     0us) service_pool.cc:170] Inserting onto call queue
0928 11:51:18.219633 (+ 20392us) service_pool.cc:214] Skipping call since client already timed out
0928 11:51:18.219728 (+    95us) inbound_call.cc:173] Queueing failure response
Metrics: {}
[       OK ] Parameters/TestRpc.TimedOutOnResponseMetricServiceQueue/SSL_TCP (107 ms)
[ RUN      ] Parameters/TestRpc.RpcPendingConnectionsMetric/SSL_TCP
I20260928 11:51:18.238011  6952 acceptor_pool.cc:254] collecting diagnostics on the listening RPC socket 0.0.0.0:33037 every 8 connection(s)
I20260928 11:51:18.238731  6953 acceptor_pool.cc:254] collecting diagnostics on the listening RPC socket 0.0.0.0:33037 every 8 connection(s)
W20260928 11:51:18.243966  6948 negotiation.cc:337] Failed RPC negotiation. Trace:
0928 11:51:18.242703 (+     0us) reactor.cc:625] Submitting negotiation task for server connection from 127.0.0.1:50960 (local address 127.0.0.1:33037)
0928 11:51:18.243126 (+   423us) server_negotiation.cc:206] Beginning negotiation
0928 11:51:18.243147 (+    21us) server_negotiation.cc:399] Waiting for connection header
0928 11:51:18.243386 (+   239us) negotiation.cc:327] Negotiation complete: Network error: Server connection negotiation failed: server connection from 127.0.0.1:50960: BlockingRecv error: recv got EOF from 127.0.0.1:50960 (error 108)
Metrics: {"server-negotiator.queue_time_us":114}
[       OK ] Parameters/TestRpc.RpcPendingConnectionsMetric/SSL_TCP (30 ms)
[ RUN      ] Parameters/TestRpc.TestRpcContextClientDeadline/SSL_TCP
I20260928 11:51:18.293110  6968 acceptor_pool.cc:254] collecting diagnostics on the listening RPC socket 0.0.0.0:45277 every 8 connection(s)
I20260928 11:51:18.293828  6969 acceptor_pool.cc:254] collecting diagnostics on the listening RPC socket 0.0.0.0:45277 every 8 connection(s)
[       OK ] Parameters/TestRpc.TestRpcContextClientDeadline/SSL_TCP (93 ms)
[ RUN      ] Parameters/TestRpc.TestApplicationFeatureFlagUnsupportedServer/SSL_TCP
I20260928 11:51:18.378199  6993 acceptor_pool.cc:254] collecting diagnostics on the listening RPC socket 0.0.0.0:39345 every 8 connection(s)
I20260928 11:51:18.378953  6994 acceptor_pool.cc:254] collecting diagnostics on the listening RPC socket 0.0.0.0:39345 every 8 connection(s)
[       OK ] Parameters/TestRpc.TestApplicationFeatureFlagUnsupportedServer/SSL_TCP (84 ms)
[ RUN      ] Parameters/TestRpc.TestCancellationAsync/SSL_TCP
I20260928 11:51:18.466076  7018 acceptor_pool.cc:254] collecting diagnostics on the listening RPC socket 0.0.0.0:41597 every 8 connection(s)
I20260928 11:51:18.466843  7019 acceptor_pool.cc:254] collecting diagnostics on the listening RPC socket 0.0.0.0:41597 every 8 connection(s)
I20260928 11:51:18.469969  6595 rpc-test.cc:1716] Connecting to 0.0.0.0:41597
I20260928 11:51:18.483552  6595 test_util.cc:268] Using random seed: -1357022646
I20260928 11:51:18.721568  7022 rpc-test-base.h:240] got call: sleep_micros: 500 pattern: 4294967295 num_repetitions: 2097152 sidecar_idx: 0
I20260928 11:51:18.893532  7021 rpc-test-base.h:240] got call: sleep_micros: 500 pattern: 4294967295 num_repetitions: 2097152 sidecar_idx: 0
I20260928 11:51:19.082449  7022 rpc-test-base.h:240] got call: sleep_micros: 500 pattern: 4294967295 num_repetitions: 2097152 sidecar_idx: 0
I20260928 11:51:19.273030  7021 rpc-test-base.h:240] got call: sleep_micros: 500 pattern: 4294967295 num_repetitions: 2097152 sidecar_idx: 0
I20260928 11:51:19.460134  7022 rpc-test-base.h:240] got call: sleep_micros: 500 pattern: 4294967295 num_repetitions: 2097152 sidecar_idx: 0
I20260928 11:51:19.655306  7022 rpc-test-base.h:240] got call: sleep_micros: 500 pattern: 4294967295 num_repetitions: 2097152 sidecar_idx: 0
I20260928 11:51:19.847009  7022 rpc-test-base.h:240] got call: sleep_micros: 500 pattern: 4294967295 num_repetitions: 2097152 sidecar_idx: 0
I20260928 11:51:20.032330  7021 rpc-test-base.h:240] got call: sleep_micros: 500 pattern: 4294967295 num_repetitions: 2097152 sidecar_idx: 0
W20260928 11:51:20.212888  7016 connection.cc:698] server connection from 127.0.0.1:36948 send error: Network error: failed to write to TLS socket: Broken pipe
W20260928 11:51:20.213178  7016 connection.cc:441] server connection from 127.0.0.1:36948 torn down before Call kudu.rpc.GenericCalculatorService.SleepWithSidecar from 127.0.0.1:36948 (request call id 9) could send its response
W20260928 11:51:20.218250  7016 connection.cc:196] Error closing socket: Network error: TlsSocket::Close: Success
W20260928 11:51:20.266193  7016 connection.cc:441] server connection from 127.0.0.1:36948 torn down before Call kudu.rpc.GenericCalculatorService.SleepWithSidecar from 127.0.0.1:36948 (request call id 8) could send its response
[       OK ] Parameters/TestRpc.TestCancellationAsync/SSL_TCP (1839 ms)
[ RUN      ] Parameters/TestRpc.TestPerformanceBySocketType/SSL_TCP
I20260928 11:51:20.363072  7043 acceptor_pool.cc:254] collecting diagnostics on the listening RPC socket 0.0.0.0:35777 every 8 connection(s)
I20260928 11:51:20.363817  7044 acceptor_pool.cc:254] collecting diagnostics on the listening RPC socket 0.0.0.0:35777 every 8 connection(s)
I20260928 11:51:20.366982  6595 rpc-test.cc:1846] Connecting to 0.0.0.0:35777
I20260928 11:51:40.028859  6595 rpc-test.cc:1859] Sending 1024MB via ssl-enabled tcp socket: real 19.644s	user 16.874s	sys 11.073s
I20260928 11:51:59.905920  6595 rpc-test.cc:1859] Sending 1024MB via ssl-enabled tcp socket: real 19.876s	user 17.007s	sys 11.352s
I20260928 11:52:19.941433  6595 rpc-test.cc:1859] Sending 1024MB via ssl-enabled tcp socket: real 20.035s	user 17.281s	sys 11.352s
I20260928 11:52:39.666109  6595 rpc-test.cc:1859] Sending 1024MB via ssl-enabled tcp socket: real 19.724s	user 16.979s	sys 11.155s
I20260928 11:52:59.170848  6595 rpc-test.cc:1859] Sending 1024MB via ssl-enabled tcp socket: real 19.504s	user 16.609s	sys 11.186s
[       OK ] Parameters/TestRpc.TestPerformanceBySocketType/SSL_TCP (98913 ms)
[----------] 20 tests from Parameters/TestRpc (244822 ms total)

[----------] 1 test from Parameters/TestRpcSocketTxRxQueue
[ RUN      ] Parameters/TestRpcSocketTxRxQueue.OverCapacity/0
W20260928 11:52:59.639534  7079 negotiation.cc:337] Failed RPC negotiation. Trace:
0928 11:52:59.212290 (+     0us) reactor.cc:625] Submitting negotiation task for client connection to 0.0.0.0:38459 (local address 127.0.0.1:58206)
0928 11:52:59.212877 (+   587us) negotiation.cc:107] Waiting for socket to connect
0928 11:52:59.212907 (+    30us) client_negotiation.cc:174] Beginning negotiation
0928 11:52:59.213127 (+   220us) client_negotiation.cc:252] Sending NEGOTIATE NegotiatePB request
0928 11:52:59.635415 (+422288us) negotiation.cc:327] Negotiation complete: Network error: Client connection negotiation failed: client connection to 0.0.0.0:38459: BlockingRecv error: recv error from unknown peer: Transport endpoint is not connected (error 107)
Metrics: {"client-negotiator.queue_time_us":170}
W20260928 11:52:59.639858  7097 negotiation.cc:337] Failed RPC negotiation. Trace:
0928 11:52:59.232152 (+     0us) reactor.cc:625] Submitting negotiation task for client connection to 0.0.0.0:38459 (local address 127.0.0.1:58224)
0928 11:52:59.232731 (+   579us) negotiation.cc:107] Waiting for socket to connect
0928 11:52:59.232761 (+    30us) client_negotiation.cc:174] Beginning negotiation
0928 11:52:59.233033 (+   272us) client_negotiation.cc:252] Sending NEGOTIATE NegotiatePB request
0928 11:52:59.635360 (+402327us) negotiation.cc:327] Negotiation complete: Network error: Client connection negotiation failed: client connection to 0.0.0.0:38459: BlockingRecv error: recv error from unknown peer: Transport endpoint is not connected (error 107)
Metrics: {"client-negotiator.queue_time_us":160}
W20260928 11:52:59.639962  7070 negotiation.cc:337] Failed RPC negotiation. Trace:
0928 11:52:59.205221 (+     0us) reactor.cc:625] Submitting negotiation task for client connection to 0.0.0.0:38459 (local address 127.0.0.1:58190)
0928 11:52:59.205940 (+   719us) negotiation.cc:107] Waiting for socket to connect
0928 11:52:59.205979 (+    39us) client_negotiation.cc:174] Beginning negotiation
0928 11:52:59.206493 (+   514us) client_negotiation.cc:252] Sending NEGOTIATE NegotiatePB request
0928 11:52:59.635360 (+428867us) negotiation.cc:327] Negotiation complete: Network error: Client connection negotiation failed: client connection to 0.0.0.0:38459: BlockingRecv error: recv error from unknown peer: Transport endpoint is not connected (error 107)
Metrics: {"client-negotiator.queue_time_us":173}
W20260928 11:52:59.641254  7088 negotiation.cc:337] Failed RPC negotiation. Trace:
0928 11:52:59.219854 (+     0us) reactor.cc:625] Submitting negotiation task for client connection to 0.0.0.0:38459 (local address 127.0.0.1:58214)
0928 11:52:59.220325 (+   471us) negotiation.cc:107] Waiting for socket to connect
0928 11:52:59.220358 (+    33us) client_negotiation.cc:174] Beginning negotiation
0928 11:52:59.220546 (+   188us) client_negotiation.cc:252] Sending NEGOTIATE NegotiatePB request
0928 11:52:59.635493 (+414947us) negotiation.cc:327] Negotiation complete: Network error: Client connection negotiation failed: client connection to 0.0.0.0:38459: BlockingRecv error: recv error from unknown peer: Transport endpoint is not connected (error 107)
Metrics: {"client-negotiator.queue_time_us":116}
W20260928 11:52:59.641511  7106 negotiation.cc:337] Failed RPC negotiation. Trace:
0928 11:52:59.244239 (+     0us) reactor.cc:625] Submitting negotiation task for client connection to 0.0.0.0:38459 (local address 127.0.0.1:58232)
0928 11:52:59.244850 (+   611us) negotiation.cc:107] Waiting for socket to connect
0928 11:52:59.244880 (+    30us) client_negotiation.cc:174] Beginning negotiation
0928 11:52:59.245142 (+   262us) client_negotiation.cc:252] Sending NEGOTIATE NegotiatePB request
0928 11:52:59.639523 (+394381us) negotiation.cc:327] Negotiation complete: Network error: Client connection negotiation failed: client connection to 0.0.0.0:38459: BlockingRecv error: recv error from unknown peer: Transport endpoint is not connected (error 107)
Metrics: {"client-negotiator.queue_time_us":163}
W20260928 11:52:59.641937  7115 negotiation.cc:337] Failed RPC negotiation. Trace:
0928 11:52:59.256200 (+     0us) reactor.cc:625] Submitting negotiation task for client connection to 0.0.0.0:38459 (local address 127.0.0.1:58246)
0928 11:52:59.256804 (+   604us) negotiation.cc:107] Waiting for socket to connect
0928 11:52:59.256834 (+    30us) client_negotiation.cc:174] Beginning negotiation
0928 11:52:59.257103 (+   269us) client_negotiation.cc:252] Sending NEGOTIATE NegotiatePB request
0928 11:52:59.637432 (+380329us) negotiation.cc:327] Negotiation complete: Network error: Client connection negotiation failed: client connection to 0.0.0.0:38459: BlockingRecv error: recv error from unknown peer: Transport endpoint is not connected (error 107)
Metrics: {"client-negotiator.queue_time_us":145}
[       OK ] Parameters/TestRpcSocketTxRxQueue.OverCapacity/0 (1246 ms)
[----------] 1 test from Parameters/TestRpcSocketTxRxQueue (1246 ms total)

[----------] Global test environment tear-down
[==========] 21 tests from 2 test suites ran. (246069 ms total)
[  PASSED  ] 20 tests.
[  FAILED  ] 1 test, listed below:
[  FAILED  ] Parameters/TestRpc.TestCallWithChainCertAndChainCA/SSL_TCP, where GetParam() = (true, false)

 1 FAILED TEST