Diagnosed failure

Parameters/TestRpc.TestCallWithChainCertAndChainCA/SSL_TCP: /data0/somelongdirectorytoavoidrpathissues/src/kudu/src/kudu/rpc/rpc-test.cc:270: Failure
Failed
Bad status: Runtime error: could not verify certificate chain (error with cert: subject=CN = localhost, ST = sadfjas, C = AS, emailAddress = sdflkdsajf, O = lskdfjlsad, OU = sldfkja, issuer=C = AS, ST = ASDfkjdhf, L = lskdjf, O = saldfja, OU = skdjf, CN = localhost, emailAddress = sadjflkadsj): : certificate has expired
Google Test trace:
/data0/somelongdirectorytoavoidrpathissues/src/kudu/src/kudu/rpc/rpc-test.cc:267: Connecting to 0.0.0.0:33543
I20260924 16:00:12.430204 29006 test_util.cc:175] -----------------------------------------------
I20260924 16:00:12.430311 29006 test_util.cc:176] Had fatal failures, leaving test files at /tmp/dist-test-taskBeceU5/test-tmp/rpc-test.5.Parameters_TestRpc.TestCallWithChainCertAndChainCA_SSL_TCP.1790265612301850-29006-0

Full log

Note: This is test shard 6 of 8.
[==========] Running 21 tests from 2 test suites.
[----------] Global test environment set-up.
[----------] 20 tests from Parameters/TestRpc
[ RUN      ] Parameters/TestRpc.TestMessengerCreateDestroy/SSL_TCP
WARNING: Logging before InitGoogleLogging() is written to STDERR
I20260924 16:00:12.351662 29006 rpc-test.cc:169] started messenger TestCreateDestroy
[       OK ] Parameters/TestRpc.TestMessengerCreateDestroy/SSL_TCP (32 ms)
[ RUN      ] Parameters/TestRpc.TestNegotiationDeadlock/SSL_TCP
I20260924 16:00:12.379456 29026 acceptor_pool.cc:254] collecting diagnostics on the listening RPC socket 0.0.0.0:35807 every 8 connection(s)
I20260924 16:00:12.379762 29027 acceptor_pool.cc:254] collecting diagnostics on the listening RPC socket 0.0.0.0:35807 every 8 connection(s)
[       OK ] Parameters/TestRpc.TestNegotiationDeadlock/SSL_TCP (46 ms)
[ RUN      ] Parameters/TestRpc.TestCallWithChainCertAndChainCA/SSL_TCP
I20260924 16:00:12.418026 29043 acceptor_pool.cc:254] collecting diagnostics on the listening RPC socket 0.0.0.0:33543 every 8 connection(s)
I20260924 16:00:12.418329 29044 acceptor_pool.cc:254] collecting diagnostics on the listening RPC socket 0.0.0.0:33543 every 8 connection(s)
/data0/somelongdirectorytoavoidrpathissues/src/kudu/src/kudu/rpc/rpc-test.cc:270: Failure
Failed
Bad status: Runtime error: could not verify certificate chain (error with cert: subject=CN = localhost, ST = sadfjas, C = AS, emailAddress = sdflkdsajf, O = lskdfjlsad, OU = sldfkja, issuer=C = AS, ST = ASDfkjdhf, L = lskdjf, O = saldfja, OU = skdjf, CN = localhost, emailAddress = sadjflkadsj): : certificate has expired
Google Test trace:
/data0/somelongdirectorytoavoidrpathissues/src/kudu/src/kudu/rpc/rpc-test.cc:267: Connecting to 0.0.0.0:33543
I20260924 16:00:12.430204 29006 test_util.cc:175] -----------------------------------------------
I20260924 16:00:12.430311 29006 test_util.cc:176] Had fatal failures, leaving test files at /tmp/dist-test-taskBeceU5/test-tmp/rpc-test.5.Parameters_TestRpc.TestCallWithChainCertAndChainCA_SSL_TCP.1790265612301850-29006-0
[  FAILED  ] Parameters/TestRpc.TestCallWithChainCertAndChainCA/SSL_TCP, where GetParam() = (true, false) (28 ms)
[ RUN      ] Parameters/TestRpc.TestCallWithPasswordProtectedKey/SSL_TCP
I20260924 16:00:12.455956 29068 acceptor_pool.cc:254] collecting diagnostics on the listening RPC socket 0.0.0.0:34033 every 8 connection(s)
I20260924 16:00:12.456259 29069 acceptor_pool.cc:254] collecting diagnostics on the listening RPC socket 0.0.0.0:34033 every 8 connection(s)
[       OK ] Parameters/TestRpc.TestCallWithPasswordProtectedKey/SSL_TCP (63 ms)
[ RUN      ] Parameters/TestRpc.TestCallToBadServer/SSL_TCP
I20260924 16:00:12.529209 29006 rpc-test.cc:394] Status: Network error: Client connection negotiation failed: client connection to 0.0.0.0:0: connect: Connection refused (error 111)
I20260924 16:00:12.530097 29006 rpc-test.cc:394] Status: Network error: Client connection negotiation failed: client connection to 0.0.0.0:0: connect: Connection refused (error 111)
I20260924 16:00:12.530964 29006 rpc-test.cc:394] Status: Network error: Client connection negotiation failed: client connection to 0.0.0.0:0: connect: Connection refused (error 111)
I20260924 16:00:12.531664 29006 rpc-test.cc:394] Status: Network error: Client connection negotiation failed: client connection to 0.0.0.0:0: connect: Connection refused (error 111)
I20260924 16:00:12.532332 29006 rpc-test.cc:394] Status: Network error: Client connection negotiation failed: client connection to 0.0.0.0:0: connect: Connection refused (error 111)
[       OK ] Parameters/TestRpc.TestCallToBadServer/SSL_TCP (40 ms)
[ RUN      ] Parameters/TestRpc.TestWrongService/SSL_TCP
I20260924 16:00:12.548460 29104 acceptor_pool.cc:254] collecting diagnostics on the listening RPC socket 0.0.0.0:35009 every 8 connection(s)
I20260924 16:00:12.548724 29105 acceptor_pool.cc:254] collecting diagnostics on the listening RPC socket 0.0.0.0:35009 every 8 connection(s)
I20260924 16:00:12.573745 29103 messenger.cc:345] service WrongServiceName not registered on TestServer
[       OK ] Parameters/TestRpc.TestWrongService/SSL_TCP (44 ms)
[ RUN      ] Parameters/TestRpc.TestConnectionKeepalive/SSL_TCP
I20260924 16:00:12.597445 29127 acceptor_pool.cc:254] collecting diagnostics on the listening RPC socket 0.0.0.0:41151 every 8 connection(s)
I20260924 16:00:12.597738 29128 acceptor_pool.cc:254] collecting diagnostics on the listening RPC socket 0.0.0.0:41151 every 8 connection(s)
I20260924 16:00:12.598841 29006 rpc-test.cc:488] Connecting to 0.0.0.0:41151
[       OK ] Parameters/TestRpc.TestConnectionKeepalive/SSL_TCP (1076 ms)
[ RUN      ] Parameters/TestRpc.TestClientConnectionMetrics/SSL_TCP
I20260924 16:00:13.684778 29152 acceptor_pool.cc:254] collecting diagnostics on the listening RPC socket 0.0.0.0:41667 every 8 connection(s)
I20260924 16:00:13.685103 29153 acceptor_pool.cc:254] collecting diagnostics on the listening RPC socket 0.0.0.0:41667 every 8 connection(s)
I20260924 16:00:13.686154 29006 rpc-test.cc:569] Connecting to 0.0.0.0:41667
[       OK ] Parameters/TestRpc.TestClientConnectionMetrics/SSL_TCP (21164 ms)
[ RUN      ] Parameters/TestRpc.TestCredentialsPolicy/SSL_TCP
I20260924 16:00:34.851526 29177 acceptor_pool.cc:254] collecting diagnostics on the listening RPC socket 0.0.0.0:38417 every 8 connection(s)
I20260924 16:00:34.851850 29178 acceptor_pool.cc:254] collecting diagnostics on the listening RPC socket 0.0.0.0:38417 every 8 connection(s)
I20260924 16:00:34.852851 29006 rpc-test.cc:700] Connecting to 0.0.0.0:38417
[       OK ] Parameters/TestRpc.TestCredentialsPolicy/SSL_TCP (88 ms)
[ RUN      ] Parameters/TestRpc.TestCallLongerThanKeepalive/SSL_TCP
I20260924 16:00:34.927680 29203 acceptor_pool.cc:254] collecting diagnostics on the listening RPC socket 0.0.0.0:32991 every 8 connection(s)
I20260924 16:00:34.927943 29204 acceptor_pool.cc:254] collecting diagnostics on the listening RPC socket 0.0.0.0:32991 every 8 connection(s)
I20260924 16:00:34.962867 29208 rpc-test-base.h:222] got call: sleep_micros: 3000000 deferred: true
I20260924 16:00:37.964759 29208 rpcz_store.cc:275] Call kudu.rpc.GenericCalculatorService.Sleep from 127.0.0.1:60716 (request call id 0) took 3002 ms. Trace:
I20260924 16:00:37.964934 29208 rpcz_store.cc:276] 0924 16:00:34.962719 (+     0us) service_pool.cc:170] Inserting onto call queue
0924 16:00:34.962806 (+    87us) service_pool.cc:227] Handling call
0924 16:00:37.964712 (+3001906us) inbound_call.cc:173] Queueing success response
Metrics: {}
[       OK ] Parameters/TestRpc.TestCallLongerThanKeepalive/SSL_TCP (3064 ms)
[ RUN      ] Parameters/TestRpc.TestRpcSidecar/SSL_TCP
I20260924 16:00:37.993045 29229 acceptor_pool.cc:254] collecting diagnostics on the listening RPC socket 0.0.0.0:35359 every 8 connection(s)
I20260924 16:00:37.993330 29230 acceptor_pool.cc:254] collecting diagnostics on the listening RPC socket 0.0.0.0:35359 every 8 connection(s)
[       OK ] Parameters/TestRpc.TestRpcSidecar/SSL_TCP (142 ms)
[ RUN      ] Parameters/TestRpc.TestRpcSidecarLimits/SSL_TCP
I20260924 16:00:40.422051 29254 acceptor_pool.cc:254] collecting diagnostics on the listening RPC socket 0.0.0.0:33149 every 8 connection(s)
I20260924 16:00:40.422452 29255 acceptor_pool.cc:254] collecting diagnostics on the listening RPC socket 0.0.0.0:33149 every 8 connection(s)
W20260924 16:00:40.435354 29006 serialization.cc:72] Serialized kudu.rpc_test.PushStringsRequestPB (2147483654 bytes) is larger than the maximum configured RPC message size (52428800 bytes). Sending anyway, but peer may reject the data.
W20260924 16:00:40.443634 29253 connection.cc:535] server connection from 127.0.0.1:53146 recv error: Network error: RPC frame had a length of 2147483714, but we only support messages up to 52428800 bytes long.
W20260924 16:00:40.443833 29253 connection.cc:158] shutting down server connection from 127.0.0.1:53146 with pending inbound data: 4/2147483714 bytes received; last active 0 ns ago: status Network error: RPC frame had a length of 2147483714, but we only support messages up to 52428800 bytes long.
W20260924 16:00:40.444425 29267 connection.cc:196] Error closing socket: Network error: TlsSocket::Close: Connection reset by peer
I20260924 16:00:40.490124 29280 acceptor_pool.cc:254] collecting diagnostics on the listening RPC socket 0.0.0.0:32887 every 8 connection(s)
I20260924 16:00:40.490260 29281 acceptor_pool.cc:254] collecting diagnostics on the listening RPC socket 0.0.0.0:32887 every 8 connection(s)
W20260924 16:00:48.010900 29276 connection.cc:577] server connection from 127.0.0.1:48478: received bad data: 'Corruption: Invalid packet: message had a length of 2147483710, but we only support messages up to 2147483647 bytes
'
[       OK ] Parameters/TestRpc.TestRpcSidecarLimits/SSL_TCP (10416 ms)
[ RUN      ] Parameters/TestRpc.TestCallTimeoutDoesntAffectNegotiation/SSL_TCP
I20260924 16:00:48.552673 29306 acceptor_pool.cc:254] collecting diagnostics on the listening RPC socket 0.0.0.0:39975 every 8 connection(s)
I20260924 16:00:48.552963 29307 acceptor_pool.cc:254] collecting diagnostics on the listening RPC socket 0.0.0.0:39975 every 8 connection(s)
W20260924 16:00:48.572508 29301 negotiation.cc:266] Injecting 500ms delay in negotiation
I20260924 16:00:48.623100 29006 rpc-test-base.h:595] status: Timed out: connection negotiation to 0.0.0.0:39975 for RPC Sleep timed out after 0.050s (ON_OUTBOUND_QUEUE), seconds elapsed: 0.0514679
[       OK ] Parameters/TestRpc.TestCallTimeoutDoesntAffectNegotiation/SSL_TCP (551 ms)
[ RUN      ] Parameters/TestRpc.TestRpcHandlerLatencyMetric/SSL_TCP
I20260924 16:00:49.105124 29332 acceptor_pool.cc:254] collecting diagnostics on the listening RPC socket 0.0.0.0:45983 every 8 connection(s)
I20260924 16:00:49.105400 29333 acceptor_pool.cc:254] collecting diagnostics on the listening RPC socket 0.0.0.0:45983 every 8 connection(s)
I20260924 16:00:49.142822 29006 rpc-test.cc:1236] Sleep() min lat: 20732
I20260924 16:00:49.142917 29006 rpc-test.cc:1237] Sleep() mean lat: 20732
I20260924 16:00:49.142957 29006 rpc-test.cc:1238] Sleep() max lat: 20732
I20260924 16:00:49.142976 29006 rpc-test.cc:1239] Sleep() #calls: 1
[       OK ] Parameters/TestRpc.TestRpcHandlerLatencyMetric/SSL_TCP (63 ms)
[ RUN      ] Parameters/TestRpc.TimedOutOnResponseMetricServiceQueue/SSL_TCP
I20260924 16:00:49.169075 29358 acceptor_pool.cc:254] collecting diagnostics on the listening RPC socket 0.0.0.0:33309 every 8 connection(s)
I20260924 16:00:49.169457 29360 acceptor_pool.cc:254] collecting diagnostics on the listening RPC socket 0.0.0.0:33309 every 8 connection(s)
W20260924 16:00:49.247592 29361 rpcz_store.cc:267] Call kudu.rpc_test.CalculatorService.Sleep from 127.0.0.1:50558 (request call id 2) took 20 ms (client timeout 20 ms). Trace:
W20260924 16:00:49.247797 29361 rpcz_store.cc:269] 0924 16:00:49.227138 (+     0us) service_pool.cc:170] Inserting onto call queue
0924 16:00:49.247533 (+ 20395us) service_pool.cc:214] Skipping call since client already timed out
0924 16:00:49.247575 (+    42us) inbound_call.cc:173] Queueing failure response
Metrics: {}
[       OK ] Parameters/TestRpc.TimedOutOnResponseMetricServiceQueue/SSL_TCP (105 ms)
[ RUN      ] Parameters/TestRpc.RpcPendingConnectionsMetric/SSL_TCP
I20260924 16:00:49.259800 29382 acceptor_pool.cc:254] collecting diagnostics on the listening RPC socket 0.0.0.0:42349 every 8 connection(s)
I20260924 16:00:49.260021 29383 acceptor_pool.cc:254] collecting diagnostics on the listening RPC socket 0.0.0.0:42349 every 8 connection(s)
W20260924 16:00:49.262596 29378 negotiation.cc:337] Failed RPC negotiation. Trace:
0924 16:00:49.261561 (+     0us) reactor.cc:625] Submitting negotiation task for server connection from 127.0.0.1:49488 (local address 127.0.0.1:42349)
0924 16:00:49.261756 (+   195us) server_negotiation.cc:206] Beginning negotiation
0924 16:00:49.261761 (+     5us) server_negotiation.cc:399] Waiting for connection header
0924 16:00:49.261912 (+   151us) negotiation.cc:327] Negotiation complete: Network error: Server connection negotiation failed: server connection from 127.0.0.1:49488: BlockingRecv error: recv got EOF from 127.0.0.1:49488 (error 108)
Metrics: {"server-negotiator.queue_time_us":63}
[       OK ] Parameters/TestRpc.RpcPendingConnectionsMetric/SSL_TCP (21 ms)
[ RUN      ] Parameters/TestRpc.TestRpcContextClientDeadline/SSL_TCP
I20260924 16:00:49.292932 29398 acceptor_pool.cc:254] collecting diagnostics on the listening RPC socket 0.0.0.0:44891 every 8 connection(s)
I20260924 16:00:49.293071 29399 acceptor_pool.cc:254] collecting diagnostics on the listening RPC socket 0.0.0.0:44891 every 8 connection(s)
[       OK ] Parameters/TestRpc.TestRpcContextClientDeadline/SSL_TCP (86 ms)
[ RUN      ] Parameters/TestRpc.TestApplicationFeatureFlagUnsupportedServer/SSL_TCP
I20260924 16:00:49.381292 29423 acceptor_pool.cc:254] collecting diagnostics on the listening RPC socket 0.0.0.0:39583 every 8 connection(s)
I20260924 16:00:49.381548 29424 acceptor_pool.cc:254] collecting diagnostics on the listening RPC socket 0.0.0.0:39583 every 8 connection(s)
[       OK ] Parameters/TestRpc.TestApplicationFeatureFlagUnsupportedServer/SSL_TCP (46 ms)
[ RUN      ] Parameters/TestRpc.TestCancellationAsync/SSL_TCP
I20260924 16:00:49.424564 29449 acceptor_pool.cc:254] collecting diagnostics on the listening RPC socket 0.0.0.0:36723 every 8 connection(s)
I20260924 16:00:49.424847 29450 acceptor_pool.cc:254] collecting diagnostics on the listening RPC socket 0.0.0.0:36723 every 8 connection(s)
I20260924 16:00:49.425827 29006 rpc-test.cc:1716] Connecting to 0.0.0.0:36723
I20260924 16:00:49.445873 29006 test_util.cc:268] Using random seed: -1273578555
I20260924 16:00:49.489316 29453 rpc-test-base.h:240] got call: sleep_micros: 500 pattern: 4294967295 num_repetitions: 2097152 sidecar_idx: 0
I20260924 16:00:49.514825 29452 rpc-test-base.h:240] got call: sleep_micros: 500 pattern: 4294967295 num_repetitions: 2097152 sidecar_idx: 0
I20260924 16:00:49.550676 29453 rpc-test-base.h:240] got call: sleep_micros: 500 pattern: 4294967295 num_repetitions: 2097152 sidecar_idx: 0
I20260924 16:00:49.585103 29452 rpc-test-base.h:240] got call: sleep_micros: 500 pattern: 4294967295 num_repetitions: 2097152 sidecar_idx: 0
I20260924 16:00:49.617871 29453 rpc-test-base.h:240] got call: sleep_micros: 500 pattern: 4294967295 num_repetitions: 2097152 sidecar_idx: 0
I20260924 16:00:49.651559 29452 rpc-test-base.h:240] got call: sleep_micros: 500 pattern: 4294967295 num_repetitions: 2097152 sidecar_idx: 0
W20260924 16:00:49.684173 29447 connection.cc:196] Error closing socket: Network error: TlsSocket::Close: Broken pipe
W20260924 16:00:49.694409 29447 connection.cc:441] server connection from 127.0.0.1:43162 torn down before Call kudu.rpc.GenericCalculatorService.SleepWithSidecar from 127.0.0.1:43162 (request call id 8) could send its response
[       OK ] Parameters/TestRpc.TestCancellationAsync/SSL_TCP (289 ms)
[ RUN      ] Parameters/TestRpc.TestPerformanceBySocketType/SSL_TCP
I20260924 16:00:49.723526 29475 acceptor_pool.cc:254] collecting diagnostics on the listening RPC socket 0.0.0.0:33883 every 8 connection(s)
I20260924 16:00:49.723747 29476 acceptor_pool.cc:254] collecting diagnostics on the listening RPC socket 0.0.0.0:33883 every 8 connection(s)
I20260924 16:00:49.724673 29006 rpc-test.cc:1846] Connecting to 0.0.0.0:33883
I20260924 16:00:53.174817 29006 rpc-test.cc:1859] Sending 1024MB via ssl-enabled tcp socket: real 3.437s	user 3.054s	sys 2.592s
I20260924 16:00:56.695572 29006 rpc-test.cc:1859] Sending 1024MB via ssl-enabled tcp socket: real 3.521s	user 3.180s	sys 2.624s
I20260924 16:01:00.263162 29006 rpc-test.cc:1859] Sending 1024MB via ssl-enabled tcp socket: real 3.567s	user 3.106s	sys 2.760s
I20260924 16:01:03.816111 29006 rpc-test.cc:1859] Sending 1024MB via ssl-enabled tcp socket: real 3.553s	user 3.182s	sys 2.708s
I20260924 16:01:07.446717 29006 rpc-test.cc:1859] Sending 1024MB via ssl-enabled tcp socket: real 3.630s	user 3.186s	sys 2.783s
[       OK ] Parameters/TestRpc.TestPerformanceBySocketType/SSL_TCP (17759 ms)
[----------] 20 tests from Parameters/TestRpc (55134 ms total)

[----------] 1 test from Parameters/TestRpcSocketTxRxQueue
[ RUN      ] Parameters/TestRpcSocketTxRxQueue.OverCapacity/0
W20260924 16:01:07.775338 29492 negotiation.cc:337] Failed RPC negotiation. Trace:
0924 16:01:07.463311 (+     0us) reactor.cc:625] Submitting negotiation task for client connection to 0.0.0.0:36765 (local address 127.0.0.1:54824)
0924 16:01:07.463671 (+   360us) negotiation.cc:107] Waiting for socket to connect
0924 16:01:07.463697 (+    26us) client_negotiation.cc:174] Beginning negotiation
0924 16:01:07.463818 (+   121us) client_negotiation.cc:252] Sending NEGOTIATE NegotiatePB request
0924 16:01:07.774441 (+310623us) negotiation.cc:327] Negotiation complete: Network error: Client connection negotiation failed: client connection to 0.0.0.0:36765: BlockingRecv error: recv error from unknown peer: Transport endpoint is not connected (error 107)
Metrics: {"client-negotiator.queue_time_us":60}
W20260924 16:01:07.775467 29511 negotiation.cc:337] Failed RPC negotiation. Trace:
0924 16:01:07.471871 (+     0us) reactor.cc:625] Submitting negotiation task for client connection to 0.0.0.0:36765 (local address 127.0.0.1:54854)
0924 16:01:07.472118 (+   247us) negotiation.cc:107] Waiting for socket to connect
0924 16:01:07.472136 (+    18us) client_negotiation.cc:174] Beginning negotiation
0924 16:01:07.472261 (+   125us) client_negotiation.cc:252] Sending NEGOTIATE NegotiatePB request
0924 16:01:07.774528 (+302267us) negotiation.cc:327] Negotiation complete: Network error: Client connection negotiation failed: client connection to 0.0.0.0:36765: BlockingRecv error: recv error from unknown peer: Transport endpoint is not connected (error 107)
Metrics: {"client-negotiator.queue_time_us":75}
W20260924 16:01:07.777858 29520 negotiation.cc:337] Failed RPC negotiation. Trace:
0924 16:01:07.475671 (+     0us) reactor.cc:625] Submitting negotiation task for client connection to 0.0.0.0:36765 (local address 127.0.0.1:54856)
0924 16:01:07.476105 (+   434us) negotiation.cc:107] Waiting for socket to connect
0924 16:01:07.476129 (+    24us) client_negotiation.cc:174] Beginning negotiation
0924 16:01:07.476274 (+   145us) client_negotiation.cc:252] Sending NEGOTIATE NegotiatePB request
0924 16:01:07.774441 (+298167us) negotiation.cc:327] Negotiation complete: Network error: Client connection negotiation failed: client connection to 0.0.0.0:36765: BlockingRecv error: recv error from unknown peer: Transport endpoint is not connected (error 107)
Metrics: {"client-negotiator.queue_time_us":282}
W20260924 16:01:07.777977 29529 negotiation.cc:337] Failed RPC negotiation. Trace:
0924 16:01:07.480048 (+     0us) reactor.cc:625] Submitting negotiation task for client connection to 0.0.0.0:36765 (local address 127.0.0.1:54860)
0924 16:01:07.480345 (+   297us) negotiation.cc:107] Waiting for socket to connect
0924 16:01:07.480364 (+    19us) client_negotiation.cc:174] Beginning negotiation
0924 16:01:07.480510 (+   146us) client_negotiation.cc:252] Sending NEGOTIATE NegotiatePB request
0924 16:01:07.774915 (+294405us) negotiation.cc:327] Negotiation complete: Network error: Client connection negotiation failed: client connection to 0.0.0.0:36765: BlockingRecv error: recv error from unknown peer: Transport endpoint is not connected (error 107)
Metrics: {"client-negotiator.queue_time_us":135}
W20260924 16:01:07.778384 29538 negotiation.cc:337] Failed RPC negotiation. Trace:
0924 16:01:07.484355 (+     0us) reactor.cc:625] Submitting negotiation task for client connection to 0.0.0.0:36765 (local address 127.0.0.1:54862)
0924 16:01:07.484649 (+   294us) negotiation.cc:107] Waiting for socket to connect
0924 16:01:07.484773 (+   124us) client_negotiation.cc:174] Beginning negotiation
0924 16:01:07.485003 (+   230us) client_negotiation.cc:252] Sending NEGOTIATE NegotiatePB request
0924 16:01:07.774961 (+289958us) negotiation.cc:327] Negotiation complete: Network error: Client connection negotiation failed: client connection to 0.0.0.0:36765: BlockingRecv error: recv error from unknown peer: Transport endpoint is not connected (error 107)
Metrics: {"client-negotiator.queue_time_us":115}
W20260924 16:01:07.778437 29501 negotiation.cc:337] Failed RPC negotiation. Trace:
0924 16:01:07.467459 (+     0us) reactor.cc:625] Submitting negotiation task for client connection to 0.0.0.0:36765 (local address 127.0.0.1:54840)
0924 16:01:07.467793 (+   334us) negotiation.cc:107] Waiting for socket to connect
0924 16:01:07.467815 (+    22us) client_negotiation.cc:174] Beginning negotiation
0924 16:01:07.467950 (+   135us) client_negotiation.cc:252] Sending NEGOTIATE NegotiatePB request
0924 16:01:07.774602 (+306652us) negotiation.cc:327] Negotiation complete: Network error: Client connection negotiation failed: client connection to 0.0.0.0:36765: BlockingRecv error: recv error from unknown peer: Transport endpoint is not connected (error 107)
Metrics: {"client-negotiator.queue_time_us":100}
[       OK ] Parameters/TestRpcSocketTxRxQueue.OverCapacity/0 (1099 ms)
[----------] 1 test from Parameters/TestRpcSocketTxRxQueue (1099 ms total)

[----------] Global test environment tear-down
[==========] 21 tests from 2 test suites ran. (56234 ms total)
[  PASSED  ] 20 tests.
[  FAILED  ] 1 test, listed below:
[  FAILED  ] Parameters/TestRpc.TestCallWithChainCertAndChainCA/SSL_TCP, where GetParam() = (true, false)

 1 FAILED TEST