Diagnosed failure
Parameters/TestRpc.TestCallWithChainCertAndChainCA/SSL_UnixSocket: /data0/somelongdirectorytoavoidrpathissues/src/kudu/src/kudu/rpc/rpc-test.cc:270: Failure
Failed
Bad status: Runtime error: could not verify certificate chain (error with cert: subject=CN = localhost, ST = sadfjas, C = AS, emailAddress = sdflkdsajf, O = lskdfjlsad, OU = sldfkja, issuer=C = AS, ST = ASDfkjdhf, L = lskdjf, O = saldfja, OU = skdjf, CN = localhost, emailAddress = sadjflkadsj): : certificate has expired
Google Test trace:
/data0/somelongdirectorytoavoidrpathissues/src/kudu/src/kudu/rpc/rpc-test.cc:267: Connecting to unix:/tmp/dist-test-task6_GWy9/test-tmp/rpc-test-728b6baf7855410f9f35ad0ef35161ea.sock
I20260924 00:26:00.786616 14902 test_util.cc:175] -----------------------------------------------
I20260924 00:26:00.786789 14902 test_util.cc:176] Had fatal failures, leaving test files at /tmp/dist-test-task6_GWy9/test-tmp/rpc-test.6.Parameters_TestRpc.TestCallWithChainCertAndChainCA_SSL_UnixSocket.1790209559384461-14902-0
Full log
Note: This is test shard 7 of 8.
[==========] Running 21 tests from 2 test suites.
[----------] Global test environment set-up.
[----------] 20 tests from Parameters/TestRpc
[ RUN ] Parameters/TestRpc.TestMessengerCreateDestroy/SSL_UnixSocket
WARNING: Logging before InitGoogleLogging() is written to STDERR
I20260924 00:25:59.513201 14902 rpc-test.cc:169] started messenger TestCreateDestroy
[ OK ] Parameters/TestRpc.TestMessengerCreateDestroy/SSL_UnixSocket (1201 ms)
[ RUN ] Parameters/TestRpc.TestNegotiationDeadlock/SSL_UnixSocket
I20260924 00:26:00.667273 14924 acceptor_pool.cc:254] collecting diagnostics on the listening RPC socket unix:/tmp/dist-test-task6_GWy9/test-tmp/rpc-test-42750bcff12f49d192d86d9594fd470d.sock every 8 connection(s)
I20260924 00:26:00.668895 14925 acceptor_pool.cc:254] collecting diagnostics on the listening RPC socket unix:/tmp/dist-test-task6_GWy9/test-tmp/rpc-test-42750bcff12f49d192d86d9594fd470d.sock every 8 connection(s)
[ OK ] Parameters/TestRpc.TestNegotiationDeadlock/SSL_UnixSocket (85 ms)
[ RUN ] Parameters/TestRpc.TestCallWithChainCertAndChainCA/SSL_UnixSocket
I20260924 00:26:00.756599 14940 acceptor_pool.cc:254] collecting diagnostics on the listening RPC socket unix:/tmp/dist-test-task6_GWy9/test-tmp/rpc-test-728b6baf7855410f9f35ad0ef35161ea.sock every 8 connection(s)
I20260924 00:26:00.758919 14941 acceptor_pool.cc:254] collecting diagnostics on the listening RPC socket unix:/tmp/dist-test-task6_GWy9/test-tmp/rpc-test-728b6baf7855410f9f35ad0ef35161ea.sock every 8 connection(s)
/data0/somelongdirectorytoavoidrpathissues/src/kudu/src/kudu/rpc/rpc-test.cc:270: Failure
Failed
Bad status: Runtime error: could not verify certificate chain (error with cert: subject=CN = localhost, ST = sadfjas, C = AS, emailAddress = sdflkdsajf, O = lskdfjlsad, OU = sldfkja, issuer=C = AS, ST = ASDfkjdhf, L = lskdjf, O = saldfja, OU = skdjf, CN = localhost, emailAddress = sadjflkadsj): : certificate has expired
Google Test trace:
/data0/somelongdirectorytoavoidrpathissues/src/kudu/src/kudu/rpc/rpc-test.cc:267: Connecting to unix:/tmp/dist-test-task6_GWy9/test-tmp/rpc-test-728b6baf7855410f9f35ad0ef35161ea.sock
I20260924 00:26:00.786616 14902 test_util.cc:175] -----------------------------------------------
I20260924 00:26:00.786789 14902 test_util.cc:176] Had fatal failures, leaving test files at /tmp/dist-test-task6_GWy9/test-tmp/rpc-test.6.Parameters_TestRpc.TestCallWithChainCertAndChainCA_SSL_UnixSocket.1790209559384461-14902-0
[ FAILED ] Parameters/TestRpc.TestCallWithChainCertAndChainCA/SSL_UnixSocket, where GetParam() = (true, true) (61 ms)
[ RUN ] Parameters/TestRpc.TestCallWithPasswordProtectedKey/SSL_UnixSocket
I20260924 00:26:00.819635 14965 acceptor_pool.cc:254] collecting diagnostics on the listening RPC socket unix:/tmp/dist-test-task6_GWy9/test-tmp/rpc-test-07170f7b4b0d4e9b9fab5bbd7af76b07.sock every 8 connection(s)
I20260924 00:26:00.820377 14966 acceptor_pool.cc:254] collecting diagnostics on the listening RPC socket unix:/tmp/dist-test-task6_GWy9/test-tmp/rpc-test-07170f7b4b0d4e9b9fab5bbd7af76b07.sock every 8 connection(s)
W20260924 00:26:00.862776 14962 connection.cc:196] Error closing socket: Network error: TlsSocket::Close: Broken pipe
[ OK ] Parameters/TestRpc.TestCallWithPasswordProtectedKey/SSL_UnixSocket (80 ms)
[ RUN ] Parameters/TestRpc.TestCallToBadServer/SSL_UnixSocket
I20260924 00:26:00.892875 14902 rpc-test.cc:394] Status: Network error: Client connection negotiation failed: client connection to 0.0.0.0:0: connect: Connection refused (error 111)
I20260924 00:26:00.894404 14902 rpc-test.cc:394] Status: Network error: Client connection negotiation failed: client connection to 0.0.0.0:0: connect: Connection refused (error 111)
I20260924 00:26:00.895714 14902 rpc-test.cc:394] Status: Network error: Client connection negotiation failed: client connection to 0.0.0.0:0: connect: Connection refused (error 111)
I20260924 00:26:00.897027 14902 rpc-test.cc:394] Status: Network error: Client connection negotiation failed: client connection to 0.0.0.0:0: connect: Connection refused (error 111)
I20260924 00:26:00.898276 14902 rpc-test.cc:394] Status: Network error: Client connection negotiation failed: client connection to 0.0.0.0:0: connect: Connection refused (error 111)
[ OK ] Parameters/TestRpc.TestCallToBadServer/SSL_UnixSocket (33 ms)
[ RUN ] Parameters/TestRpc.TestWrongService/SSL_UnixSocket
I20260924 00:26:00.916550 15000 acceptor_pool.cc:254] collecting diagnostics on the listening RPC socket unix:/tmp/dist-test-task6_GWy9/test-tmp/rpc-test-6b3cd20dcd7e4535976d9d9a93bc317b.sock every 8 connection(s)
I20260924 00:26:00.917440 15001 acceptor_pool.cc:254] collecting diagnostics on the listening RPC socket unix:/tmp/dist-test-task6_GWy9/test-tmp/rpc-test-6b3cd20dcd7e4535976d9d9a93bc317b.sock every 8 connection(s)
I20260924 00:26:00.960064 14997 messenger.cc:345] service WrongServiceName not registered on TestServer
[ OK ] Parameters/TestRpc.TestWrongService/SSL_UnixSocket (67 ms)
[ RUN ] Parameters/TestRpc.TestConnectionKeepalive/SSL_UnixSocket
I20260924 00:26:00.992595 15023 acceptor_pool.cc:254] collecting diagnostics on the listening RPC socket unix:/tmp/dist-test-task6_GWy9/test-tmp/rpc-test-209d35cfdbb147b3b78ced46a9e778e7.sock every 8 connection(s)
I20260924 00:26:00.993351 15024 acceptor_pool.cc:254] collecting diagnostics on the listening RPC socket unix:/tmp/dist-test-task6_GWy9/test-tmp/rpc-test-209d35cfdbb147b3b78ced46a9e778e7.sock every 8 connection(s)
I20260924 00:26:00.996575 14902 rpc-test.cc:488] Connecting to unix:/tmp/dist-test-task6_GWy9/test-tmp/rpc-test-209d35cfdbb147b3b78ced46a9e778e7.sock
W20260924 00:26:01.471717 15036 connection.cc:196] Error closing socket: Network error: TlsSocket::Close: Broken pipe
[ OK ] Parameters/TestRpc.TestConnectionKeepalive/SSL_UnixSocket (1076 ms)
[ RUN ] Parameters/TestRpc.TestClientConnectionMetrics/SSL_UnixSocket
I20260924 00:26:02.062486 15048 acceptor_pool.cc:254] collecting diagnostics on the listening RPC socket unix:/tmp/dist-test-task6_GWy9/test-tmp/rpc-test-7aa9dc015caa4b47be77655fc7b2f2cf.sock every 8 connection(s)
I20260924 00:26:02.063225 15049 acceptor_pool.cc:254] collecting diagnostics on the listening RPC socket unix:/tmp/dist-test-task6_GWy9/test-tmp/rpc-test-7aa9dc015caa4b47be77655fc7b2f2cf.sock every 8 connection(s)
I20260924 00:26:02.066318 14902 rpc-test.cc:569] Connecting to unix:/tmp/dist-test-task6_GWy9/test-tmp/rpc-test-7aa9dc015caa4b47be77655fc7b2f2cf.sock
W20260924 00:28:20.662868 15045 connection.cc:196] Error closing socket: Network error: TlsSocket::Close: Broken pipe
[ OK ] Parameters/TestRpc.TestClientConnectionMetrics/SSL_UnixSocket (138626 ms)
[ RUN ] Parameters/TestRpc.TestCredentialsPolicy/SSL_UnixSocket
I20260924 00:28:20.712728 15085 acceptor_pool.cc:254] collecting diagnostics on the listening RPC socket unix:/tmp/dist-test-task6_GWy9/test-tmp/rpc-test-b2e148069ba84f709f60ea1e81ceda37.sock every 8 connection(s)
I20260924 00:28:20.713620 15086 acceptor_pool.cc:254] collecting diagnostics on the listening RPC socket unix:/tmp/dist-test-task6_GWy9/test-tmp/rpc-test-b2e148069ba84f709f60ea1e81ceda37.sock every 8 connection(s)
I20260924 00:28:20.716810 14902 rpc-test.cc:700] Connecting to unix:/tmp/dist-test-task6_GWy9/test-tmp/rpc-test-b2e148069ba84f709f60ea1e81ceda37.sock
W20260924 00:28:20.779361 15084 connection.cc:196] Error closing socket: Network error: TlsSocket::Close: Broken pipe
W20260924 00:28:20.792171 15084 connection.cc:196] Error closing socket: Network error: TlsSocket::Close: Broken pipe
[ OK ] Parameters/TestRpc.TestCredentialsPolicy/SSL_UnixSocket (128 ms)
[ RUN ] Parameters/TestRpc.TestCallLongerThanKeepalive/SSL_UnixSocket
I20260924 00:28:20.815719 15110 acceptor_pool.cc:254] collecting diagnostics on the listening RPC socket unix:/tmp/dist-test-task6_GWy9/test-tmp/rpc-test-454a1de3eb5b4bc2a5b5f817ec7b66f4.sock every 8 connection(s)
I20260924 00:28:20.816509 15111 acceptor_pool.cc:254] collecting diagnostics on the listening RPC socket unix:/tmp/dist-test-task6_GWy9/test-tmp/rpc-test-454a1de3eb5b4bc2a5b5f817ec7b66f4.sock every 8 connection(s)
I20260924 00:28:20.861868 15114 rpc-test-base.h:222] got call: sleep_micros: 3000000 deferred: true
I20260924 00:28:23.866263 15114 rpcz_store.cc:275] Call kudu.rpc.GenericCalculatorService.Sleep from unix:<unnamed> (request call id 0) took 3004 ms. Trace:
I20260924 00:28:23.866621 15114 rpcz_store.cc:276] 0924 00:28:20.861708 (+ 0us) service_pool.cc:170] Inserting onto call queue
0924 00:28:20.861813 (+ 105us) service_pool.cc:227] Handling call
0924 00:28:23.866206 (+3004393us) inbound_call.cc:173] Queueing success response
Metrics: {}
W20260924 00:28:23.870649 15107 connection.cc:196] Error closing socket: Network error: TlsSocket::Close: Broken pipe
[ OK ] Parameters/TestRpc.TestCallLongerThanKeepalive/SSL_UnixSocket (3074 ms)
[ RUN ] Parameters/TestRpc.TestRpcSidecar/SSL_UnixSocket
I20260924 00:28:23.905488 15135 acceptor_pool.cc:254] collecting diagnostics on the listening RPC socket unix:/tmp/dist-test-task6_GWy9/test-tmp/rpc-test-89f7e3136f91427e9465e377d64379d8.sock every 8 connection(s)
I20260924 00:28:23.906231 15136 acceptor_pool.cc:254] collecting diagnostics on the listening RPC socket unix:/tmp/dist-test-task6_GWy9/test-tmp/rpc-test-89f7e3136f91427e9465e377d64379d8.sock every 8 connection(s)
W20260924 00:28:24.413225 15132 connection.cc:196] Error closing socket: Network error: TlsSocket::Close: Broken pipe
[ OK ] Parameters/TestRpc.TestRpcSidecar/SSL_UnixSocket (541 ms)
[ RUN ] Parameters/TestRpc.TestRpcSidecarLimits/SSL_UnixSocket
I20260924 00:28:41.243425 15162 acceptor_pool.cc:254] collecting diagnostics on the listening RPC socket unix:/tmp/dist-test-task6_GWy9/test-tmp/rpc-test-13a18c8b357048e98bd01e532a0b2ac1.sock every 8 connection(s)
I20260924 00:28:41.244268 15163 acceptor_pool.cc:254] collecting diagnostics on the listening RPC socket unix:/tmp/dist-test-task6_GWy9/test-tmp/rpc-test-13a18c8b357048e98bd01e532a0b2ac1.sock every 8 connection(s)
W20260924 00:28:41.284689 14902 serialization.cc:72] Serialized kudu.rpc_test.PushStringsRequestPB (2147483654 bytes) is larger than the maximum configured RPC message size (52428800 bytes). Sending anyway, but peer may reject the data.
W20260924 00:28:41.296378 15159 connection.cc:535] server connection from unix:<unnamed> recv error: Network error: RPC frame had a length of 2147483714, but we only support messages up to 52428800 bytes long.
W20260924 00:28:41.296829 15159 connection.cc:158] shutting down server connection from unix:<unnamed> with pending inbound data: 4/2147483714 bytes received; last active 0 ns ago: status Network error: RPC frame had a length of 2147483714, but we only support messages up to 52428800 bytes long.
W20260924 00:28:41.297928 15175 connection.cc:698] client connection to unix:/tmp/dist-test-task6_GWy9/test-tmp/rpc-test-13a18c8b357048e98bd01e532a0b2ac1.sock send error: Network error: failed to write to TLS socket: Broken pipe
W20260924 00:28:41.298615 15175 connection.cc:196] Error closing socket: Network error: TlsSocket::Close: Success
[ OK ] Parameters/TestRpc.TestRpcSidecarLimits/SSL_UnixSocket (17500 ms)
[ RUN ] Parameters/TestRpc.TestCallTimeoutDoesntAffectNegotiation/SSL_UnixSocket
I20260924 00:28:41.945878 15187 acceptor_pool.cc:254] collecting diagnostics on the listening RPC socket unix:/tmp/dist-test-task6_GWy9/test-tmp/rpc-test-5764bc91b55e414093c689c849e488af.sock every 8 connection(s)
I20260924 00:28:41.946631 15188 acceptor_pool.cc:254] collecting diagnostics on the listening RPC socket unix:/tmp/dist-test-task6_GWy9/test-tmp/rpc-test-5764bc91b55e414093c689c849e488af.sock every 8 connection(s)
W20260924 00:28:41.970745 15183 negotiation.cc:266] Injecting 500ms delay in negotiation
I20260924 00:28:42.020478 14902 rpc-test-base.h:595] status: Timed out: connection negotiation to unix:/tmp/dist-test-task6_GWy9/test-tmp/rpc-test-5764bc91b55e414093c689c849e488af.sock for RPC Sleep timed out after 0.050s (ON_OUTBOUND_QUEUE), seconds elapsed: 0.0507653
W20260924 00:28:42.482621 15184 connection.cc:196] Error closing socket: Network error: TlsSocket::Close: Broken pipe
[ OK ] Parameters/TestRpc.TestCallTimeoutDoesntAffectNegotiation/SSL_UnixSocket (568 ms)
[ RUN ] Parameters/TestRpc.TestRpcHandlerLatencyMetric/SSL_UnixSocket
I20260924 00:28:42.506916 15212 acceptor_pool.cc:254] collecting diagnostics on the listening RPC socket unix:/tmp/dist-test-task6_GWy9/test-tmp/rpc-test-c47a016a9299469eabd694c965d3a24b.sock every 8 connection(s)
I20260924 00:28:42.507650 15213 acceptor_pool.cc:254] collecting diagnostics on the listening RPC socket unix:/tmp/dist-test-task6_GWy9/test-tmp/rpc-test-c47a016a9299469eabd694c965d3a24b.sock every 8 connection(s)
I20260924 00:28:42.556437 14902 rpc-test.cc:1236] Sleep() min lat: 21538
I20260924 00:28:42.556706 14902 rpc-test.cc:1237] Sleep() mean lat: 21538
I20260924 00:28:42.556890 14902 rpc-test.cc:1238] Sleep() max lat: 21538
I20260924 00:28:42.557055 14902 rpc-test.cc:1239] Sleep() #calls: 1
[ OK ] Parameters/TestRpc.TestRpcHandlerLatencyMetric/SSL_UnixSocket (77 ms)
[ RUN ] Parameters/TestRpc.TimedOutOnResponseMetricServiceQueue/SSL_UnixSocket
I20260924 00:28:42.607755 15238 acceptor_pool.cc:254] collecting diagnostics on the listening RPC socket unix:/tmp/dist-test-task6_GWy9/test-tmp/rpc-test-6ca0135d5c224d7ab53da5fd18ab485b.sock every 8 connection(s)
I20260924 00:28:42.608458 15239 acceptor_pool.cc:254] collecting diagnostics on the listening RPC socket unix:/tmp/dist-test-task6_GWy9/test-tmp/rpc-test-6ca0135d5c224d7ab53da5fd18ab485b.sock every 8 connection(s)
W20260924 00:28:42.689137 15240 rpcz_store.cc:267] Call kudu.rpc_test.CalculatorService.Sleep from unix:<unnamed> (request call id 2) took 20 ms (client timeout 20 ms). Trace:
W20260924 00:28:42.689543 15240 rpcz_store.cc:269] 0924 00:28:42.668602 (+ 0us) service_pool.cc:170] Inserting onto call queue
0924 00:28:42.688998 (+ 20396us) service_pool.cc:214] Skipping call since client already timed out
0924 00:28:42.689082 (+ 84us) inbound_call.cc:173] Queueing failure response
Metrics: {}
[ OK ] Parameters/TestRpc.TimedOutOnResponseMetricServiceQueue/SSL_UnixSocket (131 ms)
[ RUN ] Parameters/TestRpc.RpcPendingConnectionsMetric/SSL_UnixSocket
I20260924 00:28:42.707489 15261 acceptor_pool.cc:254] collecting diagnostics on the listening RPC socket 0.0.0.0:40481 every 8 connection(s)
I20260924 00:28:42.708272 15262 acceptor_pool.cc:254] collecting diagnostics on the listening RPC socket 0.0.0.0:40481 every 8 connection(s)
W20260924 00:28:42.713306 15257 negotiation.cc:337] Failed RPC negotiation. Trace:
0924 00:28:42.712116 (+ 0us) reactor.cc:625] Submitting negotiation task for server connection from 127.0.0.1:50092 (local address 127.0.0.1:40481)
0924 00:28:42.712503 (+ 387us) server_negotiation.cc:206] Beginning negotiation
0924 00:28:42.712521 (+ 18us) server_negotiation.cc:399] Waiting for connection header
0924 00:28:42.712762 (+ 241us) negotiation.cc:327] Negotiation complete: Network error: Server connection negotiation failed: server connection from 127.0.0.1:50092: BlockingRecv error: recv got EOF from 127.0.0.1:50092 (error 108)
Metrics: {"server-negotiator.queue_time_us":98}
[ OK ] Parameters/TestRpc.RpcPendingConnectionsMetric/SSL_UnixSocket (31 ms)
[ RUN ] Parameters/TestRpc.TestRpcContextClientDeadline/SSL_UnixSocket
I20260924 00:28:42.749323 15277 acceptor_pool.cc:254] collecting diagnostics on the listening RPC socket unix:/tmp/dist-test-task6_GWy9/test-tmp/rpc-test-f5b8f7e0b91b48ff9cc4d15a74037b9b.sock every 8 connection(s)
I20260924 00:28:42.750033 15278 acceptor_pool.cc:254] collecting diagnostics on the listening RPC socket unix:/tmp/dist-test-task6_GWy9/test-tmp/rpc-test-f5b8f7e0b91b48ff9cc4d15a74037b9b.sock every 8 connection(s)
W20260924 00:28:42.805874 15274 connection.cc:196] Error closing socket: Network error: TlsSocket::Close: Broken pipe
[ OK ] Parameters/TestRpc.TestRpcContextClientDeadline/SSL_UnixSocket (83 ms)
[ RUN ] Parameters/TestRpc.TestApplicationFeatureFlagUnsupportedServer/SSL_UnixSocket
I20260924 00:28:42.846931 15302 acceptor_pool.cc:254] collecting diagnostics on the listening RPC socket unix:/tmp/dist-test-task6_GWy9/test-tmp/rpc-test-b974bc1f7e6544acb24482e574d68678.sock every 8 connection(s)
I20260924 00:28:42.847642 15303 acceptor_pool.cc:254] collecting diagnostics on the listening RPC socket unix:/tmp/dist-test-task6_GWy9/test-tmp/rpc-test-b974bc1f7e6544acb24482e574d68678.sock every 8 connection(s)
W20260924 00:28:42.882048 15299 connection.cc:196] Error closing socket: Network error: TlsSocket::Close: Broken pipe
[ OK ] Parameters/TestRpc.TestApplicationFeatureFlagUnsupportedServer/SSL_UnixSocket (75 ms)
[ RUN ] Parameters/TestRpc.TestCancellationAsync/SSL_UnixSocket
I20260924 00:28:42.917757 15327 acceptor_pool.cc:254] collecting diagnostics on the listening RPC socket unix:/tmp/dist-test-task6_GWy9/test-tmp/rpc-test-2bf9567d5e2a4052902979c2dd1aa1da.sock every 8 connection(s)
I20260924 00:28:42.918484 15328 acceptor_pool.cc:254] collecting diagnostics on the listening RPC socket unix:/tmp/dist-test-task6_GWy9/test-tmp/rpc-test-2bf9567d5e2a4052902979c2dd1aa1da.sock every 8 connection(s)
I20260924 00:28:42.921693 14902 rpc-test.cc:1716] Connecting to unix:/tmp/dist-test-task6_GWy9/test-tmp/rpc-test-2bf9567d5e2a4052902979c2dd1aa1da.sock
I20260924 00:28:42.947392 14902 test_util.cc:268] Using random seed: -1365502166
I20260924 00:28:43.178777 15331 rpc-test-base.h:240] got call: sleep_micros: 500 pattern: 4294967295 num_repetitions: 2097152 sidecar_idx: 0
I20260924 00:28:43.378427 15330 rpc-test-base.h:240] got call: sleep_micros: 500 pattern: 4294967295 num_repetitions: 2097152 sidecar_idx: 0
I20260924 00:28:43.619794 15331 rpc-test-base.h:240] got call: sleep_micros: 500 pattern: 4294967295 num_repetitions: 2097152 sidecar_idx: 0
I20260924 00:28:43.806983 15330 rpc-test-base.h:240] got call: sleep_micros: 500 pattern: 4294967295 num_repetitions: 2097152 sidecar_idx: 0
I20260924 00:28:44.008932 15331 rpc-test-base.h:240] got call: sleep_micros: 500 pattern: 4294967295 num_repetitions: 2097152 sidecar_idx: 0
I20260924 00:28:44.229468 15331 rpc-test-base.h:240] got call: sleep_micros: 500 pattern: 4294967295 num_repetitions: 2097152 sidecar_idx: 0
I20260924 00:28:44.410084 15330 rpc-test-base.h:240] got call: sleep_micros: 500 pattern: 4294967295 num_repetitions: 2097152 sidecar_idx: 0
I20260924 00:28:44.636114 15331 rpc-test-base.h:240] got call: sleep_micros: 500 pattern: 4294967295 num_repetitions: 2097152 sidecar_idx: 0
I20260924 00:28:44.861073 15331 rpc-test-base.h:240] got call: sleep_micros: 500 pattern: 4294967295 num_repetitions: 2097152 sidecar_idx: 0
W20260924 00:28:44.872083 15324 connection.cc:196] Error closing socket: Network error: TlsSocket::Close: Broken pipe
W20260924 00:28:44.994412 15324 connection.cc:441] server connection from unix:<unnamed> torn down before Call kudu.rpc.GenericCalculatorService.SleepWithSidecar from unix:<unnamed> (request call id 9) could send its response
[ OK ] Parameters/TestRpc.TestCancellationAsync/SSL_UnixSocket (2117 ms)
[ RUN ] Parameters/TestRpc.TestPerformanceBySocketType/SSL_UnixSocket
I20260924 00:28:45.108309 15352 acceptor_pool.cc:254] collecting diagnostics on the listening RPC socket unix:/tmp/dist-test-task6_GWy9/test-tmp/rpc-test-7336eb21e08e4590afb0d110ac5063ce.sock every 8 connection(s)
I20260924 00:28:45.109040 15353 acceptor_pool.cc:254] collecting diagnostics on the listening RPC socket unix:/tmp/dist-test-task6_GWy9/test-tmp/rpc-test-7336eb21e08e4590afb0d110ac5063ce.sock every 8 connection(s)
I20260924 00:28:45.112164 14902 rpc-test.cc:1846] Connecting to unix:/tmp/dist-test-task6_GWy9/test-tmp/rpc-test-7336eb21e08e4590afb0d110ac5063ce.sock
I20260924 00:29:06.765735 14902 rpc-test.cc:1859] Sending 1024MB via ssl-enabled unix socket: real 21.635s user 19.226s sys 13.201s
I20260924 00:29:28.252315 14902 rpc-test.cc:1859] Sending 1024MB via ssl-enabled unix socket: real 21.486s user 18.997s sys 13.106s
I20260924 00:29:49.442922 14902 rpc-test.cc:1859] Sending 1024MB via ssl-enabled unix socket: real 21.190s user 18.527s sys 12.932s
I20260924 00:30:10.778075 14902 rpc-test.cc:1859] Sending 1024MB via ssl-enabled unix socket: real 21.335s user 18.927s sys 12.890s
I20260924 00:30:32.395885 14902 rpc-test.cc:1859] Sending 1024MB via ssl-enabled unix socket: real 21.617s user 19.220s sys 13.177s
W20260924 00:30:32.401784 15349 connection.cc:196] Error closing socket: Network error: TlsSocket::Close: Broken pipe
[ OK ] Parameters/TestRpc.TestPerformanceBySocketType/SSL_UnixSocket (107409 ms)
[----------] 20 tests from Parameters/TestRpc (272977 ms total)
[----------] 1 test from Parameters/TestRpcSocketTxRxQueue
[ RUN ] Parameters/TestRpcSocketTxRxQueue.AcceptorRxQueueSizeMetric/0
I20260924 00:30:32.435307 15388 acceptor_pool.cc:254] collecting diagnostics on the listening RPC socket 0.0.0.0:36247 every 1 connection(s)
I20260924 00:30:32.436249 15389 acceptor_pool.cc:254] collecting diagnostics on the listening RPC socket 0.0.0.0:36247 every 1 connection(s)
W20260924 00:30:32.441816 15384 negotiation.cc:337] Failed RPC negotiation. Trace:
0924 00:30:32.440151 (+ 0us) reactor.cc:625] Submitting negotiation task for server connection from 127.0.0.1:51774 (local address 127.0.0.1:36247)
0924 00:30:32.440622 (+ 471us) server_negotiation.cc:206] Beginning negotiation
0924 00:30:32.440650 (+ 28us) server_negotiation.cc:399] Waiting for connection header
0924 00:30:32.440890 (+ 240us) negotiation.cc:327] Negotiation complete: Network error: Server connection negotiation failed: server connection from 127.0.0.1:51774: BlockingRecv error: recv got EOF from 127.0.0.1:51774 (error 108)
Metrics: {"server-negotiator.queue_time_us":120}
[ OK ] Parameters/TestRpcSocketTxRxQueue.AcceptorRxQueueSizeMetric/0 (34 ms)
[----------] 1 test from Parameters/TestRpcSocketTxRxQueue (34 ms total)
[----------] Global test environment tear-down
[==========] 21 tests from 2 test suites ran. (273012 ms total)
[ PASSED ] 20 tests.
[ FAILED ] 1 test, listed below:
[ FAILED ] Parameters/TestRpc.TestCallWithChainCertAndChainCA/SSL_UnixSocket, where GetParam() = (true, true)
1 FAILED TEST