Parameters/TestRpc.TestCallWithChainCertAndRootCA/SSL_TCP: /data0/somelongdirectorytoavoidrpathissues/src/kudu/src/kudu/rpc/rpc-test.cc:303: Failure
Failed
Bad status: Runtime error: could not verify certificate chain (error with cert: subject=CN = localhost, ST = sadfjas, C = AS, emailAddress = sdflkdsajf, O = lskdfjlsad, OU = sldfkja, issuer=C = AS, ST = ASDfkjdhf, L = lskdjf, O = saldfja, OU = skdjf, CN = localhost, emailAddress = sadjflkadsj): : certificate has expired
Google Test trace:
/data0/somelongdirectorytoavoidrpathissues/src/kudu/src/kudu/rpc/rpc-test.cc:300: Connecting to 0.0.0.0:39287
I20260928 19:30:28.122754 390 test_util.cc:175] -----------------------------------------------
I20260928 19:30:28.123009 390 test_util.cc:176] Had fatal failures, leaving test files at /tmp/dist-test-task6dfWhJ/test-tmp/rpc-test.1.Parameters_TestRpc.TestCallWithChainCertAndRootCA_SSL_TCP.1790623826523855-390-0
Note: This is test shard 2 of 8.
[==========] Running 21 tests from 2 test suites.
[----------] Global test environment set-up.
[----------] 1 test from TestRpc
[ RUN ] TestRpc.TestMethodsByName
[ OK ] TestRpc.TestMethodsByName (8 ms)
[----------] 1 test from TestRpc (8 ms total)
[----------] 20 tests from Parameters/TestRpc
[ RUN ] Parameters/TestRpc.TestAcceptorPoolStartStop/SSL_TCP
WARNING: Logging before InitGoogleLogging() is written to STDERR
I20260928 19:30:26.639686 405 acceptor_pool.cc:254] collecting diagnostics on the listening RPC socket 0.0.0.0:38133 every 8 connection(s)
I20260928 19:30:26.641700 406 acceptor_pool.cc:254] collecting diagnostics on the listening RPC socket 0.0.0.0:38133 every 8 connection(s)
I20260928 19:30:27.852222 417 acceptor_pool.cc:254] collecting diagnostics on the listening RPC socket 0.0.0.0:45401 every 8 connection(s)
I20260928 19:30:27.854254 418 acceptor_pool.cc:254] collecting diagnostics on the listening RPC socket 0.0.0.0:45401 every 8 connection(s)
I20260928 19:30:27.885993 428 acceptor_pool.cc:254] collecting diagnostics on the listening RPC socket 0.0.0.0:41761 every 8 connection(s)
I20260928 19:30:27.888897 429 acceptor_pool.cc:254] collecting diagnostics on the listening RPC socket 0.0.0.0:41761 every 8 connection(s)
I20260928 19:30:27.913885 439 acceptor_pool.cc:254] collecting diagnostics on the listening RPC socket 0.0.0.0:34599 every 8 connection(s)
I20260928 19:30:27.914755 440 acceptor_pool.cc:254] collecting diagnostics on the listening RPC socket 0.0.0.0:34599 every 8 connection(s)
I20260928 19:30:27.940623 450 acceptor_pool.cc:254] collecting diagnostics on the listening RPC socket 0.0.0.0:42225 every 8 connection(s)
I20260928 19:30:27.941411 451 acceptor_pool.cc:254] collecting diagnostics on the listening RPC socket 0.0.0.0:42225 every 8 connection(s)
[ OK ] Parameters/TestRpc.TestAcceptorPoolStartStop/SSL_TCP (1353 ms)
[ RUN ] Parameters/TestRpc.TestCall/SSL_TCP
I20260928 19:30:27.967021 463 acceptor_pool.cc:254] collecting diagnostics on the listening RPC socket 0.0.0.0:41875 every 8 connection(s)
I20260928 19:30:27.969776 464 acceptor_pool.cc:254] collecting diagnostics on the listening RPC socket 0.0.0.0:41875 every 8 connection(s)
I20260928 19:30:27.977670 390 rpc-test.cc:234] Connecting to 0.0.0.0:41875
[ OK ] Parameters/TestRpc.TestCall/SSL_TCP (126 ms)
[ RUN ] Parameters/TestRpc.TestCallWithChainCertAndRootCA/SSL_TCP
I20260928 19:30:28.098563 488 acceptor_pool.cc:254] collecting diagnostics on the listening RPC socket 0.0.0.0:39287 every 8 connection(s)
I20260928 19:30:28.099334 489 acceptor_pool.cc:254] collecting diagnostics on the listening RPC socket 0.0.0.0:39287 every 8 connection(s)
/data0/somelongdirectorytoavoidrpathissues/src/kudu/src/kudu/rpc/rpc-test.cc:303: Failure
Failed
Bad status: Runtime error: could not verify certificate chain (error with cert: subject=CN = localhost, ST = sadfjas, C = AS, emailAddress = sdflkdsajf, O = lskdfjlsad, OU = sldfkja, issuer=C = AS, ST = ASDfkjdhf, L = lskdjf, O = saldfja, OU = skdjf, CN = localhost, emailAddress = sadjflkadsj): : certificate has expired
Google Test trace:
/data0/somelongdirectorytoavoidrpathissues/src/kudu/src/kudu/rpc/rpc-test.cc:300: Connecting to 0.0.0.0:39287
I20260928 19:30:28.122754 390 test_util.cc:175] -----------------------------------------------
I20260928 19:30:28.123009 390 test_util.cc:176] Had fatal failures, leaving test files at /tmp/dist-test-task6dfWhJ/test-tmp/rpc-test.1.Parameters_TestRpc.TestCallWithChainCertAndRootCA_SSL_TCP.1790623826523855-390-0
[ FAILED ] Parameters/TestRpc.TestCallWithChainCertAndRootCA/SSL_TCP, where GetParam() = (true, false) (49 ms)
[ RUN ] Parameters/TestRpc.TestCallWithBadPasswordProtectedKey/SSL_TCP
[ OK ] Parameters/TestRpc.TestCallWithBadPasswordProtectedKey/SSL_TCP (41 ms)
[ RUN ] Parameters/TestRpc.TestInvalidMethodCall/SSL_TCP
I20260928 19:30:28.188023 525 acceptor_pool.cc:254] collecting diagnostics on the listening RPC socket 0.0.0.0:43851 every 8 connection(s)
I20260928 19:30:28.189236 526 acceptor_pool.cc:254] collecting diagnostics on the listening RPC socket 0.0.0.0:43851 every 8 connection(s)
I20260928 19:30:28.193612 390 rpc-test.cc:406] Connecting to 0.0.0.0:43851
[ OK ] Parameters/TestRpc.TestInvalidMethodCall/SSL_TCP (78 ms)
[ RUN ] Parameters/TestRpc.TestHighFDs/SSL_TCP
I20260928 19:30:28.489593 550 acceptor_pool.cc:254] collecting diagnostics on the listening RPC socket 0.0.0.0:40907 every 8 connection(s)
I20260928 19:30:28.491086 551 acceptor_pool.cc:254] collecting diagnostics on the listening RPC socket 0.0.0.0:40907 every 8 connection(s)
[ OK ] Parameters/TestRpc.TestHighFDs/SSL_TCP (306 ms)
[ RUN ] Parameters/TestRpc.TestConnectionAlwaysKeepalive/SSL_TCP
I20260928 19:30:28.583688 573 acceptor_pool.cc:254] collecting diagnostics on the listening RPC socket 0.0.0.0:46251 every 8 connection(s)
I20260928 19:30:28.584424 574 acceptor_pool.cc:254] collecting diagnostics on the listening RPC socket 0.0.0.0:46251 every 8 connection(s)
I20260928 19:30:28.588330 390 rpc-test.cc:532] Connecting to 0.0.0.0:46251
[ OK ] Parameters/TestRpc.TestConnectionAlwaysKeepalive/SSL_TCP (3090 ms)
[ RUN ] Parameters/TestRpc.TestReopenOutboundConnections/SSL_TCP
I20260928 19:30:31.655277 596 acceptor_pool.cc:254] collecting diagnostics on the listening RPC socket 0.0.0.0:40565 every 8 connection(s)
I20260928 19:30:31.656073 597 acceptor_pool.cc:254] collecting diagnostics on the listening RPC socket 0.0.0.0:40565 every 8 connection(s)
I20260928 19:30:31.659701 390 rpc-test.cc:658] Connecting to 0.0.0.0:40565
[ OK ] Parameters/TestRpc.TestReopenOutboundConnections/SSL_TCP (473 ms)
[ RUN ] Parameters/TestRpc.TestConnectionNetworkPlane/SSL_TCP
I20260928 19:30:32.145486 619 acceptor_pool.cc:254] collecting diagnostics on the listening RPC socket 0.0.0.0:40103 every 8 connection(s)
I20260928 19:30:32.146440 620 acceptor_pool.cc:254] collecting diagnostics on the listening RPC socket 0.0.0.0:40103 every 8 connection(s)
I20260928 19:30:32.150228 390 rpc-test.cc:772] Connecting to 0.0.0.0:40103
[ OK ] Parameters/TestRpc.TestConnectionNetworkPlane/SSL_TCP (97 ms)
[ RUN ] Parameters/TestRpc.TestTCPKeepalive/SSL_TCP
I20260928 19:30:32.236509 644 acceptor_pool.cc:254] collecting diagnostics on the listening RPC socket 0.0.0.0:43721 every 8 connection(s)
I20260928 19:30:32.237536 645 acceptor_pool.cc:254] collecting diagnostics on the listening RPC socket 0.0.0.0:43721 every 8 connection(s)
I20260928 19:30:32.281646 648 rpc-test-base.h:222] got call: sleep_micros: 8000000 deferred: true
I20260928 19:30:40.286677 648 rpcz_store.cc:275] Call kudu.rpc.GenericCalculatorService.Sleep from 127.0.0.1:54550 (request call id 0) took 8005 ms. Trace:
I20260928 19:30:40.287312 648 rpcz_store.cc:276] 0928 19:30:32.281327 (+ 0us) service_pool.cc:170] Inserting onto call queue
0928 19:30:32.281454 (+ 127us) service_pool.cc:227] Handling call
0928 19:30:40.286462 (+8005008us) inbound_call.cc:173] Queueing success response
Metrics: {}
[ OK ] Parameters/TestRpc.TestTCPKeepalive/SSL_TCP (8096 ms)
[ RUN ] Parameters/TestRpc.TestMaxSmallSidecars/SSL_TCP
I20260928 19:30:40.349534 670 acceptor_pool.cc:254] collecting diagnostics on the listening RPC socket 0.0.0.0:42209 every 8 connection(s)
I20260928 19:30:40.350487 671 acceptor_pool.cc:254] collecting diagnostics on the listening RPC socket 0.0.0.0:42209 every 8 connection(s)
[ OK ] Parameters/TestRpc.TestMaxSmallSidecars/SSL_TCP (251 ms)
[ RUN ] Parameters/TestRpc.TestCallTimeout/SSL_TCP
I20260928 19:30:40.581809 695 acceptor_pool.cc:254] collecting diagnostics on the listening RPC socket 0.0.0.0:43551 every 8 connection(s)
I20260928 19:30:40.582695 696 acceptor_pool.cc:254] collecting diagnostics on the listening RPC socket 0.0.0.0:43551 every 8 connection(s)
I20260928 19:30:40.608669 390 rpc-test-base.h:595] status: Timed out: connection negotiation to 0.0.0.0:43551 for RPC Sleep timed out after 0.000s (ON_OUTBOUND_QUEUE), seconds elapsed: 0.0029618
I20260928 19:30:40.618731 699 rpc-test-base.h:222] got call: sleep_micros: 700000
I20260928 19:30:40.809726 390 rpc-test-base.h:595] status: Timed out: Sleep RPC to 0.0.0.0:43551 timed out after 0.200s (SENT), seconds elapsed: 0.200583
I20260928 19:30:40.811630 698 rpc-test-base.h:222] got call: sleep_micros: 2000000
W20260928 19:30:41.319536 699 rpcz_store.cc:267] Call kudu.rpc.GenericCalculatorService.Sleep from 127.0.0.1:59650 (request call id 1) took 701 ms (client timeout 200 ms). Trace:
W20260928 19:30:41.320149 699 rpcz_store.cc:269] 0928 19:30:40.618521 (+ 0us) service_pool.cc:170] Inserting onto call queue
0928 19:30:40.618646 (+ 125us) service_pool.cc:227] Handling call
0928 19:30:41.319448 (+700802us) inbound_call.cc:173] Queueing success response
Metrics: {}
I20260928 19:30:42.311971 390 rpc-test-base.h:595] status: Timed out: Sleep RPC to 0.0.0.0:43551 timed out after 1.500s (SENT), seconds elapsed: 1.50174
W20260928 19:30:42.812259 698 rpcz_store.cc:267] Call kudu.rpc.GenericCalculatorService.Sleep from 127.0.0.1:59650 (request call id 2) took 2001 ms (client timeout 1500 ms). Trace:
W20260928 19:30:42.812661 698 rpcz_store.cc:269] 0928 19:30:40.811310 (+ 0us) service_pool.cc:170] Inserting onto call queue
0928 19:30:40.811453 (+ 143us) service_pool.cc:227] Handling call
0928 19:30:42.812188 (+2000735us) inbound_call.cc:173] Queueing success response
Metrics: {}
W20260928 19:30:42.813288 692 connection.cc:441] server connection from 127.0.0.1:59650 torn down before Call kudu.rpc.GenericCalculatorService.Sleep from 127.0.0.1:59650 (request call id 2) could send its response
[ OK ] Parameters/TestRpc.TestCallTimeout/SSL_TCP (2266 ms)
[ RUN ] Parameters/TestRpc.TestServerShutsDown/SSL_TCP
I20260928 19:30:42.828719 390 rpc-test.cc:1125] Connecting to 0.0.0.0:45035
W20260928 19:30:42.846536 712 negotiation.cc:337] Failed RPC negotiation. Trace:
0928 19:30:42.844474 (+ 0us) reactor.cc:625] Submitting negotiation task for client connection to 0.0.0.0:45035 (local address 127.0.0.1:41664)
0928 19:30:42.845121 (+ 647us) negotiation.cc:107] Waiting for socket to connect
0928 19:30:42.845170 (+ 49us) client_negotiation.cc:174] Beginning negotiation
0928 19:30:42.845519 (+ 349us) client_negotiation.cc:252] Sending NEGOTIATE NegotiatePB request
0928 19:30:42.845777 (+ 258us) negotiation.cc:327] Negotiation complete: Network error: Client connection negotiation failed: client connection to 0.0.0.0:45035: BlockingWrite error: write error: Broken pipe (error 32)
Metrics: {"client-negotiator.queue_time_us":163}
[ OK ] Parameters/TestRpc.TestServerShutsDown/SSL_TCP (24 ms)
[ RUN ] Parameters/TestRpc.TimedOutOnResponseMetric/SSL_TCP
I20260928 19:30:42.874859 729 acceptor_pool.cc:254] collecting diagnostics on the listening RPC socket 0.0.0.0:32849 every 8 connection(s)
I20260928 19:30:42.875699 730 acceptor_pool.cc:254] collecting diagnostics on the listening RPC socket 0.0.0.0:32849 every 8 connection(s)
W20260928 19:30:43.131422 733 rpcz_store.cc:267] Call kudu.rpc_test.CalculatorService.Sleep from 127.0.0.1:35406 (request call id 3) took 50 ms (client timeout 25 ms). Trace:
W20260928 19:30:43.131924 733 rpcz_store.cc:269] 0928 19:30:43.080672 (+ 0us) service_pool.cc:170] Inserting onto call queue
0928 19:30:43.080831 (+ 159us) service_pool.cc:227] Handling call
0928 19:30:43.131299 (+ 50468us) inbound_call.cc:173] Queueing success response
Related trace 'test_child':
Metrics: {"test_sleep_us":50000,"child_traces":[["test_child",{"related_trace_metric":1}]]}
W20260928 19:30:43.192335 733 rpcz_store.cc:267] Call kudu.rpc_test.CalculatorService.Sleep from 127.0.0.1:35406 (request call id 4) took 50 ms (client timeout 50 ms). Trace:
W20260928 19:30:43.192734 733 rpcz_store.cc:269] 0928 19:30:43.141490 (+ 0us) service_pool.cc:170] Inserting onto call queue
0928 19:30:43.141658 (+ 168us) service_pool.cc:227] Handling call
0928 19:30:43.192243 (+ 50585us) inbound_call.cc:173] Queueing success response
Related trace 'test_child':
Metrics: {"test_sleep_us":50000,"child_traces":[["test_child",{"related_trace_metric":1}]]}
W20260928 19:30:43.196134 728 connection.cc:196] Error closing socket: Network error: TlsSocket::Close: Connection reset by peer
[ OK ] Parameters/TestRpc.TimedOutOnResponseMetric/SSL_TCP (353 ms)
[ RUN ] Parameters/TestRpc.AcceptorDispatchingTimesMetric/SSL_TCP
I20260928 19:30:43.216976 754 acceptor_pool.cc:254] collecting diagnostics on the listening RPC socket 0.0.0.0:33289 every 8 connection(s)
I20260928 19:30:43.217710 755 acceptor_pool.cc:254] collecting diagnostics on the listening RPC socket 0.0.0.0:33289 every 8 connection(s)
W20260928 19:30:43.223748 750 negotiation.cc:337] Failed RPC negotiation. Trace:
0928 19:30:43.221982 (+ 0us) reactor.cc:625] Submitting negotiation task for server connection from 127.0.0.1:34444 (local address 127.0.0.1:33289)
0928 19:30:43.222583 (+ 601us) server_negotiation.cc:206] Beginning negotiation
0928 19:30:43.222604 (+ 21us) server_negotiation.cc:399] Waiting for connection header
0928 19:30:43.222868 (+ 264us) negotiation.cc:327] Negotiation complete: Network error: Server connection negotiation failed: server connection from 127.0.0.1:34444: BlockingRecv error: recv got EOF from 127.0.0.1:34444 (error 108)
Metrics: {"server-negotiator.queue_time_us":126}
[ OK ] Parameters/TestRpc.AcceptorDispatchingTimesMetric/SSL_TCP (26 ms)
[ RUN ] Parameters/TestRpc.TestRpcCallbackDestroysMessenger/SSL_TCP
[ OK ] Parameters/TestRpc.TestRpcCallbackDestroysMessenger/SSL_TCP (22 ms)
[ RUN ] Parameters/TestRpc.TestApplicationFeatureFlag/SSL_TCP
I20260928 19:30:43.285506 779 acceptor_pool.cc:254] collecting diagnostics on the listening RPC socket 0.0.0.0:37993 every 8 connection(s)
I20260928 19:30:43.286320 780 acceptor_pool.cc:254] collecting diagnostics on the listening RPC socket 0.0.0.0:37993 every 8 connection(s)
W20260928 19:30:43.324093 777 messenger.cc:357] Unable to handle RPC call: Not implemented: call requires unsupported application feature flags: 99
[ OK ] Parameters/TestRpc.TestApplicationFeatureFlag/SSL_TCP (83 ms)
[ RUN ] Parameters/TestRpc.TestCancellation/SSL_TCP
I20260928 19:30:43.352736 804 acceptor_pool.cc:254] collecting diagnostics on the listening RPC socket 0.0.0.0:40095 every 8 connection(s)
I20260928 19:30:43.353638 805 acceptor_pool.cc:254] collecting diagnostics on the listening RPC socket 0.0.0.0:40095 every 8 connection(s)
I20260928 19:30:43.357920 390 rpc-test.cc:1648] Connecting to 0.0.0.0:40095
I20260928 19:30:43.483278 390 rpc-test-base.h:595] status: Aborted: Sleep RPC to 0.0.0.0:40095 is cancelled in state READY, seconds elapsed: 0.000587244
I20260928 19:30:43.675297 390 rpc-test-base.h:595] status: Aborted: Sleep RPC to 0.0.0.0:40095 is cancelled in state SENT, seconds elapsed: 0.00131774
I20260928 19:30:43.709736 807 rpc-test-base.h:222] got call: sleep_micros: 510000
I20260928 19:30:43.849269 390 rpc-test-base.h:595] status: Aborted: Sleep RPC to 0.0.0.0:40095 is cancelled in state SENT, seconds elapsed: 0.000948533
I20260928 19:30:43.896327 806 rpc-test-base.h:222] got call: sleep_micros: 510000
I20260928 19:30:44.041270 390 rpc-test-base.h:595] status: Aborted: Sleep RPC to 0.0.0.0:40095 is cancelled in state SENT, seconds elapsed: 0.00130608
W20260928 19:30:44.104108 808 rpcz_store.cc:267] Call kudu.rpc.GenericCalculatorService.Sleep from 127.0.0.1:43032 (request call id 11) took 17 ms (client timeout 10 ms). Trace:
W20260928 19:30:44.104558 808 rpcz_store.cc:269] 0928 19:30:44.086828 (+ 0us) service_pool.cc:170] Inserting onto call queue
0928 19:30:44.103777 (+ 16949us) service_pool.cc:214] Skipping call since client already timed out
0928 19:30:44.103881 (+ 104us) inbound_call.cc:173] Queueing failure response
Metrics: {}
I20260928 19:30:44.105247 808 rpc-test-base.h:222] got call: sleep_micros: 1500000
W20260928 19:30:44.220568 807 rpcz_store.cc:267] Call kudu.rpc.GenericCalculatorService.Sleep from 127.0.0.1:43032 (request call id 3) took 511 ms (client timeout 10 ms). Trace:
W20260928 19:30:44.220955 807 rpcz_store.cc:269] 0928 19:30:43.709377 (+ 0us) service_pool.cc:170] Inserting onto call queue
0928 19:30:43.709624 (+ 247us) service_pool.cc:227] Handling call
0928 19:30:44.220501 (+510877us) inbound_call.cc:173] Queueing success response
Metrics: {}
W20260928 19:30:44.407222 806 rpcz_store.cc:267] Call kudu.rpc.GenericCalculatorService.Sleep from 127.0.0.1:43032 (request call id 7) took 511 ms (client timeout 10 ms). Trace:
W20260928 19:30:44.407636 806 rpcz_store.cc:269] 0928 19:30:43.896008 (+ 0us) service_pool.cc:170] Inserting onto call queue
0928 19:30:43.896232 (+ 224us) service_pool.cc:227] Handling call
0928 19:30:44.407139 (+510907us) inbound_call.cc:173] Queueing success response
Metrics: {}
I20260928 19:30:45.043938 390 rpc-test-base.h:595] status: Timed out: Sleep RPC to 0.0.0.0:40095 timed out after 1.000s (SENT), seconds elapsed: 1.00216
I20260928 19:30:45.045557 806 rpc-test-base.h:222] got call: sleep_micros: 1500000
W20260928 19:30:45.605818 808 rpcz_store.cc:267] Call kudu.rpc.GenericCalculatorService.Sleep from 127.0.0.1:43032 (request call id 12) took 1518 ms (client timeout 1000 ms). Trace:
W20260928 19:30:45.606367 808 rpcz_store.cc:269] 0928 19:30:44.087082 (+ 0us) service_pool.cc:170] Inserting onto call queue
0928 19:30:44.105194 (+ 18112us) service_pool.cc:227] Handling call
0928 19:30:45.605750 (+1500556us) inbound_call.cc:173] Queueing success response
Metrics: {}
I20260928 19:30:46.046216 390 rpc-test-base.h:595] status: Timed out: Sleep RPC to 0.0.0.0:40095 timed out after 1.000s (SENT), seconds elapsed: 1.0019
W20260928 19:30:46.047917 803 messenger.cc:357] Unable to handle RPC call: Not implemented: call requires unsupported application feature flags: 99, 1
W20260928 19:30:46.049772 803 messenger.cc:357] Unable to handle RPC call: Not implemented: call requires unsupported application feature flags: 99, 1
W20260928 19:30:46.546231 806 rpcz_store.cc:267] Call kudu.rpc.GenericCalculatorService.Sleep from 127.0.0.1:43032 (request call id 13) took 1500 ms (client timeout 1000 ms). Trace:
W20260928 19:30:46.546707 806 rpcz_store.cc:269] 0928 19:30:45.045342 (+ 0us) service_pool.cc:170] Inserting onto call queue
0928 19:30:45.045496 (+ 154us) service_pool.cc:227] Handling call
0928 19:30:46.546161 (+1500665us) inbound_call.cc:173] Queueing success response
Metrics: {}
W20260928 19:30:46.547466 803 connection.cc:441] server connection from 127.0.0.1:43032 torn down before Call kudu.rpc.GenericCalculatorService.Sleep from 127.0.0.1:43032 (request call id 13) could send its response
[ OK ] Parameters/TestRpc.TestCancellation/SSL_TCP (3219 ms)
[ RUN ] Parameters/TestRpc.TestCancellationMultiThreads/SSL_TCP
I20260928 19:30:46.605129 829 acceptor_pool.cc:254] collecting diagnostics on the listening RPC socket 0.0.0.0:33009 every 8 connection(s)
I20260928 19:30:46.605947 830 acceptor_pool.cc:254] collecting diagnostics on the listening RPC socket 0.0.0.0:33009 every 8 connection(s)
I20260928 19:30:46.611667 390 rpc-test.cc:1808] Connecting to 0.0.0.0:33009
I20260928 19:30:46.805691 844 test_util.cc:268] Using random seed: 441495599
I20260928 19:30:46.807318 845 test_util.cc:268] Using random seed: 441497195
I20260928 19:30:46.810626 846 test_util.cc:268] Using random seed: 441500503
I20260928 19:30:46.812565 847 test_util.cc:268] Using random seed: 441502378
I20260928 19:30:46.814592 848 test_util.cc:268] Using random seed: 441504474
I20260928 19:30:46.816210 849 test_util.cc:268] Using random seed: 441506098
I20260928 19:30:46.817855 850 test_util.cc:268] Using random seed: 441507705
I20260928 19:30:46.820009 851 test_util.cc:268] Using random seed: 441509841
I20260928 19:30:46.821645 852 test_util.cc:268] Using random seed: 441511508
I20260928 19:30:46.823549 853 test_util.cc:268] Using random seed: 441513357
I20260928 19:30:46.825197 854 test_util.cc:268] Using random seed: 441515051
I20260928 19:30:46.826841 855 test_util.cc:268] Using random seed: 441516734
I20260928 19:30:46.828431 856 test_util.cc:268] Using random seed: 441518326
I20260928 19:30:46.830173 857 test_util.cc:268] Using random seed: 441520040
I20260928 19:30:46.832406 858 test_util.cc:268] Using random seed: 441522226
I20260928 19:30:46.835000 859 test_util.cc:268] Using random seed: 441524845
I20260928 19:30:46.837845 860 test_util.cc:268] Using random seed: 441527678
I20260928 19:30:46.840432 861 test_util.cc:268] Using random seed: 441530278
I20260928 19:30:46.843073 862 test_util.cc:268] Using random seed: 441532862
I20260928 19:30:46.846372 863 test_util.cc:268] Using random seed: 441536184
I20260928 19:30:46.849530 864 test_util.cc:268] Using random seed: 441539315
I20260928 19:30:46.852471 865 test_util.cc:268] Using random seed: 441542199
I20260928 19:30:46.855288 866 test_util.cc:268] Using random seed: 441544415
I20260928 19:30:46.858986 867 test_util.cc:268] Using random seed: 441548774
I20260928 19:30:46.861974 868 test_util.cc:268] Using random seed: 441551095
I20260928 19:30:46.864189 869 test_util.cc:268] Using random seed: 441553994
I20260928 19:30:46.866972 870 test_util.cc:268] Using random seed: 441556807
I20260928 19:30:46.871124 871 test_util.cc:268] Using random seed: 441560892
I20260928 19:30:46.873771 872 test_util.cc:268] Using random seed: 441563639
I20260928 19:30:46.879074 873 test_util.cc:268] Using random seed: 441568964
[ OK ] Parameters/TestRpc.TestCancellationMultiThreads/SSL_TCP (20588 ms)
[ RUN ] Parameters/TestRpc.TestCallId/SSL_TCP
I20260928 19:31:07.175057 887 acceptor_pool.cc:254] collecting diagnostics on the listening RPC socket 0.0.0.0:33725 every 8 connection(s)
I20260928 19:31:07.175909 888 acceptor_pool.cc:254] collecting diagnostics on the listening RPC socket 0.0.0.0:33725 every 8 connection(s)
[ OK ] Parameters/TestRpc.TestCallId/SSL_TCP (98 ms)
[----------] 20 tests from Parameters/TestRpc (40649 ms total)
[----------] Global test environment tear-down
[==========] 21 tests from 2 test suites ran. (40659 ms total)
[ PASSED ] 20 tests.
[ FAILED ] 1 test, listed below:
[ FAILED ] Parameters/TestRpc.TestCallWithChainCertAndRootCA/SSL_TCP, where GetParam() = (true, false)
1 FAILED TEST