Diagnosed failure

Parameters/TestRpc.TestCallWithChainCertAndChainCA/SSL_TCP: /data0/somelongdirectorytoavoidrpathissues/src/kudu/src/kudu/rpc/rpc-test.cc:270: Failure
Failed
Bad status: Runtime error: could not verify certificate chain (error with cert: subject=CN = localhost, ST = sadfjas, C = AS, emailAddress = sdflkdsajf, O = lskdfjlsad, OU = sldfkja, issuer=C = AS, ST = ASDfkjdhf, L = lskdjf, O = saldfja, OU = skdjf, CN = localhost, emailAddress = sadjflkadsj): : certificate has expired
Google Test trace:
/data0/somelongdirectorytoavoidrpathissues/src/kudu/src/kudu/rpc/rpc-test.cc:267: Connecting to 0.0.0.0:38247
I20260929 06:29:12.567051 28698 test_util.cc:175] -----------------------------------------------
I20260929 06:29:12.567099 28698 test_util.cc:176] Had fatal failures, leaving test files at /tmp/dist-test-taskj9Oo39/test-tmp/rpc-test.5.Parameters_TestRpc.TestCallWithChainCertAndChainCA_SSL_TCP.1790663352506586-28698-0

Full log

Note: This is test shard 6 of 8.
[==========] Running 21 tests from 2 test suites.
[----------] Global test environment set-up.
[----------] 20 tests from Parameters/TestRpc
[ RUN      ] Parameters/TestRpc.TestMessengerCreateDestroy/SSL_TCP
WARNING: Logging before InitGoogleLogging() is written to STDERR
I20260929 06:29:12.530005 28698 rpc-test.cc:169] started messenger TestCreateDestroy
[       OK ] Parameters/TestRpc.TestMessengerCreateDestroy/SSL_TCP (21 ms)
[ RUN      ] Parameters/TestRpc.TestNegotiationDeadlock/SSL_TCP
I20260929 06:29:12.535946 28719 acceptor_pool.cc:254] collecting diagnostics on the listening RPC socket 0.0.0.0:35991 every 8 connection(s)
I20260929 06:29:12.535941 28718 acceptor_pool.cc:254] collecting diagnostics on the listening RPC socket 0.0.0.0:35991 every 8 connection(s)
[       OK ] Parameters/TestRpc.TestNegotiationDeadlock/SSL_TCP (12 ms)
[ RUN      ] Parameters/TestRpc.TestCallWithChainCertAndChainCA/SSL_TCP
I20260929 06:29:12.563362 28734 acceptor_pool.cc:254] collecting diagnostics on the listening RPC socket 0.0.0.0:38247 every 8 connection(s)
I20260929 06:29:12.563390 28735 acceptor_pool.cc:254] collecting diagnostics on the listening RPC socket 0.0.0.0:38247 every 8 connection(s)
/data0/somelongdirectorytoavoidrpathissues/src/kudu/src/kudu/rpc/rpc-test.cc:270: Failure
Failed
Bad status: Runtime error: could not verify certificate chain (error with cert: subject=CN = localhost, ST = sadfjas, C = AS, emailAddress = sdflkdsajf, O = lskdfjlsad, OU = sldfkja, issuer=C = AS, ST = ASDfkjdhf, L = lskdjf, O = saldfja, OU = skdjf, CN = localhost, emailAddress = sadjflkadsj): : certificate has expired
Google Test trace:
/data0/somelongdirectorytoavoidrpathissues/src/kudu/src/kudu/rpc/rpc-test.cc:267: Connecting to 0.0.0.0:38247
I20260929 06:29:12.567051 28698 test_util.cc:175] -----------------------------------------------
I20260929 06:29:12.567099 28698 test_util.cc:176] Had fatal failures, leaving test files at /tmp/dist-test-taskj9Oo39/test-tmp/rpc-test.5.Parameters_TestRpc.TestCallWithChainCertAndChainCA_SSL_TCP.1790663352506586-28698-0
[  FAILED  ] Parameters/TestRpc.TestCallWithChainCertAndChainCA/SSL_TCP, where GetParam() = (true, false) (23 ms)
[ RUN      ] Parameters/TestRpc.TestCallWithPasswordProtectedKey/SSL_TCP
I20260929 06:29:12.592413 28759 acceptor_pool.cc:254] collecting diagnostics on the listening RPC socket 0.0.0.0:42087 every 8 connection(s)
I20260929 06:29:12.592438 28760 acceptor_pool.cc:254] collecting diagnostics on the listening RPC socket 0.0.0.0:42087 every 8 connection(s)
[       OK ] Parameters/TestRpc.TestCallWithPasswordProtectedKey/SSL_TCP (37 ms)
[ RUN      ] Parameters/TestRpc.TestCallToBadServer/SSL_TCP
I20260929 06:29:12.610100 28698 rpc-test.cc:394] Status: Network error: Client connection negotiation failed: client connection to 0.0.0.0:0: connect: Connection refused (error 111)
I20260929 06:29:12.610296 28698 rpc-test.cc:394] Status: Network error: Client connection negotiation failed: client connection to 0.0.0.0:0: connect: Connection refused (error 111)
I20260929 06:29:12.610440 28698 rpc-test.cc:394] Status: Network error: Client connection negotiation failed: client connection to 0.0.0.0:0: connect: Connection refused (error 111)
I20260929 06:29:12.610584 28698 rpc-test.cc:394] Status: Network error: Client connection negotiation failed: client connection to 0.0.0.0:0: connect: Connection refused (error 111)
I20260929 06:29:12.610719 28698 rpc-test.cc:394] Status: Network error: Client connection negotiation failed: client connection to 0.0.0.0:0: connect: Connection refused (error 111)
[       OK ] Parameters/TestRpc.TestCallToBadServer/SSL_TCP (6 ms)
[ RUN      ] Parameters/TestRpc.TestWrongService/SSL_TCP
I20260929 06:29:12.637703 28794 acceptor_pool.cc:254] collecting diagnostics on the listening RPC socket 0.0.0.0:37161 every 8 connection(s)
I20260929 06:29:12.637720 28795 acceptor_pool.cc:254] collecting diagnostics on the listening RPC socket 0.0.0.0:37161 every 8 connection(s)
I20260929 06:29:12.659837 28791 messenger.cc:345] service WrongServiceName not registered on TestServer
[       OK ] Parameters/TestRpc.TestWrongService/SSL_TCP (50 ms)
[ RUN      ] Parameters/TestRpc.TestConnectionKeepalive/SSL_TCP
I20260929 06:29:12.709201 28817 acceptor_pool.cc:254] collecting diagnostics on the listening RPC socket 0.0.0.0:44345 every 8 connection(s)
I20260929 06:29:12.709231 28818 acceptor_pool.cc:254] collecting diagnostics on the listening RPC socket 0.0.0.0:44345 every 8 connection(s)
I20260929 06:29:12.709364 28698 rpc-test.cc:488] Connecting to 0.0.0.0:44345
[       OK ] Parameters/TestRpc.TestConnectionKeepalive/SSL_TCP (1068 ms)
[ RUN      ] Parameters/TestRpc.TestClientConnectionMetrics/SSL_TCP
I20260929 06:29:13.749534 28842 acceptor_pool.cc:254] collecting diagnostics on the listening RPC socket 0.0.0.0:38521 every 8 connection(s)
I20260929 06:29:13.749583 28843 acceptor_pool.cc:254] collecting diagnostics on the listening RPC socket 0.0.0.0:38521 every 8 connection(s)
I20260929 06:29:13.749704 28698 rpc-test.cc:569] Connecting to 0.0.0.0:38521
[       OK ] Parameters/TestRpc.TestClientConnectionMetrics/SSL_TCP (8519 ms)
[ RUN      ] Parameters/TestRpc.TestCredentialsPolicy/SSL_TCP
I20260929 06:29:22.271935 28865 acceptor_pool.cc:254] collecting diagnostics on the listening RPC socket 0.0.0.0:45557 every 8 connection(s)
I20260929 06:29:22.271967 28866 acceptor_pool.cc:254] collecting diagnostics on the listening RPC socket 0.0.0.0:45557 every 8 connection(s)
I20260929 06:29:22.272080 28698 rpc-test.cc:700] Connecting to 0.0.0.0:45557
[       OK ] Parameters/TestRpc.TestCredentialsPolicy/SSL_TCP (48 ms)
[ RUN      ] Parameters/TestRpc.TestCallLongerThanKeepalive/SSL_TCP
I20260929 06:29:22.324420 28890 acceptor_pool.cc:254] collecting diagnostics on the listening RPC socket 0.0.0.0:36871 every 8 connection(s)
I20260929 06:29:22.324458 28891 acceptor_pool.cc:254] collecting diagnostics on the listening RPC socket 0.0.0.0:36871 every 8 connection(s)
I20260929 06:29:22.340106 28894 rpc-test-base.h:222] got call: sleep_micros: 3000000 deferred: true
I20260929 06:29:25.340780 28894 rpcz_store.cc:275] Call kudu.rpc.GenericCalculatorService.Sleep from 127.0.0.1:54320 (request call id 0) took 3000 ms. Trace:
I20260929 06:29:25.340898 28894 rpcz_store.cc:276] 0929 06:29:22.340044 (+     0us) service_pool.cc:170] Inserting onto call queue
0929 06:29:22.340081 (+    37us) service_pool.cc:227] Handling call
0929 06:29:25.340765 (+3000684us) inbound_call.cc:173] Queueing success response
Metrics: {}
[       OK ] Parameters/TestRpc.TestCallLongerThanKeepalive/SSL_TCP (3044 ms)
[ RUN      ] Parameters/TestRpc.TestRpcSidecar/SSL_TCP
I20260929 06:29:25.356176 28915 acceptor_pool.cc:254] collecting diagnostics on the listening RPC socket 0.0.0.0:43853 every 8 connection(s)
I20260929 06:29:25.356199 28916 acceptor_pool.cc:254] collecting diagnostics on the listening RPC socket 0.0.0.0:43853 every 8 connection(s)
[       OK ] Parameters/TestRpc.TestRpcSidecar/SSL_TCP (52 ms)
[ RUN      ] Parameters/TestRpc.TestRpcSidecarLimits/SSL_TCP
I20260929 06:29:26.971159 28940 acceptor_pool.cc:254] collecting diagnostics on the listening RPC socket 0.0.0.0:40177 every 8 connection(s)
I20260929 06:29:26.971170 28941 acceptor_pool.cc:254] collecting diagnostics on the listening RPC socket 0.0.0.0:40177 every 8 connection(s)
W20260929 06:29:26.994828 28698 serialization.cc:72] Serialized kudu.rpc_test.PushStringsRequestPB (2147483654 bytes) is larger than the maximum configured RPC message size (52428800 bytes). Sending anyway, but peer may reject the data.
W20260929 06:29:26.998106 28939 connection.cc:535] server connection from 127.0.0.1:57184 recv error: Network error: RPC frame had a length of 2147483714, but we only support messages up to 52428800 bytes long.
W20260929 06:29:26.998167 28939 connection.cc:158] shutting down server connection from 127.0.0.1:57184 with pending inbound data: 4/2147483714 bytes received; last active 0 ns ago: status Network error: RPC frame had a length of 2147483714, but we only support messages up to 52428800 bytes long.
W20260929 06:29:26.998466 28953 connection.cc:196] Error closing socket: Network error: TlsSocket::Close: Connection reset by peer
I20260929 06:29:27.009778 28965 acceptor_pool.cc:254] collecting diagnostics on the listening RPC socket 0.0.0.0:40579 every 8 connection(s)
I20260929 06:29:27.009861 28966 acceptor_pool.cc:254] collecting diagnostics on the listening RPC socket 0.0.0.0:40579 every 8 connection(s)
W20260929 06:29:30.660266 28962 connection.cc:577] server connection from 127.0.0.1:60104: received bad data: 'Corruption: Invalid packet: message had a length of 2147483710, but we only support messages up to 2147483647 bytes
'
[       OK ] Parameters/TestRpc.TestRpcSidecarLimits/SSL_TCP (5267 ms)
[ RUN      ] Parameters/TestRpc.TestCallTimeoutDoesntAffectNegotiation/SSL_TCP
I20260929 06:29:30.680662 28990 acceptor_pool.cc:254] collecting diagnostics on the listening RPC socket 0.0.0.0:34121 every 8 connection(s)
I20260929 06:29:30.680701 28991 acceptor_pool.cc:254] collecting diagnostics on the listening RPC socket 0.0.0.0:34121 every 8 connection(s)
W20260929 06:29:30.688107 28986 negotiation.cc:266] Injecting 500ms delay in negotiation
I20260929 06:29:30.738464 28698 rpc-test-base.h:595] status: Timed out: connection negotiation to 0.0.0.0:34121 for RPC Sleep timed out after 0.050s (ON_OUTBOUND_QUEUE), seconds elapsed: 0.0506663
[       OK ] Parameters/TestRpc.TestCallTimeoutDoesntAffectNegotiation/SSL_TCP (530 ms)
[ RUN      ] Parameters/TestRpc.TestRpcHandlerLatencyMetric/SSL_TCP
I20260929 06:29:31.210776 29015 acceptor_pool.cc:254] collecting diagnostics on the listening RPC socket 0.0.0.0:46797 every 8 connection(s)
I20260929 06:29:31.210866 29016 acceptor_pool.cc:254] collecting diagnostics on the listening RPC socket 0.0.0.0:46797 every 8 connection(s)
I20260929 06:29:31.252056 28698 rpc-test.cc:1236] Sleep() min lat: 20312
I20260929 06:29:31.252207 28698 rpc-test.cc:1237] Sleep() mean lat: 20312
I20260929 06:29:31.252259 28698 rpc-test.cc:1238] Sleep() max lat: 20312
I20260929 06:29:31.252277 28698 rpc-test.cc:1239] Sleep() #calls: 1
[       OK ] Parameters/TestRpc.TestRpcHandlerLatencyMetric/SSL_TCP (61 ms)
[ RUN      ] Parameters/TestRpc.TimedOutOnResponseMetricServiceQueue/SSL_TCP
I20260929 06:29:31.271754 29041 acceptor_pool.cc:254] collecting diagnostics on the listening RPC socket 0.0.0.0:38245 every 8 connection(s)
I20260929 06:29:31.271786 29042 acceptor_pool.cc:254] collecting diagnostics on the listening RPC socket 0.0.0.0:38245 every 8 connection(s)
W20260929 06:29:31.325312 29043 rpcz_store.cc:267] Call kudu.rpc_test.CalculatorService.Sleep from 127.0.0.1:35016 (request call id 2) took 20 ms (client timeout 20 ms). Trace:
W20260929 06:29:31.325403 29043 rpcz_store.cc:269] 0929 06:29:31.305002 (+     0us) service_pool.cc:170] Inserting onto call queue
0929 06:29:31.325289 (+ 20287us) service_pool.cc:214] Skipping call since client already timed out
0929 06:29:31.325298 (+     9us) inbound_call.cc:173] Queueing failure response
Metrics: {}
[       OK ] Parameters/TestRpc.TimedOutOnResponseMetricServiceQueue/SSL_TCP (72 ms)
[ RUN      ] Parameters/TestRpc.RpcPendingConnectionsMetric/SSL_TCP
I20260929 06:29:31.328521 29064 acceptor_pool.cc:254] collecting diagnostics on the listening RPC socket 0.0.0.0:43811 every 8 connection(s)
I20260929 06:29:31.328529 29065 acceptor_pool.cc:254] collecting diagnostics on the listening RPC socket 0.0.0.0:43811 every 8 connection(s)
W20260929 06:29:31.329233 29060 negotiation.cc:337] Failed RPC negotiation. Trace:
0929 06:29:31.329070 (+     0us) reactor.cc:625] Submitting negotiation task for server connection from 127.0.0.1:54052 (local address 127.0.0.1:43811)
0929 06:29:31.329116 (+    46us) server_negotiation.cc:206] Beginning negotiation
0929 06:29:31.329118 (+     2us) server_negotiation.cc:399] Waiting for connection header
0929 06:29:31.329174 (+    56us) negotiation.cc:327] Negotiation complete: Network error: Server connection negotiation failed: server connection from 127.0.0.1:54052: BlockingRecv error: recv got EOF from 127.0.0.1:54052 (error 108)
Metrics: {"server-negotiator.queue_time_us":18}
[       OK ] Parameters/TestRpc.RpcPendingConnectionsMetric/SSL_TCP (13 ms)
[ RUN      ] Parameters/TestRpc.TestRpcContextClientDeadline/SSL_TCP
I20260929 06:29:31.350786 29080 acceptor_pool.cc:254] collecting diagnostics on the listening RPC socket 0.0.0.0:45729 every 8 connection(s)
I20260929 06:29:31.350829 29081 acceptor_pool.cc:254] collecting diagnostics on the listening RPC socket 0.0.0.0:45729 every 8 connection(s)
[       OK ] Parameters/TestRpc.TestRpcContextClientDeadline/SSL_TCP (44 ms)
[ RUN      ] Parameters/TestRpc.TestApplicationFeatureFlagUnsupportedServer/SSL_TCP
I20260929 06:29:31.398630 29105 acceptor_pool.cc:254] collecting diagnostics on the listening RPC socket 0.0.0.0:37373 every 8 connection(s)
I20260929 06:29:31.398689 29106 acceptor_pool.cc:254] collecting diagnostics on the listening RPC socket 0.0.0.0:37373 every 8 connection(s)
[       OK ] Parameters/TestRpc.TestApplicationFeatureFlagUnsupportedServer/SSL_TCP (28 ms)
[ RUN      ] Parameters/TestRpc.TestCancellationAsync/SSL_TCP
I20260929 06:29:31.428236 29130 acceptor_pool.cc:254] collecting diagnostics on the listening RPC socket 0.0.0.0:34583 every 8 connection(s)
I20260929 06:29:31.428277 29131 acceptor_pool.cc:254] collecting diagnostics on the listening RPC socket 0.0.0.0:34583 every 8 connection(s)
I20260929 06:29:31.428393 28698 rpc-test.cc:1716] Connecting to 0.0.0.0:34583
I20260929 06:29:31.457988 28698 test_util.cc:268] Using random seed: 1311442369
I20260929 06:29:31.476649 29133 rpc-test-base.h:240] got call: sleep_micros: 500 pattern: 4294967295 num_repetitions: 2097152 sidecar_idx: 0
I20260929 06:29:31.492632 29133 rpc-test-base.h:240] got call: sleep_micros: 500 pattern: 4294967295 num_repetitions: 2097152 sidecar_idx: 0
I20260929 06:29:31.508457 29133 rpc-test-base.h:240] got call: sleep_micros: 500 pattern: 4294967295 num_repetitions: 2097152 sidecar_idx: 0
I20260929 06:29:31.524158 29133 rpc-test-base.h:240] got call: sleep_micros: 500 pattern: 4294967295 num_repetitions: 2097152 sidecar_idx: 0
I20260929 06:29:31.539736 29133 rpc-test-base.h:240] got call: sleep_micros: 500 pattern: 4294967295 num_repetitions: 2097152 sidecar_idx: 0
I20260929 06:29:31.554414 29133 rpc-test-base.h:240] got call: sleep_micros: 500 pattern: 4294967295 num_repetitions: 2097152 sidecar_idx: 0
I20260929 06:29:31.565439 29133 rpc-test-base.h:240] got call: sleep_micros: 500 pattern: 4294967295 num_repetitions: 2097152 sidecar_idx: 0
W20260929 06:29:31.568645 29128 connection.cc:441] server connection from 127.0.0.1:56192 torn down before Call kudu.rpc.GenericCalculatorService.SleepWithSidecar from 127.0.0.1:56192 (request call id 9) could send its response
[       OK ] Parameters/TestRpc.TestCancellationAsync/SSL_TCP (156 ms)
[ RUN      ] Parameters/TestRpc.TestPerformanceBySocketType/SSL_TCP
I20260929 06:29:31.606701 29155 acceptor_pool.cc:254] collecting diagnostics on the listening RPC socket 0.0.0.0:42449 every 8 connection(s)
I20260929 06:29:31.606738 29156 acceptor_pool.cc:254] collecting diagnostics on the listening RPC socket 0.0.0.0:42449 every 8 connection(s)
I20260929 06:29:31.606873 28698 rpc-test.cc:1846] Connecting to 0.0.0.0:42449
I20260929 06:29:33.190841 28698 rpc-test.cc:1859] Sending 1024MB via ssl-enabled tcp socket: real 1.579s	user 1.484s	sys 1.317s
I20260929 06:29:34.717371 28698 rpc-test.cc:1859] Sending 1024MB via ssl-enabled tcp socket: real 1.526s	user 1.451s	sys 1.267s
I20260929 06:29:36.247197 28698 rpc-test.cc:1859] Sending 1024MB via ssl-enabled tcp socket: real 1.530s	user 1.518s	sys 1.197s
I20260929 06:29:37.823145 28698 rpc-test.cc:1859] Sending 1024MB via ssl-enabled tcp socket: real 1.576s	user 1.522s	sys 1.263s
I20260929 06:29:39.389631 28698 rpc-test.cc:1859] Sending 1024MB via ssl-enabled tcp socket: real 1.566s	user 1.451s	sys 1.322s
[       OK ] Parameters/TestRpc.TestPerformanceBySocketType/SSL_TCP (7821 ms)
[----------] 20 tests from Parameters/TestRpc (26882 ms total)

[----------] 1 test from Parameters/TestRpcSocketTxRxQueue
[ RUN      ] Parameters/TestRpcSocketTxRxQueue.OverCapacity/0
W20260929 06:29:39.655237 29199 negotiation.cc:337] Failed RPC negotiation. Trace:
0929 06:29:39.395279 (+     0us) reactor.cc:625] Submitting negotiation task for client connection to 0.0.0.0:39581 (local address 127.0.0.1:51958)
0929 06:29:39.395324 (+    45us) negotiation.cc:107] Waiting for socket to connect
0929 06:29:39.395331 (+     7us) client_negotiation.cc:174] Beginning negotiation
0929 06:29:39.395365 (+    34us) client_negotiation.cc:252] Sending NEGOTIATE NegotiatePB request
0929 06:29:39.655085 (+259720us) negotiation.cc:327] Negotiation complete: Network error: Client connection negotiation failed: client connection to 0.0.0.0:39581: BlockingRecv error: recv error from unknown peer: Transport endpoint is not connected (error 107)
Metrics: {"client-negotiator.queue_time_us":26}
W20260929 06:29:39.655239 29190 negotiation.cc:337] Failed RPC negotiation. Trace:
0929 06:29:39.394483 (+     0us) reactor.cc:625] Submitting negotiation task for client connection to 0.0.0.0:39581 (local address 127.0.0.1:51948)
0929 06:29:39.394547 (+    64us) negotiation.cc:107] Waiting for socket to connect
0929 06:29:39.394557 (+    10us) client_negotiation.cc:174] Beginning negotiation
0929 06:29:39.394602 (+    45us) client_negotiation.cc:252] Sending NEGOTIATE NegotiatePB request
0929 06:29:39.655100 (+260498us) negotiation.cc:327] Negotiation complete: Network error: Client connection negotiation failed: client connection to 0.0.0.0:39581: BlockingRecv error: recv error from unknown peer: Transport endpoint is not connected (error 107)
Metrics: {"client-negotiator.queue_time_us":42}
W20260929 06:29:39.655385 29171 negotiation.cc:337] Failed RPC negotiation. Trace:
0929 06:29:39.392854 (+     0us) reactor.cc:625] Submitting negotiation task for client connection to 0.0.0.0:39581 (local address 127.0.0.1:51944)
0929 06:29:39.392930 (+    76us) negotiation.cc:107] Waiting for socket to connect
0929 06:29:39.392944 (+    14us) client_negotiation.cc:174] Beginning negotiation
0929 06:29:39.393000 (+    56us) client_negotiation.cc:252] Sending NEGOTIATE NegotiatePB request
0929 06:29:39.655094 (+262094us) negotiation.cc:327] Negotiation complete: Network error: Client connection negotiation failed: client connection to 0.0.0.0:39581: BlockingRecv error: recv error from unknown peer: Transport endpoint is not connected (error 107)
Metrics: {"client-negotiator.queue_time_us":35}
W20260929 06:29:39.655406 29180 negotiation.cc:337] Failed RPC negotiation. Trace:
0929 06:29:39.393682 (+     0us) reactor.cc:625] Submitting negotiation task for client connection to 0.0.0.0:39581 (local address 127.0.0.1:51946)
0929 06:29:39.393721 (+    39us) negotiation.cc:107] Waiting for socket to connect
0929 06:29:39.393728 (+     7us) client_negotiation.cc:174] Beginning negotiation
0929 06:29:39.393765 (+    37us) client_negotiation.cc:252] Sending NEGOTIATE NegotiatePB request
0929 06:29:39.655094 (+261329us) negotiation.cc:327] Negotiation complete: Network error: Client connection negotiation failed: client connection to 0.0.0.0:39581: BlockingRecv error: recv error from unknown peer: Transport endpoint is not connected (error 107)
Metrics: {"client-negotiator.queue_time_us":18}
W20260929 06:29:39.655511 29217 negotiation.cc:337] Failed RPC negotiation. Trace:
0929 06:29:39.396970 (+     0us) reactor.cc:625] Submitting negotiation task for client connection to 0.0.0.0:39581 (local address 127.0.0.1:51986)
0929 06:29:39.397004 (+    34us) negotiation.cc:107] Waiting for socket to connect
0929 06:29:39.397011 (+     7us) client_negotiation.cc:174] Beginning negotiation
0929 06:29:39.397046 (+    35us) client_negotiation.cc:252] Sending NEGOTIATE NegotiatePB request
0929 06:29:39.655469 (+258423us) negotiation.cc:327] Negotiation complete: Network error: Client connection negotiation failed: client connection to 0.0.0.0:39581: BlockingRecv error: recv error from unknown peer: Transport endpoint is not connected (error 107)
Metrics: {"client-negotiator.queue_time_us":17}
W20260929 06:29:39.655514 29208 negotiation.cc:337] Failed RPC negotiation. Trace:
0929 06:29:39.396108 (+     0us) reactor.cc:625] Submitting negotiation task for client connection to 0.0.0.0:39581 (local address 127.0.0.1:51972)
0929 06:29:39.396149 (+    41us) negotiation.cc:107] Waiting for socket to connect
0929 06:29:39.396159 (+    10us) client_negotiation.cc:174] Beginning negotiation
0929 06:29:39.396202 (+    43us) client_negotiation.cc:252] Sending NEGOTIATE NegotiatePB request
0929 06:29:39.655471 (+259269us) negotiation.cc:327] Negotiation complete: Network error: Client connection negotiation failed: client connection to 0.0.0.0:39581: BlockingRecv error: recv error from unknown peer: Transport endpoint is not connected (error 107)
Metrics: {"client-negotiator.queue_time_us":19}
[       OK ] Parameters/TestRpcSocketTxRxQueue.OverCapacity/0 (1029 ms)
[----------] 1 test from Parameters/TestRpcSocketTxRxQueue (1029 ms total)

[----------] Global test environment tear-down
[==========] 21 tests from 2 test suites ran. (27912 ms total)
[  PASSED  ] 20 tests.
[  FAILED  ] 1 test, listed below:
[  FAILED  ] Parameters/TestRpc.TestCallWithChainCertAndChainCA/SSL_TCP, where GetParam() = (true, false)

 1 FAILED TEST