Diagnosed failure

Parameters/TestRpc.TestCallWithChainCertAndChainCA/SSL_UnixSocket: /data0/somelongdirectorytoavoidrpathissues/src/kudu/src/kudu/rpc/rpc-test.cc:270: Failure
Failed
Bad status: Runtime error: could not verify certificate chain (error with cert: subject=CN = localhost, ST = sadfjas, C = AS, emailAddress = sdflkdsajf, O = lskdfjlsad, OU = sldfkja, issuer=C = AS, ST = ASDfkjdhf, L = lskdjf, O = saldfja, OU = skdjf, CN = localhost, emailAddress = sadjflkadsj): : certificate has expired
Google Test trace:
/data0/somelongdirectorytoavoidrpathissues/src/kudu/src/kudu/rpc/rpc-test.cc:267: Connecting to unix:/tmp/dist-test-taskeLoISS/test-tmp/rpc-test-583a7e4c730c4f61944ea2f5fc87ee1c.sock
I20260927 18:34:36.037211 17332 test_util.cc:175] -----------------------------------------------
I20260927 18:34:36.037263 17332 test_util.cc:176] Had fatal failures, leaving test files at /tmp/dist-test-taskeLoISS/test-tmp/rpc-test.6.Parameters_TestRpc.TestCallWithChainCertAndChainCA_SSL_UnixSocket.1790534075985265-17332-0

Full log

Note: This is test shard 7 of 8.
[==========] Running 21 tests from 2 test suites.
[----------] Global test environment set-up.
[----------] 20 tests from Parameters/TestRpc
[ RUN      ] Parameters/TestRpc.TestMessengerCreateDestroy/SSL_UnixSocket
WARNING: Logging before InitGoogleLogging() is written to STDERR
I20260927 18:34:36.002645 17332 rpc-test.cc:169] started messenger TestCreateDestroy
[       OK ] Parameters/TestRpc.TestMessengerCreateDestroy/SSL_UnixSocket (15 ms)
[ RUN      ] Parameters/TestRpc.TestNegotiationDeadlock/SSL_UnixSocket
I20260927 18:34:36.012734 17352 acceptor_pool.cc:254] collecting diagnostics on the listening RPC socket unix:/tmp/dist-test-taskeLoISS/test-tmp/rpc-test-2c2206d0e0284ccf92453e3cb788b6b0.sock every 8 connection(s)
I20260927 18:34:36.012763 17353 acceptor_pool.cc:254] collecting diagnostics on the listening RPC socket unix:/tmp/dist-test-taskeLoISS/test-tmp/rpc-test-2c2206d0e0284ccf92453e3cb788b6b0.sock every 8 connection(s)
[       OK ] Parameters/TestRpc.TestNegotiationDeadlock/SSL_UnixSocket (15 ms)
[ RUN      ] Parameters/TestRpc.TestCallWithChainCertAndChainCA/SSL_UnixSocket
I20260927 18:34:36.033519 17369 acceptor_pool.cc:254] collecting diagnostics on the listening RPC socket unix:/tmp/dist-test-taskeLoISS/test-tmp/rpc-test-583a7e4c730c4f61944ea2f5fc87ee1c.sock every 8 connection(s)
I20260927 18:34:36.033520 17368 acceptor_pool.cc:254] collecting diagnostics on the listening RPC socket unix:/tmp/dist-test-taskeLoISS/test-tmp/rpc-test-583a7e4c730c4f61944ea2f5fc87ee1c.sock every 8 connection(s)
/data0/somelongdirectorytoavoidrpathissues/src/kudu/src/kudu/rpc/rpc-test.cc:270: Failure
Failed
Bad status: Runtime error: could not verify certificate chain (error with cert: subject=CN = localhost, ST = sadfjas, C = AS, emailAddress = sdflkdsajf, O = lskdfjlsad, OU = sldfkja, issuer=C = AS, ST = ASDfkjdhf, L = lskdjf, O = saldfja, OU = skdjf, CN = localhost, emailAddress = sadjflkadsj): : certificate has expired
Google Test trace:
/data0/somelongdirectorytoavoidrpathissues/src/kudu/src/kudu/rpc/rpc-test.cc:267: Connecting to unix:/tmp/dist-test-taskeLoISS/test-tmp/rpc-test-583a7e4c730c4f61944ea2f5fc87ee1c.sock
I20260927 18:34:36.037211 17332 test_util.cc:175] -----------------------------------------------
I20260927 18:34:36.037263 17332 test_util.cc:176] Had fatal failures, leaving test files at /tmp/dist-test-taskeLoISS/test-tmp/rpc-test.6.Parameters_TestRpc.TestCallWithChainCertAndChainCA_SSL_UnixSocket.1790534075985265-17332-0
[  FAILED  ] Parameters/TestRpc.TestCallWithChainCertAndChainCA/SSL_UnixSocket, where GetParam() = (true, true) (18 ms)
[ RUN      ] Parameters/TestRpc.TestCallWithPasswordProtectedKey/SSL_UnixSocket
I20260927 18:34:36.051117 17394 acceptor_pool.cc:254] collecting diagnostics on the listening RPC socket unix:/tmp/dist-test-taskeLoISS/test-tmp/rpc-test-a8e3c1d6e69e4b59926b8c85fe310946.sock every 8 connection(s)
I20260927 18:34:36.051105 17393 acceptor_pool.cc:254] collecting diagnostics on the listening RPC socket unix:/tmp/dist-test-taskeLoISS/test-tmp/rpc-test-a8e3c1d6e69e4b59926b8c85fe310946.sock every 8 connection(s)
W20260927 18:34:36.061682 17390 connection.cc:196] Error closing socket: Network error: TlsSocket::Close: Broken pipe
[       OK ] Parameters/TestRpc.TestCallWithPasswordProtectedKey/SSL_UnixSocket (25 ms)
[ RUN      ] Parameters/TestRpc.TestCallToBadServer/SSL_UnixSocket
I20260927 18:34:36.073720 17332 rpc-test.cc:394] Status: Network error: Client connection negotiation failed: client connection to 0.0.0.0:0: connect: Connection refused (error 111)
I20260927 18:34:36.073977 17332 rpc-test.cc:394] Status: Network error: Client connection negotiation failed: client connection to 0.0.0.0:0: connect: Connection refused (error 111)
I20260927 18:34:36.074162 17332 rpc-test.cc:394] Status: Network error: Client connection negotiation failed: client connection to 0.0.0.0:0: connect: Connection refused (error 111)
I20260927 18:34:36.074311 17332 rpc-test.cc:394] Status: Network error: Client connection negotiation failed: client connection to 0.0.0.0:0: connect: Connection refused (error 111)
I20260927 18:34:36.074470 17332 rpc-test.cc:394] Status: Network error: Client connection negotiation failed: client connection to 0.0.0.0:0: connect: Connection refused (error 111)
[       OK ] Parameters/TestRpc.TestCallToBadServer/SSL_UnixSocket (12 ms)
[ RUN      ] Parameters/TestRpc.TestWrongService/SSL_UnixSocket
I20260927 18:34:36.079392 17428 acceptor_pool.cc:254] collecting diagnostics on the listening RPC socket unix:/tmp/dist-test-taskeLoISS/test-tmp/rpc-test-b0de634a4fba40afbb9f8e3879163b30.sock every 8 connection(s)
I20260927 18:34:36.079433 17429 acceptor_pool.cc:254] collecting diagnostics on the listening RPC socket unix:/tmp/dist-test-taskeLoISS/test-tmp/rpc-test-b0de634a4fba40afbb9f8e3879163b30.sock every 8 connection(s)
I20260927 18:34:36.092420 17425 messenger.cc:345] service WrongServiceName not registered on TestServer
[       OK ] Parameters/TestRpc.TestWrongService/SSL_UnixSocket (18 ms)
[ RUN      ] Parameters/TestRpc.TestConnectionKeepalive/SSL_UnixSocket
I20260927 18:34:36.098377 17451 acceptor_pool.cc:254] collecting diagnostics on the listening RPC socket unix:/tmp/dist-test-taskeLoISS/test-tmp/rpc-test-b1afe02e40484f8a80d24abe3aa7562f.sock every 8 connection(s)
I20260927 18:34:36.098433 17452 acceptor_pool.cc:254] collecting diagnostics on the listening RPC socket unix:/tmp/dist-test-taskeLoISS/test-tmp/rpc-test-b1afe02e40484f8a80d24abe3aa7562f.sock every 8 connection(s)
I20260927 18:34:36.098568 17332 rpc-test.cc:488] Connecting to unix:/tmp/dist-test-taskeLoISS/test-tmp/rpc-test-b1afe02e40484f8a80d24abe3aa7562f.sock
W20260927 18:34:36.595342 17464 connection.cc:196] Error closing socket: Network error: TlsSocket::Close: Broken pipe
[       OK ] Parameters/TestRpc.TestConnectionKeepalive/SSL_UnixSocket (1025 ms)
[ RUN      ] Parameters/TestRpc.TestClientConnectionMetrics/SSL_UnixSocket
I20260927 18:34:37.129920 17476 acceptor_pool.cc:254] collecting diagnostics on the listening RPC socket unix:/tmp/dist-test-taskeLoISS/test-tmp/rpc-test-0328be2eee334452b8f162de4e902c4a.sock every 8 connection(s)
I20260927 18:34:37.129944 17477 acceptor_pool.cc:254] collecting diagnostics on the listening RPC socket unix:/tmp/dist-test-taskeLoISS/test-tmp/rpc-test-0328be2eee334452b8f162de4e902c4a.sock every 8 connection(s)
I20260927 18:34:37.130081 17332 rpc-test.cc:569] Connecting to unix:/tmp/dist-test-taskeLoISS/test-tmp/rpc-test-0328be2eee334452b8f162de4e902c4a.sock
W20260927 18:34:44.983062 17473 connection.cc:196] Error closing socket: Network error: TlsSocket::Close: Broken pipe
[       OK ] Parameters/TestRpc.TestClientConnectionMetrics/SSL_UnixSocket (7864 ms)
[ RUN      ] Parameters/TestRpc.TestCredentialsPolicy/SSL_UnixSocket
I20260927 18:34:44.997587 17499 acceptor_pool.cc:254] collecting diagnostics on the listening RPC socket unix:/tmp/dist-test-taskeLoISS/test-tmp/rpc-test-1f512d52155d402091ac237cfc8bee81.sock every 8 connection(s)
I20260927 18:34:44.997638 17500 acceptor_pool.cc:254] collecting diagnostics on the listening RPC socket unix:/tmp/dist-test-taskeLoISS/test-tmp/rpc-test-1f512d52155d402091ac237cfc8bee81.sock every 8 connection(s)
I20260927 18:34:44.997774 17332 rpc-test.cc:700] Connecting to unix:/tmp/dist-test-taskeLoISS/test-tmp/rpc-test-1f512d52155d402091ac237cfc8bee81.sock
W20260927 18:34:45.016500 17498 connection.cc:196] Error closing socket: Network error: TlsSocket::Close: Broken pipe
[       OK ] Parameters/TestRpc.TestCredentialsPolicy/SSL_UnixSocket (36 ms)
[ RUN      ] Parameters/TestRpc.TestCallLongerThanKeepalive/SSL_UnixSocket
I20260927 18:34:45.039659 17525 acceptor_pool.cc:254] collecting diagnostics on the listening RPC socket unix:/tmp/dist-test-taskeLoISS/test-tmp/rpc-test-1af56bd13a9b48b5a6db899af71762dd.sock every 8 connection(s)
I20260927 18:34:45.039667 17524 acceptor_pool.cc:254] collecting diagnostics on the listening RPC socket unix:/tmp/dist-test-taskeLoISS/test-tmp/rpc-test-1af56bd13a9b48b5a6db899af71762dd.sock every 8 connection(s)
I20260927 18:34:45.063468 17528 rpc-test-base.h:222] got call: sleep_micros: 3000000 deferred: true
I20260927 18:34:48.064175 17528 rpcz_store.cc:275] Call kudu.rpc.GenericCalculatorService.Sleep from unix:<unnamed> (request call id 0) took 3000 ms. Trace:
I20260927 18:34:48.064278 17528 rpcz_store.cc:276] 0927 18:34:45.063391 (+     0us) service_pool.cc:170] Inserting onto call queue
0927 18:34:45.063447 (+    56us) service_pool.cc:227] Handling call
0927 18:34:48.064160 (+3000713us) inbound_call.cc:173] Queueing success response
Metrics: {}
[       OK ] Parameters/TestRpc.TestCallLongerThanKeepalive/SSL_UnixSocket (3045 ms)
[ RUN      ] Parameters/TestRpc.TestRpcSidecar/SSL_UnixSocket
I20260927 18:34:48.096489 17549 acceptor_pool.cc:254] collecting diagnostics on the listening RPC socket unix:/tmp/dist-test-taskeLoISS/test-tmp/rpc-test-eb7d2220ea5344ef83339755e59604c3.sock every 8 connection(s)
I20260927 18:34:48.096534 17550 acceptor_pool.cc:254] collecting diagnostics on the listening RPC socket unix:/tmp/dist-test-taskeLoISS/test-tmp/rpc-test-eb7d2220ea5344ef83339755e59604c3.sock every 8 connection(s)
[       OK ] Parameters/TestRpc.TestRpcSidecar/SSL_UnixSocket (68 ms)
[ RUN      ] Parameters/TestRpc.TestRpcSidecarLimits/SSL_UnixSocket
I20260927 18:34:49.789285 17574 acceptor_pool.cc:254] collecting diagnostics on the listening RPC socket unix:/tmp/dist-test-taskeLoISS/test-tmp/rpc-test-f3d9e4308bcf4a8c8296638950b05542.sock every 8 connection(s)
I20260927 18:34:49.789309 17575 acceptor_pool.cc:254] collecting diagnostics on the listening RPC socket unix:/tmp/dist-test-taskeLoISS/test-tmp/rpc-test-f3d9e4308bcf4a8c8296638950b05542.sock every 8 connection(s)
W20260927 18:34:49.800136 17332 serialization.cc:72] Serialized kudu.rpc_test.PushStringsRequestPB (2147483654 bytes) is larger than the maximum configured RPC message size (52428800 bytes). Sending anyway, but peer may reject the data.
W20260927 18:34:49.802804 17571 connection.cc:535] server connection from unix:<unnamed> recv error: Network error: RPC frame had a length of 2147483714, but we only support messages up to 52428800 bytes long.
W20260927 18:34:49.802855 17571 connection.cc:158] shutting down server connection from unix:<unnamed> with pending inbound data: 4/2147483714 bytes received; last active 0 ns ago: status Network error: RPC frame had a length of 2147483714, but we only support messages up to 52428800 bytes long.
W20260927 18:34:49.803020 17587 connection.cc:698] client connection to unix:/tmp/dist-test-taskeLoISS/test-tmp/rpc-test-f3d9e4308bcf4a8c8296638950b05542.sock send error: Network error: failed to write to TLS socket: Broken pipe
W20260927 18:34:49.803117 17587 connection.cc:196] Error closing socket: Network error: TlsSocket::Close: Success
I20260927 18:34:49.819774 17599 acceptor_pool.cc:254] collecting diagnostics on the listening RPC socket unix:/tmp/dist-test-taskeLoISS/test-tmp/rpc-test-f3d9e4308bcf4a8c8296638950b05542.sock every 8 connection(s)
I20260927 18:34:49.819783 17600 acceptor_pool.cc:254] collecting diagnostics on the listening RPC socket unix:/tmp/dist-test-taskeLoISS/test-tmp/rpc-test-f3d9e4308bcf4a8c8296638950b05542.sock every 8 connection(s)
W20260927 18:34:54.027637 17596 connection.cc:577] server connection from unix:<unnamed>: received bad data: 'Corruption: Invalid packet: message had a length of 2147483710, but we only support messages up to 2147483647 bytes
'
W20260927 18:34:54.027879 17612 connection.cc:196] Error closing socket: Network error: TlsSocket::Close: Broken pipe
[       OK ] Parameters/TestRpc.TestRpcSidecarLimits/SSL_UnixSocket (5895 ms)
[ RUN      ] Parameters/TestRpc.TestCallTimeoutDoesntAffectNegotiation/SSL_UnixSocket
I20260927 18:34:54.041812 17624 acceptor_pool.cc:254] collecting diagnostics on the listening RPC socket unix:/tmp/dist-test-taskeLoISS/test-tmp/rpc-test-78ee5cef7ba64c7b856264b2e2bfdf1b.sock every 8 connection(s)
I20260927 18:34:54.041849 17625 acceptor_pool.cc:254] collecting diagnostics on the listening RPC socket unix:/tmp/dist-test-taskeLoISS/test-tmp/rpc-test-78ee5cef7ba64c7b856264b2e2bfdf1b.sock every 8 connection(s)
W20260927 18:34:54.065096 17617 negotiation.cc:266] Injecting 500ms delay in negotiation
I20260927 18:34:54.115334 17332 rpc-test-base.h:595] status: Timed out: connection negotiation to unix:/tmp/dist-test-taskeLoISS/test-tmp/rpc-test-78ee5cef7ba64c7b856264b2e2bfdf1b.sock for RPC Sleep timed out after 0.050s (ON_OUTBOUND_QUEUE), seconds elapsed: 0.0505472
W20260927 18:34:54.569271 17621 connection.cc:196] Error closing socket: Network error: TlsSocket::Close: Broken pipe
[       OK ] Parameters/TestRpc.TestCallTimeoutDoesntAffectNegotiation/SSL_UnixSocket (540 ms)
[ RUN      ] Parameters/TestRpc.TestRpcHandlerLatencyMetric/SSL_UnixSocket
I20260927 18:34:54.603778 17649 acceptor_pool.cc:254] collecting diagnostics on the listening RPC socket unix:/tmp/dist-test-taskeLoISS/test-tmp/rpc-test-dc0629d013fe44019ee946fb9e0e7312.sock every 8 connection(s)
I20260927 18:34:54.603811 17650 acceptor_pool.cc:254] collecting diagnostics on the listening RPC socket unix:/tmp/dist-test-taskeLoISS/test-tmp/rpc-test-dc0629d013fe44019ee946fb9e0e7312.sock every 8 connection(s)
I20260927 18:34:54.653855 17332 rpc-test.cc:1236] Sleep() min lat: 20303
I20260927 18:34:54.653925 17332 rpc-test.cc:1237] Sleep() mean lat: 20303
I20260927 18:34:54.653949 17332 rpc-test.cc:1238] Sleep() max lat: 20303
I20260927 18:34:54.653962 17332 rpc-test.cc:1239] Sleep() #calls: 1
[       OK ] Parameters/TestRpc.TestRpcHandlerLatencyMetric/SSL_UnixSocket (85 ms)
[ RUN      ] Parameters/TestRpc.TimedOutOnResponseMetricServiceQueue/SSL_UnixSocket
I20260927 18:34:54.661934 17675 acceptor_pool.cc:254] collecting diagnostics on the listening RPC socket unix:/tmp/dist-test-taskeLoISS/test-tmp/rpc-test-dfdc8e735f1f45f3ada63e27fa21906a.sock every 8 connection(s)
I20260927 18:34:54.661957 17676 acceptor_pool.cc:254] collecting diagnostics on the listening RPC socket unix:/tmp/dist-test-taskeLoISS/test-tmp/rpc-test-dfdc8e735f1f45f3ada63e27fa21906a.sock every 8 connection(s)
W20260927 18:34:54.724509 17677 rpcz_store.cc:267] Call kudu.rpc_test.CalculatorService.Sleep from unix:<unnamed> (request call id 2) took 20 ms (client timeout 20 ms). Trace:
W20260927 18:34:54.724607 17677 rpcz_store.cc:269] 0927 18:34:54.704250 (+     0us) service_pool.cc:170] Inserting onto call queue
0927 18:34:54.724481 (+ 20231us) service_pool.cc:214] Skipping call since client already timed out
0927 18:34:54.724493 (+    12us) inbound_call.cc:173] Queueing failure response
Metrics: {}
W20260927 18:34:54.725198 17672 connection.cc:196] Error closing socket: Network error: TlsSocket::Close: Broken pipe
[       OK ] Parameters/TestRpc.TimedOutOnResponseMetricServiceQueue/SSL_UnixSocket (70 ms)
[ RUN      ] Parameters/TestRpc.RpcPendingConnectionsMetric/SSL_UnixSocket
I20260927 18:34:54.727710 17698 acceptor_pool.cc:254] collecting diagnostics on the listening RPC socket 0.0.0.0:33077 every 8 connection(s)
I20260927 18:34:54.727777 17699 acceptor_pool.cc:254] collecting diagnostics on the listening RPC socket 0.0.0.0:33077 every 8 connection(s)
W20260927 18:34:54.728277 17694 negotiation.cc:337] Failed RPC negotiation. Trace:
0927 18:34:54.728129 (+     0us) reactor.cc:625] Submitting negotiation task for server connection from 127.0.0.1:43374 (local address 127.0.0.1:33077)
0927 18:34:54.728172 (+    43us) server_negotiation.cc:206] Beginning negotiation
0927 18:34:54.728174 (+     2us) server_negotiation.cc:399] Waiting for connection header
0927 18:34:54.728229 (+    55us) negotiation.cc:327] Negotiation complete: Network error: Server connection negotiation failed: server connection from 127.0.0.1:43374: BlockingRecv error: recv got EOF from 127.0.0.1:43374 (error 108)
Metrics: {"server-negotiator.queue_time_us":14}
[       OK ] Parameters/TestRpc.RpcPendingConnectionsMetric/SSL_UnixSocket (13 ms)
[ RUN      ] Parameters/TestRpc.TestRpcContextClientDeadline/SSL_UnixSocket
I20260927 18:34:54.783937 17714 acceptor_pool.cc:254] collecting diagnostics on the listening RPC socket unix:/tmp/dist-test-taskeLoISS/test-tmp/rpc-test-5b49dae49c30492d88d276655f4b9ded.sock every 8 connection(s)
I20260927 18:34:54.784013 17715 acceptor_pool.cc:254] collecting diagnostics on the listening RPC socket unix:/tmp/dist-test-taskeLoISS/test-tmp/rpc-test-5b49dae49c30492d88d276655f4b9ded.sock every 8 connection(s)
W20260927 18:34:54.833580 17711 connection.cc:196] Error closing socket: Network error: TlsSocket::Close: Broken pipe
[       OK ] Parameters/TestRpc.TestRpcContextClientDeadline/SSL_UnixSocket (95 ms)
[ RUN      ] Parameters/TestRpc.TestApplicationFeatureFlagUnsupportedServer/SSL_UnixSocket
I20260927 18:34:54.864617 17739 acceptor_pool.cc:254] collecting diagnostics on the listening RPC socket unix:/tmp/dist-test-taskeLoISS/test-tmp/rpc-test-c9921413dae949fb989da69d44291060.sock every 8 connection(s)
I20260927 18:34:54.864673 17740 acceptor_pool.cc:254] collecting diagnostics on the listening RPC socket unix:/tmp/dist-test-taskeLoISS/test-tmp/rpc-test-c9921413dae949fb989da69d44291060.sock every 8 connection(s)
W20260927 18:34:54.877592 17736 connection.cc:196] Error closing socket: Network error: TlsSocket::Close: Broken pipe
[       OK ] Parameters/TestRpc.TestApplicationFeatureFlagUnsupportedServer/SSL_UnixSocket (43 ms)
[ RUN      ] Parameters/TestRpc.TestCancellationAsync/SSL_UnixSocket
I20260927 18:34:54.883651 17764 acceptor_pool.cc:254] collecting diagnostics on the listening RPC socket unix:/tmp/dist-test-taskeLoISS/test-tmp/rpc-test-7ad71e8883c94f099696345ba260da7d.sock every 8 connection(s)
I20260927 18:34:54.883702 17765 acceptor_pool.cc:254] collecting diagnostics on the listening RPC socket unix:/tmp/dist-test-taskeLoISS/test-tmp/rpc-test-7ad71e8883c94f099696345ba260da7d.sock every 8 connection(s)
I20260927 18:34:54.883823 17332 rpc-test.cc:1716] Connecting to unix:/tmp/dist-test-taskeLoISS/test-tmp/rpc-test-7ad71e8883c94f099696345ba260da7d.sock
I20260927 18:34:54.890161 17332 test_util.cc:268] Using random seed: 883893423
I20260927 18:34:54.905611 17768 rpc-test-base.h:240] got call: sleep_micros: 500 pattern: 4294967295 num_repetitions: 2097152 sidecar_idx: 0
I20260927 18:34:54.919216 17768 rpc-test-base.h:240] got call: sleep_micros: 500 pattern: 4294967295 num_repetitions: 2097152 sidecar_idx: 0
I20260927 18:34:54.932358 17768 rpc-test-base.h:240] got call: sleep_micros: 500 pattern: 4294967295 num_repetitions: 2097152 sidecar_idx: 0
I20260927 18:34:54.945336 17768 rpc-test-base.h:240] got call: sleep_micros: 500 pattern: 4294967295 num_repetitions: 2097152 sidecar_idx: 0
I20260927 18:34:54.958369 17768 rpc-test-base.h:240] got call: sleep_micros: 500 pattern: 4294967295 num_repetitions: 2097152 sidecar_idx: 0
I20260927 18:34:54.968664 17768 rpc-test-base.h:240] got call: sleep_micros: 500 pattern: 4294967295 num_repetitions: 2097152 sidecar_idx: 0
I20260927 18:34:54.979055 17768 rpc-test-base.h:240] got call: sleep_micros: 500 pattern: 4294967295 num_repetitions: 2097152 sidecar_idx: 0
I20260927 18:34:54.989182 17768 rpc-test-base.h:240] got call: sleep_micros: 500 pattern: 4294967295 num_repetitions: 2097152 sidecar_idx: 0
W20260927 18:34:54.990658 17761 connection.cc:196] Error closing socket: Network error: TlsSocket::Close: Broken pipe
W20260927 18:34:54.992247 17761 connection.cc:441] server connection from unix:<unnamed> torn down before Call kudu.rpc.GenericCalculatorService.SleepWithSidecar from unix:<unnamed> (request call id 9) could send its response
[       OK ] Parameters/TestRpc.TestCancellationAsync/SSL_UnixSocket (114 ms)
[ RUN      ] Parameters/TestRpc.TestPerformanceBySocketType/SSL_UnixSocket
I20260927 18:34:55.007916 17789 acceptor_pool.cc:254] collecting diagnostics on the listening RPC socket unix:/tmp/dist-test-taskeLoISS/test-tmp/rpc-test-9ed35db953af4eee9147d9f348e71e80.sock every 8 connection(s)
I20260927 18:34:55.007957 17790 acceptor_pool.cc:254] collecting diagnostics on the listening RPC socket unix:/tmp/dist-test-taskeLoISS/test-tmp/rpc-test-9ed35db953af4eee9147d9f348e71e80.sock every 8 connection(s)
I20260927 18:34:55.008107 17332 rpc-test.cc:1846] Connecting to unix:/tmp/dist-test-taskeLoISS/test-tmp/rpc-test-9ed35db953af4eee9147d9f348e71e80.sock
I20260927 18:34:56.267668 17332 rpc-test.cc:1859] Sending 1024MB via ssl-enabled unix socket: real 1.242s	user 1.373s	sys 0.869s
I20260927 18:34:57.468135 17332 rpc-test.cc:1859] Sending 1024MB via ssl-enabled unix socket: real 1.200s	user 1.340s	sys 0.825s
I20260927 18:34:58.633435 17332 rpc-test.cc:1859] Sending 1024MB via ssl-enabled unix socket: real 1.165s	user 1.423s	sys 0.667s
I20260927 18:34:59.804476 17332 rpc-test.cc:1859] Sending 1024MB via ssl-enabled unix socket: real 1.171s	user 1.330s	sys 0.781s
I20260927 18:35:00.944398 17332 rpc-test.cc:1859] Sending 1024MB via ssl-enabled unix socket: real 1.140s	user 1.231s	sys 0.819s
W20260927 18:35:00.944959 17786 connection.cc:196] Error closing socket: Network error: TlsSocket::Close: Broken pipe
[       OK ] Parameters/TestRpc.TestPerformanceBySocketType/SSL_UnixSocket (5952 ms)
[----------] 20 tests from Parameters/TestRpc (24958 ms total)

[----------] 1 test from Parameters/TestRpcSocketTxRxQueue
[ RUN      ] Parameters/TestRpcSocketTxRxQueue.AcceptorRxQueueSizeMetric/0
I20260927 18:35:00.951020 17814 acceptor_pool.cc:254] collecting diagnostics on the listening RPC socket 0.0.0.0:39389 every 1 connection(s)
I20260927 18:35:00.951063 17815 acceptor_pool.cc:254] collecting diagnostics on the listening RPC socket 0.0.0.0:39389 every 1 connection(s)
W20260927 18:35:00.951604 17810 negotiation.cc:337] Failed RPC negotiation. Trace:
0927 18:35:00.951477 (+     0us) reactor.cc:625] Submitting negotiation task for server connection from 127.0.0.1:43578 (local address 127.0.0.1:39389)
0927 18:35:00.951519 (+    42us) server_negotiation.cc:206] Beginning negotiation
0927 18:35:00.951521 (+     2us) server_negotiation.cc:399] Waiting for connection header
0927 18:35:00.951578 (+    57us) negotiation.cc:327] Negotiation complete: Network error: Server connection negotiation failed: server connection from 127.0.0.1:43578: BlockingRecv error: recv got EOF from 127.0.0.1:43578 (error 108)
Metrics: {"server-negotiator.queue_time_us":15}
[       OK ] Parameters/TestRpcSocketTxRxQueue.AcceptorRxQueueSizeMetric/0 (7 ms)
[----------] 1 test from Parameters/TestRpcSocketTxRxQueue (7 ms total)

[----------] Global test environment tear-down
[==========] 21 tests from 2 test suites ran. (24965 ms total)
[  PASSED  ] 20 tests.
[  FAILED  ] 1 test, listed below:
[  FAILED  ] Parameters/TestRpc.TestCallWithChainCertAndChainCA/SSL_UnixSocket, where GetParam() = (true, true)

 1 FAILED TEST