Diagnosed failure

Parameters/TestRpc.TestCallWithChainCertAndRootCA/SSL_TCP: /data0/somelongdirectorytoavoidrpathissues/src/kudu/src/kudu/rpc/rpc-test.cc:303: Failure
Failed
Bad status: Runtime error: could not verify certificate chain (error with cert: subject=CN = localhost, ST = sadfjas, C = AS, emailAddress = sdflkdsajf, O = lskdfjlsad, OU = sldfkja, issuer=C = AS, ST = ASDfkjdhf, L = lskdjf, O = saldfja, OU = skdjf, CN = localhost, emailAddress = sadjflkadsj): : certificate has expired
Google Test trace:
/data0/somelongdirectorytoavoidrpathissues/src/kudu/src/kudu/rpc/rpc-test.cc:300: Connecting to 0.0.0.0:34711
I20260925 10:08:31.720956  9735 test_util.cc:175] -----------------------------------------------
I20260925 10:08:31.721148  9735 test_util.cc:176] Had fatal failures, leaving test files at /tmp/dist-test-taskTfEo8J/test-tmp/rpc-test.1.Parameters_TestRpc.TestCallWithChainCertAndRootCA_SSL_TCP.1790330910183775-9735-0

Full log

Note: This is test shard 2 of 8.
[==========] Running 21 tests from 2 test suites.
[----------] Global test environment set-up.
[----------] 1 test from TestRpc
[ RUN      ] TestRpc.TestMethodsByName
[       OK ] TestRpc.TestMethodsByName (6 ms)
[----------] 1 test from TestRpc (6 ms total)

[----------] 20 tests from Parameters/TestRpc
[ RUN      ] Parameters/TestRpc.TestAcceptorPoolStartStop/SSL_TCP
WARNING: Logging before InitGoogleLogging() is written to STDERR
I20260925 10:08:30.290890  9750 acceptor_pool.cc:254] collecting diagnostics on the listening RPC socket 0.0.0.0:45413 every 8 connection(s)
I20260925 10:08:30.292692  9751 acceptor_pool.cc:254] collecting diagnostics on the listening RPC socket 0.0.0.0:45413 every 8 connection(s)
W20260925 10:08:31.293342  9735 thread.cc:536] Waited for 1000ms trying to join with acceptor (tid 9751)
I20260925 10:08:31.446322  9762 acceptor_pool.cc:254] collecting diagnostics on the listening RPC socket 0.0.0.0:42331 every 8 connection(s)
I20260925 10:08:31.447906  9763 acceptor_pool.cc:254] collecting diagnostics on the listening RPC socket 0.0.0.0:42331 every 8 connection(s)
I20260925 10:08:31.491164  9773 acceptor_pool.cc:254] collecting diagnostics on the listening RPC socket 0.0.0.0:34637 every 8 connection(s)
I20260925 10:08:31.492633  9774 acceptor_pool.cc:254] collecting diagnostics on the listening RPC socket 0.0.0.0:34637 every 8 connection(s)
I20260925 10:08:31.521373  9784 acceptor_pool.cc:254] collecting diagnostics on the listening RPC socket 0.0.0.0:35993 every 8 connection(s)
I20260925 10:08:31.522076  9785 acceptor_pool.cc:254] collecting diagnostics on the listening RPC socket 0.0.0.0:35993 every 8 connection(s)
I20260925 10:08:31.543591  9795 acceptor_pool.cc:254] collecting diagnostics on the listening RPC socket 0.0.0.0:36713 every 8 connection(s)
I20260925 10:08:31.544355  9796 acceptor_pool.cc:254] collecting diagnostics on the listening RPC socket 0.0.0.0:36713 every 8 connection(s)
[       OK ] Parameters/TestRpc.TestAcceptorPoolStartStop/SSL_TCP (1300 ms)
[ RUN      ] Parameters/TestRpc.TestCall/SSL_TCP
I20260925 10:08:31.566107  9808 acceptor_pool.cc:254] collecting diagnostics on the listening RPC socket 0.0.0.0:38675 every 8 connection(s)
I20260925 10:08:31.568301  9809 acceptor_pool.cc:254] collecting diagnostics on the listening RPC socket 0.0.0.0:38675 every 8 connection(s)
I20260925 10:08:31.573710  9735 rpc-test.cc:234] Connecting to 0.0.0.0:38675
[       OK ] Parameters/TestRpc.TestCall/SSL_TCP (125 ms)
[ RUN      ] Parameters/TestRpc.TestCallWithChainCertAndRootCA/SSL_TCP
I20260925 10:08:31.699844  9833 acceptor_pool.cc:254] collecting diagnostics on the listening RPC socket 0.0.0.0:34711 every 8 connection(s)
I20260925 10:08:31.700608  9834 acceptor_pool.cc:254] collecting diagnostics on the listening RPC socket 0.0.0.0:34711 every 8 connection(s)
/data0/somelongdirectorytoavoidrpathissues/src/kudu/src/kudu/rpc/rpc-test.cc:303: Failure
Failed
Bad status: Runtime error: could not verify certificate chain (error with cert: subject=CN = localhost, ST = sadfjas, C = AS, emailAddress = sdflkdsajf, O = lskdfjlsad, OU = sldfkja, issuer=C = AS, ST = ASDfkjdhf, L = lskdjf, O = saldfja, OU = skdjf, CN = localhost, emailAddress = sadjflkadsj): : certificate has expired
Google Test trace:
/data0/somelongdirectorytoavoidrpathissues/src/kudu/src/kudu/rpc/rpc-test.cc:300: Connecting to 0.0.0.0:34711
I20260925 10:08:31.720956  9735 test_util.cc:175] -----------------------------------------------
I20260925 10:08:31.721148  9735 test_util.cc:176] Had fatal failures, leaving test files at /tmp/dist-test-taskTfEo8J/test-tmp/rpc-test.1.Parameters_TestRpc.TestCallWithChainCertAndRootCA_SSL_TCP.1790330910183775-9735-0
[  FAILED  ] Parameters/TestRpc.TestCallWithChainCertAndRootCA/SSL_TCP, where GetParam() = (true, false) (46 ms)
[ RUN      ] Parameters/TestRpc.TestCallWithBadPasswordProtectedKey/SSL_TCP
[       OK ] Parameters/TestRpc.TestCallWithBadPasswordProtectedKey/SSL_TCP (34 ms)
[ RUN      ] Parameters/TestRpc.TestInvalidMethodCall/SSL_TCP
I20260925 10:08:31.795642  9870 acceptor_pool.cc:254] collecting diagnostics on the listening RPC socket 0.0.0.0:44555 every 8 connection(s)
I20260925 10:08:31.796470  9871 acceptor_pool.cc:254] collecting diagnostics on the listening RPC socket 0.0.0.0:44555 every 8 connection(s)
I20260925 10:08:31.800231  9735 rpc-test.cc:406] Connecting to 0.0.0.0:44555
[       OK ] Parameters/TestRpc.TestInvalidMethodCall/SSL_TCP (89 ms)
[ RUN      ] Parameters/TestRpc.TestHighFDs/SSL_TCP
I20260925 10:08:32.065384  9895 acceptor_pool.cc:254] collecting diagnostics on the listening RPC socket 0.0.0.0:38999 every 8 connection(s)
I20260925 10:08:32.066089  9896 acceptor_pool.cc:254] collecting diagnostics on the listening RPC socket 0.0.0.0:38999 every 8 connection(s)
[       OK ] Parameters/TestRpc.TestHighFDs/SSL_TCP (273 ms)
[ RUN      ] Parameters/TestRpc.TestConnectionAlwaysKeepalive/SSL_TCP
I20260925 10:08:32.136127  9918 acceptor_pool.cc:254] collecting diagnostics on the listening RPC socket 0.0.0.0:44629 every 8 connection(s)
I20260925 10:08:32.136859  9919 acceptor_pool.cc:254] collecting diagnostics on the listening RPC socket 0.0.0.0:44629 every 8 connection(s)
I20260925 10:08:32.140134  9735 rpc-test.cc:532] Connecting to 0.0.0.0:44629
[       OK ] Parameters/TestRpc.TestConnectionAlwaysKeepalive/SSL_TCP (3066 ms)
[ RUN      ] Parameters/TestRpc.TestReopenOutboundConnections/SSL_TCP
I20260925 10:08:35.211251  9941 acceptor_pool.cc:254] collecting diagnostics on the listening RPC socket 0.0.0.0:34365 every 8 connection(s)
I20260925 10:08:35.211988  9942 acceptor_pool.cc:254] collecting diagnostics on the listening RPC socket 0.0.0.0:34365 every 8 connection(s)
I20260925 10:08:35.215415  9735 rpc-test.cc:658] Connecting to 0.0.0.0:34365
[       OK ] Parameters/TestRpc.TestReopenOutboundConnections/SSL_TCP (384 ms)
[ RUN      ] Parameters/TestRpc.TestConnectionNetworkPlane/SSL_TCP
I20260925 10:08:35.593638  9964 acceptor_pool.cc:254] collecting diagnostics on the listening RPC socket 0.0.0.0:36155 every 8 connection(s)
I20260925 10:08:35.594412  9965 acceptor_pool.cc:254] collecting diagnostics on the listening RPC socket 0.0.0.0:36155 every 8 connection(s)
I20260925 10:08:35.597553  9735 rpc-test.cc:772] Connecting to 0.0.0.0:36155
[       OK ] Parameters/TestRpc.TestConnectionNetworkPlane/SSL_TCP (85 ms)
[ RUN      ] Parameters/TestRpc.TestTCPKeepalive/SSL_TCP
I20260925 10:08:35.676855  9989 acceptor_pool.cc:254] collecting diagnostics on the listening RPC socket 0.0.0.0:32891 every 8 connection(s)
I20260925 10:08:35.677629  9990 acceptor_pool.cc:254] collecting diagnostics on the listening RPC socket 0.0.0.0:32891 every 8 connection(s)
I20260925 10:08:35.713627  9993 rpc-test-base.h:222] got call: sleep_micros: 8000000 deferred: true
I20260925 10:08:43.717818  9993 rpcz_store.cc:275] Call kudu.rpc.GenericCalculatorService.Sleep from 127.0.0.1:50566 (request call id 0) took 8004 ms. Trace:
I20260925 10:08:43.718312  9993 rpcz_store.cc:276] 0925 10:08:35.713258 (+     0us) service_pool.cc:170] Inserting onto call queue
0925 10:08:35.713467 (+   209us) service_pool.cc:227] Handling call
0925 10:08:43.717588 (+8004121us) inbound_call.cc:173] Queueing success response
Metrics: {}
[       OK ] Parameters/TestRpc.TestTCPKeepalive/SSL_TCP (8078 ms)
[ RUN      ] Parameters/TestRpc.TestMaxSmallSidecars/SSL_TCP
I20260925 10:08:43.772280 10015 acceptor_pool.cc:254] collecting diagnostics on the listening RPC socket 0.0.0.0:46381 every 8 connection(s)
I20260925 10:08:43.773075 10016 acceptor_pool.cc:254] collecting diagnostics on the listening RPC socket 0.0.0.0:46381 every 8 connection(s)
[       OK ] Parameters/TestRpc.TestMaxSmallSidecars/SSL_TCP (218 ms)
[ RUN      ] Parameters/TestRpc.TestCallTimeout/SSL_TCP
I20260925 10:08:43.979004 10040 acceptor_pool.cc:254] collecting diagnostics on the listening RPC socket 0.0.0.0:40673 every 8 connection(s)
I20260925 10:08:43.979809 10041 acceptor_pool.cc:254] collecting diagnostics on the listening RPC socket 0.0.0.0:40673 every 8 connection(s)
I20260925 10:08:44.012104  9735 rpc-test-base.h:595] status: Timed out: connection negotiation to 0.0.0.0:40673 for RPC Sleep timed out after 0.000s (ON_OUTBOUND_QUEUE), seconds elapsed: 0.00306805
I20260925 10:08:44.020423 10044 rpc-test-base.h:222] got call: sleep_micros: 700000
I20260925 10:08:44.214108  9735 rpc-test-base.h:595] status: Timed out: Sleep RPC to 0.0.0.0:40673 timed out after 0.200s (SENT), seconds elapsed: 0.201394
I20260925 10:08:44.215808 10043 rpc-test-base.h:222] got call: sleep_micros: 2000000
W20260925 10:08:44.721155 10044 rpcz_store.cc:267] Call kudu.rpc.GenericCalculatorService.Sleep from 127.0.0.1:51064 (request call id 1) took 701 ms (client timeout 200 ms). Trace:
W20260925 10:08:44.721480 10044 rpcz_store.cc:269] 0925 10:08:44.020109 (+     0us) service_pool.cc:170] Inserting onto call queue
0925 10:08:44.020225 (+   116us) service_pool.cc:227] Handling call
0925 10:08:44.721086 (+700861us) inbound_call.cc:173] Queueing success response
Metrics: {}
I20260925 10:08:45.716126  9735 rpc-test-base.h:595] status: Timed out: Sleep RPC to 0.0.0.0:40673 timed out after 1.500s (SENT), seconds elapsed: 1.50164
W20260925 10:08:46.216462 10043 rpcz_store.cc:267] Call kudu.rpc.GenericCalculatorService.Sleep from 127.0.0.1:51064 (request call id 2) took 2001 ms (client timeout 1500 ms). Trace:
W20260925 10:08:46.216835 10043 rpcz_store.cc:269] 0925 10:08:44.215497 (+     0us) service_pool.cc:170] Inserting onto call queue
0925 10:08:44.215650 (+   153us) service_pool.cc:227] Handling call
0925 10:08:46.216403 (+2000753us) inbound_call.cc:173] Queueing success response
Metrics: {}
W20260925 10:08:46.217413 10038 connection.cc:441] server connection from 127.0.0.1:51064 torn down before Call kudu.rpc.GenericCalculatorService.Sleep from 127.0.0.1:51064 (request call id 2) could send its response
[       OK ] Parameters/TestRpc.TestCallTimeout/SSL_TCP (2269 ms)
[ RUN      ] Parameters/TestRpc.TestServerShutsDown/SSL_TCP
I20260925 10:08:46.225301  9735 rpc-test.cc:1125] Connecting to 0.0.0.0:38739
W20260925 10:08:46.234800 10057 negotiation.cc:337] Failed RPC negotiation. Trace:
0925 10:08:46.233169 (+     0us) reactor.cc:625] Submitting negotiation task for client connection to 0.0.0.0:38739 (local address 127.0.0.1:58696)
0925 10:08:46.233632 (+   463us) negotiation.cc:107] Waiting for socket to connect
0925 10:08:46.233667 (+    35us) client_negotiation.cc:174] Beginning negotiation
0925 10:08:46.233892 (+   225us) client_negotiation.cc:252] Sending NEGOTIATE NegotiatePB request
0925 10:08:46.234111 (+   219us) negotiation.cc:327] Negotiation complete: Network error: Client connection negotiation failed: client connection to 0.0.0.0:38739: BlockingWrite error: write error: Broken pipe (error 32)
Metrics: {"client-negotiator.queue_time_us":130}
[       OK ] Parameters/TestRpc.TestServerShutsDown/SSL_TCP (13 ms)
[ RUN      ] Parameters/TestRpc.TimedOutOnResponseMetric/SSL_TCP
I20260925 10:08:46.252640 10074 acceptor_pool.cc:254] collecting diagnostics on the listening RPC socket 0.0.0.0:45599 every 8 connection(s)
I20260925 10:08:46.253353 10075 acceptor_pool.cc:254] collecting diagnostics on the listening RPC socket 0.0.0.0:45599 every 8 connection(s)
W20260925 10:08:46.495487 10078 rpcz_store.cc:267] Call kudu.rpc_test.CalculatorService.Sleep from 127.0.0.1:50750 (request call id 3) took 50 ms (client timeout 25 ms). Trace:
W20260925 10:08:46.495805 10078 rpcz_store.cc:269] 0925 10:08:46.444803 (+     0us) service_pool.cc:170] Inserting onto call queue
0925 10:08:46.444924 (+   121us) service_pool.cc:227] Handling call
0925 10:08:46.495404 (+ 50480us) inbound_call.cc:173] Queueing success response
Related trace 'test_child':
Metrics: {"test_sleep_us":50000,"child_traces":[["test_child",{"related_trace_metric":1}]]}
W20260925 10:08:46.555240 10078 rpcz_store.cc:267] Call kudu.rpc_test.CalculatorService.Sleep from 127.0.0.1:50750 (request call id 4) took 50 ms (client timeout 50 ms). Trace:
W20260925 10:08:46.555538 10078 rpcz_store.cc:269] 0925 10:08:46.504700 (+     0us) service_pool.cc:170] Inserting onto call queue
0925 10:08:46.504839 (+   139us) service_pool.cc:227] Handling call
0925 10:08:46.555180 (+ 50341us) inbound_call.cc:173] Queueing success response
Related trace 'test_child':
Metrics: {"test_sleep_us":50000,"child_traces":[["test_child",{"related_trace_metric":1}]]}
[       OK ] Parameters/TestRpc.TimedOutOnResponseMetric/SSL_TCP (326 ms)
[ RUN      ] Parameters/TestRpc.AcceptorDispatchingTimesMetric/SSL_TCP
I20260925 10:08:46.575670 10099 acceptor_pool.cc:254] collecting diagnostics on the listening RPC socket 0.0.0.0:38045 every 8 connection(s)
I20260925 10:08:46.576350 10100 acceptor_pool.cc:254] collecting diagnostics on the listening RPC socket 0.0.0.0:38045 every 8 connection(s)
W20260925 10:08:46.583950 10095 negotiation.cc:337] Failed RPC negotiation. Trace:
0925 10:08:46.580946 (+     0us) reactor.cc:625] Submitting negotiation task for server connection from 127.0.0.1:51596 (local address 127.0.0.1:38045)
0925 10:08:46.581722 (+   776us) server_negotiation.cc:206] Beginning negotiation
0925 10:08:46.581756 (+    34us) server_negotiation.cc:399] Waiting for connection header
0925 10:08:46.582120 (+   364us) negotiation.cc:327] Negotiation complete: Network error: Server connection negotiation failed: server connection from 127.0.0.1:51596: BlockingRecv error: recv got EOF from 127.0.0.1:51596 (error 108)
Metrics: {"server-negotiator.queue_time_us":134}
[       OK ] Parameters/TestRpc.AcceptorDispatchingTimesMetric/SSL_TCP (22 ms)
[ RUN      ] Parameters/TestRpc.TestRpcCallbackDestroysMessenger/SSL_TCP
[       OK ] Parameters/TestRpc.TestRpcCallbackDestroysMessenger/SSL_TCP (20 ms)
[ RUN      ] Parameters/TestRpc.TestApplicationFeatureFlag/SSL_TCP
I20260925 10:08:46.634694 10124 acceptor_pool.cc:254] collecting diagnostics on the listening RPC socket 0.0.0.0:40941 every 8 connection(s)
I20260925 10:08:46.635356 10125 acceptor_pool.cc:254] collecting diagnostics on the listening RPC socket 0.0.0.0:40941 every 8 connection(s)
W20260925 10:08:46.678660 10122 messenger.cc:357] Unable to handle RPC call: Not implemented: call requires unsupported application feature flags: 99
[       OK ] Parameters/TestRpc.TestApplicationFeatureFlag/SSL_TCP (85 ms)
[ RUN      ] Parameters/TestRpc.TestCancellation/SSL_TCP
I20260925 10:08:46.712527 10149 acceptor_pool.cc:254] collecting diagnostics on the listening RPC socket 0.0.0.0:36615 every 8 connection(s)
I20260925 10:08:46.713253 10150 acceptor_pool.cc:254] collecting diagnostics on the listening RPC socket 0.0.0.0:36615 every 8 connection(s)
I20260925 10:08:46.716441  9735 rpc-test.cc:1648] Connecting to 0.0.0.0:36615
I20260925 10:08:46.833986  9735 rpc-test-base.h:595] status: Aborted: Sleep RPC to 0.0.0.0:36615 is cancelled in state READY, seconds elapsed: 0.000436553
I20260925 10:08:46.978313  9735 rpc-test-base.h:595] status: Aborted: Sleep RPC to 0.0.0.0:36615 is cancelled in state SENT, seconds elapsed: 0.000831464
I20260925 10:08:47.024116 10152 rpc-test-base.h:222] got call: sleep_micros: 510000
I20260925 10:08:47.152985  9735 rpc-test-base.h:595] status: Aborted: Sleep RPC to 0.0.0.0:36615 is cancelled in state SENT, seconds elapsed: 0.000810567
I20260925 10:08:47.196123 10151 rpc-test-base.h:222] got call: sleep_micros: 510000
I20260925 10:08:47.319664  9735 rpc-test-base.h:595] status: Aborted: Sleep RPC to 0.0.0.0:36615 is cancelled in state SENT, seconds elapsed: 0.00079108
W20260925 10:08:47.360406 10153 rpcz_store.cc:267] Call kudu.rpc.GenericCalculatorService.Sleep from 127.0.0.1:34264 (request call id 11) took 15 ms (client timeout 10 ms). Trace:
W20260925 10:08:47.360711 10153 rpcz_store.cc:269] 0925 10:08:47.345103 (+     0us) service_pool.cc:170] Inserting onto call queue
0925 10:08:47.360083 (+ 14980us) service_pool.cc:214] Skipping call since client already timed out
0925 10:08:47.360199 (+   116us) inbound_call.cc:173] Queueing failure response
Metrics: {}
I20260925 10:08:47.361213 10153 rpc-test-base.h:222] got call: sleep_micros: 1500000
W20260925 10:08:47.534884 10152 rpcz_store.cc:267] Call kudu.rpc.GenericCalculatorService.Sleep from 127.0.0.1:34264 (request call id 3) took 511 ms (client timeout 10 ms). Trace:
W20260925 10:08:47.535285 10152 rpcz_store.cc:269] 0925 10:08:47.023888 (+     0us) service_pool.cc:170] Inserting onto call queue
0925 10:08:47.024037 (+   149us) service_pool.cc:227] Handling call
0925 10:08:47.534822 (+510785us) inbound_call.cc:173] Queueing success response
Metrics: {}
W20260925 10:08:47.706839 10151 rpcz_store.cc:267] Call kudu.rpc.GenericCalculatorService.Sleep from 127.0.0.1:34264 (request call id 7) took 513 ms (client timeout 10 ms). Trace:
W20260925 10:08:47.707150 10151 rpcz_store.cc:269] 0925 10:08:47.193631 (+     0us) service_pool.cc:170] Inserting onto call queue
0925 10:08:47.196048 (+  2417us) service_pool.cc:227] Handling call
0925 10:08:47.706772 (+510724us) inbound_call.cc:173] Queueing success response
Metrics: {}
I20260925 10:08:48.321542  9735 rpc-test-base.h:595] status: Timed out: Sleep RPC to 0.0.0.0:36615 timed out after 1.000s (SENT), seconds elapsed: 1.00149
I20260925 10:08:48.323383 10151 rpc-test-base.h:222] got call: sleep_micros: 1500000
W20260925 10:08:48.861763 10153 rpcz_store.cc:267] Call kudu.rpc.GenericCalculatorService.Sleep from 127.0.0.1:34264 (request call id 12) took 1516 ms (client timeout 1000 ms). Trace:
W20260925 10:08:48.862069 10153 rpcz_store.cc:269] 0925 10:08:47.345453 (+     0us) service_pool.cc:170] Inserting onto call queue
0925 10:08:47.361171 (+ 15718us) service_pool.cc:227] Handling call
0925 10:08:48.861704 (+1500533us) inbound_call.cc:173] Queueing success response
Metrics: {}
I20260925 10:08:49.323722  9735 rpc-test-base.h:595] status: Timed out: Sleep RPC to 0.0.0.0:36615 timed out after 1.000s (SENT), seconds elapsed: 1.00168
W20260925 10:08:49.325285 10146 messenger.cc:357] Unable to handle RPC call: Not implemented: call requires unsupported application feature flags: 99, 1
W20260925 10:08:49.326959 10146 messenger.cc:357] Unable to handle RPC call: Not implemented: call requires unsupported application feature flags: 99, 1
W20260925 10:08:49.824002 10151 rpcz_store.cc:267] Call kudu.rpc.GenericCalculatorService.Sleep from 127.0.0.1:34264 (request call id 13) took 1500 ms (client timeout 1000 ms). Trace:
W20260925 10:08:49.824589 10151 rpcz_store.cc:269] 0925 10:08:48.323195 (+     0us) service_pool.cc:170] Inserting onto call queue
0925 10:08:48.323326 (+   131us) service_pool.cc:227] Handling call
0925 10:08:49.823924 (+1500598us) inbound_call.cc:173] Queueing success response
Metrics: {}
W20260925 10:08:49.825392 10146 connection.cc:441] server connection from 127.0.0.1:34264 torn down before Call kudu.rpc.GenericCalculatorService.Sleep from 127.0.0.1:34264 (request call id 13) could send its response
[       OK ] Parameters/TestRpc.TestCancellation/SSL_TCP (3139 ms)
[ RUN      ] Parameters/TestRpc.TestCancellationMultiThreads/SSL_TCP
I20260925 10:08:49.854218 10174 acceptor_pool.cc:254] collecting diagnostics on the listening RPC socket 0.0.0.0:40565 every 8 connection(s)
I20260925 10:08:49.854923 10175 acceptor_pool.cc:254] collecting diagnostics on the listening RPC socket 0.0.0.0:40565 every 8 connection(s)
I20260925 10:08:49.858175  9735 rpc-test.cc:1808] Connecting to 0.0.0.0:40565
I20260925 10:08:49.996882 10188 test_util.cc:268] Using random seed: -417536973
I20260925 10:08:49.998008 10189 test_util.cc:268] Using random seed: -417535838
I20260925 10:08:49.999787 10190 test_util.cc:268] Using random seed: -417534066
I20260925 10:08:50.001616 10191 test_util.cc:268] Using random seed: -417532321
I20260925 10:08:50.003153 10192 test_util.cc:268] Using random seed: -417530823
I20260925 10:08:50.004793 10193 test_util.cc:268] Using random seed: -417529220
I20260925 10:08:50.006161 10194 test_util.cc:268] Using random seed: -417527814
I20260925 10:08:50.007936 10195 test_util.cc:268] Using random seed: -417526037
I20260925 10:08:50.010360 10196 test_util.cc:268] Using random seed: -417523677
I20260925 10:08:50.011730 10197 test_util.cc:268] Using random seed: -417522219
I20260925 10:08:50.013401 10198 test_util.cc:268] Using random seed: -417520600
I20260925 10:08:50.016140 10199 test_util.cc:268] Using random seed: -417517892
I20260925 10:08:50.018069 10200 test_util.cc:268] Using random seed: -417516066
I20260925 10:08:50.020515 10201 test_util.cc:268] Using random seed: -417513494
I20260925 10:08:50.022575 10202 test_util.cc:268] Using random seed: -417511433
I20260925 10:08:50.024756 10203 test_util.cc:268] Using random seed: -417509235
I20260925 10:08:50.026443 10204 test_util.cc:268] Using random seed: -417507581
I20260925 10:08:50.028127 10205 test_util.cc:268] Using random seed: -417505885
I20260925 10:08:50.029853 10206 test_util.cc:268] Using random seed: -417504157
I20260925 10:08:50.033802 10208 test_util.cc:268] Using random seed: -417500203
I20260925 10:08:50.032349 10207 test_util.cc:268] Using random seed: -417501741
I20260925 10:08:50.037598 10209 test_util.cc:268] Using random seed: -417496459
I20260925 10:08:50.040885 10210 test_util.cc:268] Using random seed: -417493106
I20260925 10:08:50.043287 10211 test_util.cc:268] Using random seed: -417490696
I20260925 10:08:50.045614 10212 test_util.cc:268] Using random seed: -417488412
I20260925 10:08:50.047052 10213 test_util.cc:268] Using random seed: -417486892
I20260925 10:08:50.048591 10214 test_util.cc:268] Using random seed: -417485409
I20260925 10:08:50.051016 10215 test_util.cc:268] Using random seed: -417483006
I20260925 10:08:50.052855 10216 test_util.cc:268] Using random seed: -417481256
I20260925 10:08:50.054663 10217 test_util.cc:268] Using random seed: -417479382
[       OK ] Parameters/TestRpc.TestCancellationMultiThreads/SSL_TCP (17999 ms)
[ RUN      ] Parameters/TestRpc.TestCallId/SSL_TCP
I20260925 10:09:07.867691 10231 acceptor_pool.cc:254] collecting diagnostics on the listening RPC socket 0.0.0.0:42819 every 8 connection(s)
I20260925 10:09:07.868409 10232 acceptor_pool.cc:254] collecting diagnostics on the listening RPC socket 0.0.0.0:42819 every 8 connection(s)
[       OK ] Parameters/TestRpc.TestCallId/SSL_TCP (94 ms)
[----------] 20 tests from Parameters/TestRpc (37679 ms total)

[----------] Global test environment tear-down
[==========] 21 tests from 2 test suites ran. (37687 ms total)
[  PASSED  ] 20 tests.
[  FAILED  ] 1 test, listed below:
[  FAILED  ] Parameters/TestRpc.TestCallWithChainCertAndRootCA/SSL_TCP, where GetParam() = (true, false)

 1 FAILED TEST