Diagnosed failure
Parameters/TestRpc.TestCallWithChainCertAndChainCA/SSL_UnixSocket: /data0/somelongdirectorytoavoidrpathissues/src/kudu/src/kudu/rpc/rpc-test.cc:270: Failure
Failed
Bad status: Runtime error: could not verify certificate chain (error with cert: subject=CN = localhost, ST = sadfjas, C = AS, emailAddress = sdflkdsajf, O = lskdfjlsad, OU = sldfkja, issuer=C = AS, ST = ASDfkjdhf, L = lskdjf, O = saldfja, OU = skdjf, CN = localhost, emailAddress = sadjflkadsj): : certificate has expired
Google Test trace:
/data0/somelongdirectorytoavoidrpathissues/src/kudu/src/kudu/rpc/rpc-test.cc:267: Connecting to unix:/tmp/dist-test-taskd506i4/test-tmp/rpc-test-f56c96285cde428189598e59dcd23d5b.sock
I20260926 19:32:35.797562 7073 test_util.cc:175] -----------------------------------------------
I20260926 19:32:35.797668 7073 test_util.cc:176] Had fatal failures, leaving test files at /tmp/dist-test-taskd506i4/test-tmp/rpc-test.6.Parameters_TestRpc.TestCallWithChainCertAndChainCA_SSL_UnixSocket.1790451155663117-7073-0
Full log
Note: This is test shard 7 of 8.
[==========] Running 21 tests from 2 test suites.
[----------] Global test environment set-up.
[----------] 20 tests from Parameters/TestRpc
[ RUN ] Parameters/TestRpc.TestMessengerCreateDestroy/SSL_UnixSocket
WARNING: Logging before InitGoogleLogging() is written to STDERR
I20260926 19:32:35.711232 7073 rpc-test.cc:169] started messenger TestCreateDestroy
[ OK ] Parameters/TestRpc.TestMessengerCreateDestroy/SSL_UnixSocket (30 ms)
[ RUN ] Parameters/TestRpc.TestNegotiationDeadlock/SSL_UnixSocket
I20260926 19:32:35.734618 7093 acceptor_pool.cc:254] collecting diagnostics on the listening RPC socket unix:/tmp/dist-test-taskd506i4/test-tmp/rpc-test-0c8ecdbdf5ef4311a62ff41366716be0.sock every 8 connection(s)
I20260926 19:32:35.734965 7094 acceptor_pool.cc:254] collecting diagnostics on the listening RPC socket unix:/tmp/dist-test-taskd506i4/test-tmp/rpc-test-0c8ecdbdf5ef4311a62ff41366716be0.sock every 8 connection(s)
[ OK ] Parameters/TestRpc.TestNegotiationDeadlock/SSL_UnixSocket (38 ms)
[ RUN ] Parameters/TestRpc.TestCallWithChainCertAndChainCA/SSL_UnixSocket
I20260926 19:32:35.785751 7109 acceptor_pool.cc:254] collecting diagnostics on the listening RPC socket unix:/tmp/dist-test-taskd506i4/test-tmp/rpc-test-f56c96285cde428189598e59dcd23d5b.sock every 8 connection(s)
I20260926 19:32:35.786051 7110 acceptor_pool.cc:254] collecting diagnostics on the listening RPC socket unix:/tmp/dist-test-taskd506i4/test-tmp/rpc-test-f56c96285cde428189598e59dcd23d5b.sock every 8 connection(s)
/data0/somelongdirectorytoavoidrpathissues/src/kudu/src/kudu/rpc/rpc-test.cc:270: Failure
Failed
Bad status: Runtime error: could not verify certificate chain (error with cert: subject=CN = localhost, ST = sadfjas, C = AS, emailAddress = sdflkdsajf, O = lskdfjlsad, OU = sldfkja, issuer=C = AS, ST = ASDfkjdhf, L = lskdjf, O = saldfja, OU = skdjf, CN = localhost, emailAddress = sadjflkadsj): : certificate has expired
Google Test trace:
/data0/somelongdirectorytoavoidrpathissues/src/kudu/src/kudu/rpc/rpc-test.cc:267: Connecting to unix:/tmp/dist-test-taskd506i4/test-tmp/rpc-test-f56c96285cde428189598e59dcd23d5b.sock
I20260926 19:32:35.797562 7073 test_util.cc:175] -----------------------------------------------
I20260926 19:32:35.797668 7073 test_util.cc:176] Had fatal failures, leaving test files at /tmp/dist-test-taskd506i4/test-tmp/rpc-test.6.Parameters_TestRpc.TestCallWithChainCertAndChainCA_SSL_UnixSocket.1790451155663117-7073-0
[ FAILED ] Parameters/TestRpc.TestCallWithChainCertAndChainCA/SSL_UnixSocket, where GetParam() = (true, true) (44 ms)
[ RUN ] Parameters/TestRpc.TestCallWithPasswordProtectedKey/SSL_UnixSocket
I20260926 19:32:35.809022 7134 acceptor_pool.cc:254] collecting diagnostics on the listening RPC socket unix:/tmp/dist-test-taskd506i4/test-tmp/rpc-test-7434ba820b654d11b98b6ef97384fa52.sock every 8 connection(s)
I20260926 19:32:35.809345 7135 acceptor_pool.cc:254] collecting diagnostics on the listening RPC socket unix:/tmp/dist-test-taskd506i4/test-tmp/rpc-test-7434ba820b654d11b98b6ef97384fa52.sock every 8 connection(s)
W20260926 19:32:35.838683 7131 connection.cc:196] Error closing socket: Network error: TlsSocket::Close: Broken pipe
[ OK ] Parameters/TestRpc.TestCallWithPasswordProtectedKey/SSL_UnixSocket (45 ms)
[ RUN ] Parameters/TestRpc.TestCallToBadServer/SSL_UnixSocket
I20260926 19:32:35.862454 7073 rpc-test.cc:394] Status: Network error: Client connection negotiation failed: client connection to 0.0.0.0:0: connect: Connection refused (error 111)
I20260926 19:32:35.863075 7073 rpc-test.cc:394] Status: Network error: Client connection negotiation failed: client connection to 0.0.0.0:0: connect: Connection refused (error 111)
I20260926 19:32:35.863716 7073 rpc-test.cc:394] Status: Network error: Client connection negotiation failed: client connection to 0.0.0.0:0: connect: Connection refused (error 111)
I20260926 19:32:35.864274 7073 rpc-test.cc:394] Status: Network error: Client connection negotiation failed: client connection to 0.0.0.0:0: connect: Connection refused (error 111)
I20260926 19:32:35.864847 7073 rpc-test.cc:394] Status: Network error: Client connection negotiation failed: client connection to 0.0.0.0:0: connect: Connection refused (error 111)
[ OK ] Parameters/TestRpc.TestCallToBadServer/SSL_UnixSocket (23 ms)
[ RUN ] Parameters/TestRpc.TestWrongService/SSL_UnixSocket
I20260926 19:32:35.882359 7169 acceptor_pool.cc:254] collecting diagnostics on the listening RPC socket unix:/tmp/dist-test-taskd506i4/test-tmp/rpc-test-54347b865a464424b3392ac85b7278cb.sock every 8 connection(s)
I20260926 19:32:35.882622 7170 acceptor_pool.cc:254] collecting diagnostics on the listening RPC socket unix:/tmp/dist-test-taskd506i4/test-tmp/rpc-test-54347b865a464424b3392ac85b7278cb.sock every 8 connection(s)
I20260926 19:32:35.904390 7166 messenger.cc:345] service WrongServiceName not registered on TestServer
[ OK ] Parameters/TestRpc.TestWrongService/SSL_UnixSocket (42 ms)
[ RUN ] Parameters/TestRpc.TestConnectionKeepalive/SSL_UnixSocket
I20260926 19:32:35.934082 7192 acceptor_pool.cc:254] collecting diagnostics on the listening RPC socket unix:/tmp/dist-test-taskd506i4/test-tmp/rpc-test-ab5a022fc83b4b6fbcad1e31ab4f65b8.sock every 8 connection(s)
I20260926 19:32:35.934293 7193 acceptor_pool.cc:254] collecting diagnostics on the listening RPC socket unix:/tmp/dist-test-taskd506i4/test-tmp/rpc-test-ab5a022fc83b4b6fbcad1e31ab4f65b8.sock every 8 connection(s)
I20260926 19:32:35.935240 7073 rpc-test.cc:488] Connecting to unix:/tmp/dist-test-taskd506i4/test-tmp/rpc-test-ab5a022fc83b4b6fbcad1e31ab4f65b8.sock
W20260926 19:32:36.412077 7205 connection.cc:196] Error closing socket: Network error: TlsSocket::Close: Broken pipe
[ OK ] Parameters/TestRpc.TestConnectionKeepalive/SSL_UnixSocket (1067 ms)
[ RUN ] Parameters/TestRpc.TestClientConnectionMetrics/SSL_UnixSocket
I20260926 19:32:37.004369 7217 acceptor_pool.cc:254] collecting diagnostics on the listening RPC socket unix:/tmp/dist-test-taskd506i4/test-tmp/rpc-test-1404684bec8b452789295ec5666ca35e.sock every 8 connection(s)
I20260926 19:32:37.004585 7218 acceptor_pool.cc:254] collecting diagnostics on the listening RPC socket unix:/tmp/dist-test-taskd506i4/test-tmp/rpc-test-1404684bec8b452789295ec5666ca35e.sock every 8 connection(s)
I20260926 19:32:37.005606 7073 rpc-test.cc:569] Connecting to unix:/tmp/dist-test-taskd506i4/test-tmp/rpc-test-1404684bec8b452789295ec5666ca35e.sock
W20260926 19:32:58.451596 7214 connection.cc:196] Error closing socket: Network error: TlsSocket::Close: Broken pipe
[ OK ] Parameters/TestRpc.TestClientConnectionMetrics/SSL_UnixSocket (21480 ms)
[ RUN ] Parameters/TestRpc.TestCredentialsPolicy/SSL_UnixSocket
I20260926 19:32:58.482290 7240 acceptor_pool.cc:254] collecting diagnostics on the listening RPC socket unix:/tmp/dist-test-taskd506i4/test-tmp/rpc-test-2360d71c6c204561ae3bbe1af8482510.sock every 8 connection(s)
I20260926 19:32:58.482544 7241 acceptor_pool.cc:254] collecting diagnostics on the listening RPC socket unix:/tmp/dist-test-taskd506i4/test-tmp/rpc-test-2360d71c6c204561ae3bbe1af8482510.sock every 8 connection(s)
I20260926 19:32:58.483413 7073 rpc-test.cc:700] Connecting to unix:/tmp/dist-test-taskd506i4/test-tmp/rpc-test-2360d71c6c204561ae3bbe1af8482510.sock
W20260926 19:32:58.518280 7239 connection.cc:196] Error closing socket: Network error: TlsSocket::Close: Broken pipe
[ OK ] Parameters/TestRpc.TestCredentialsPolicy/SSL_UnixSocket (71 ms)
[ RUN ] Parameters/TestRpc.TestCallLongerThanKeepalive/SSL_UnixSocket
I20260926 19:32:58.543100 7265 acceptor_pool.cc:254] collecting diagnostics on the listening RPC socket unix:/tmp/dist-test-taskd506i4/test-tmp/rpc-test-b97238870c014025b988d37eecceddd1.sock every 8 connection(s)
I20260926 19:32:58.543349 7266 acceptor_pool.cc:254] collecting diagnostics on the listening RPC socket unix:/tmp/dist-test-taskd506i4/test-tmp/rpc-test-b97238870c014025b988d37eecceddd1.sock every 8 connection(s)
I20260926 19:32:58.566381 7269 rpc-test-base.h:222] got call: sleep_micros: 3000000 deferred: true
I20260926 19:33:01.568022 7269 rpcz_store.cc:275] Call kudu.rpc.GenericCalculatorService.Sleep from unix:<unnamed> (request call id 0) took 3001 ms. Trace:
I20260926 19:33:01.568173 7269 rpcz_store.cc:276] 0926 19:32:58.566263 (+ 0us) service_pool.cc:170] Inserting onto call queue
0926 19:32:58.566335 (+ 72us) service_pool.cc:227] Handling call
0926 19:33:01.567979 (+3001644us) inbound_call.cc:173] Queueing success response
Metrics: {}
[ OK ] Parameters/TestRpc.TestCallLongerThanKeepalive/SSL_UnixSocket (3045 ms)
[ RUN ] Parameters/TestRpc.TestRpcSidecar/SSL_UnixSocket
I20260926 19:33:01.620882 7290 acceptor_pool.cc:254] collecting diagnostics on the listening RPC socket unix:/tmp/dist-test-taskd506i4/test-tmp/rpc-test-07934069ddb74249b23e631393d0acf0.sock every 8 connection(s)
I20260926 19:33:01.621119 7291 acceptor_pool.cc:254] collecting diagnostics on the listening RPC socket unix:/tmp/dist-test-taskd506i4/test-tmp/rpc-test-07934069ddb74249b23e631393d0acf0.sock every 8 connection(s)
W20260926 19:33:01.714478 7287 connection.cc:196] Error closing socket: Network error: TlsSocket::Close: Broken pipe
[ OK ] Parameters/TestRpc.TestRpcSidecar/SSL_UnixSocket (143 ms)
[ RUN ] Parameters/TestRpc.TestRpcSidecarLimits/SSL_UnixSocket
I20260926 19:33:03.827194 7315 acceptor_pool.cc:254] collecting diagnostics on the listening RPC socket unix:/tmp/dist-test-taskd506i4/test-tmp/rpc-test-7173304cf3ad421f9904d593ad617663.sock every 8 connection(s)
I20260926 19:33:03.827489 7316 acceptor_pool.cc:254] collecting diagnostics on the listening RPC socket unix:/tmp/dist-test-taskd506i4/test-tmp/rpc-test-7173304cf3ad421f9904d593ad617663.sock every 8 connection(s)
W20260926 19:33:03.839485 7073 serialization.cc:72] Serialized kudu.rpc_test.PushStringsRequestPB (2147483654 bytes) is larger than the maximum configured RPC message size (52428800 bytes). Sending anyway, but peer may reject the data.
W20260926 19:33:03.846235 7312 connection.cc:535] server connection from unix:<unnamed> recv error: Network error: RPC frame had a length of 2147483714, but we only support messages up to 52428800 bytes long.
W20260926 19:33:03.846385 7312 connection.cc:158] shutting down server connection from unix:<unnamed> with pending inbound data: 4/2147483714 bytes received; last active 0 ns ago: status Network error: RPC frame had a length of 2147483714, but we only support messages up to 52428800 bytes long.
W20260926 19:33:03.846793 7328 connection.cc:196] Error closing socket: Network error: TlsSocket::Close: Broken pipe
I20260926 19:33:03.861347 7340 acceptor_pool.cc:254] collecting diagnostics on the listening RPC socket unix:/tmp/dist-test-taskd506i4/test-tmp/rpc-test-7173304cf3ad421f9904d593ad617663.sock every 8 connection(s)
I20260926 19:33:03.861549 7341 acceptor_pool.cc:254] collecting diagnostics on the listening RPC socket unix:/tmp/dist-test-taskd506i4/test-tmp/rpc-test-7173304cf3ad421f9904d593ad617663.sock every 8 connection(s)
W20260926 19:33:09.618165 7337 connection.cc:577] server connection from unix:<unnamed>: received bad data: 'Corruption: Invalid packet: message had a length of 2147483710, but we only support messages up to 2147483647 bytes
'
W20260926 19:33:09.618872 7353 connection.cc:196] Error closing socket: Network error: TlsSocket::Close: Broken pipe
[ OK ] Parameters/TestRpc.TestRpcSidecarLimits/SSL_UnixSocket (8427 ms)
[ RUN ] Parameters/TestRpc.TestCallTimeoutDoesntAffectNegotiation/SSL_UnixSocket
I20260926 19:33:10.161103 7365 acceptor_pool.cc:254] collecting diagnostics on the listening RPC socket unix:/tmp/dist-test-taskd506i4/test-tmp/rpc-test-f16873b385764b13925ca47b3d4baf58.sock every 8 connection(s)
I20260926 19:33:10.161343 7366 acceptor_pool.cc:254] collecting diagnostics on the listening RPC socket unix:/tmp/dist-test-taskd506i4/test-tmp/rpc-test-f16873b385764b13925ca47b3d4baf58.sock every 8 connection(s)
W20260926 19:33:10.180804 7361 negotiation.cc:266] Injecting 500ms delay in negotiation
I20260926 19:33:10.231272 7073 rpc-test-base.h:595] status: Timed out: connection negotiation to unix:/tmp/dist-test-taskd506i4/test-tmp/rpc-test-f16873b385764b13925ca47b3d4baf58.sock for RPC Sleep timed out after 0.050s (ON_OUTBOUND_QUEUE), seconds elapsed: 0.0510569
[ OK ] Parameters/TestRpc.TestCallTimeoutDoesntAffectNegotiation/SSL_UnixSocket (544 ms)
[ RUN ] Parameters/TestRpc.TestRpcHandlerLatencyMetric/SSL_UnixSocket
I20260926 19:33:10.707760 7390 acceptor_pool.cc:254] collecting diagnostics on the listening RPC socket unix:/tmp/dist-test-taskd506i4/test-tmp/rpc-test-d6eab308191e4100a74b38a8abfd158b.sock every 8 connection(s)
I20260926 19:33:10.708017 7391 acceptor_pool.cc:254] collecting diagnostics on the listening RPC socket unix:/tmp/dist-test-taskd506i4/test-tmp/rpc-test-d6eab308191e4100a74b38a8abfd158b.sock every 8 connection(s)
I20260926 19:33:10.744603 7073 rpc-test.cc:1236] Sleep() min lat: 20693
I20260926 19:33:10.744719 7073 rpc-test.cc:1237] Sleep() mean lat: 20693
I20260926 19:33:10.744903 7073 rpc-test.cc:1238] Sleep() max lat: 20693
I20260926 19:33:10.744956 7073 rpc-test.cc:1239] Sleep() #calls: 1
[ OK ] Parameters/TestRpc.TestRpcHandlerLatencyMetric/SSL_UnixSocket (59 ms)
[ RUN ] Parameters/TestRpc.TimedOutOnResponseMetricServiceQueue/SSL_UnixSocket
I20260926 19:33:10.774426 7416 acceptor_pool.cc:254] collecting diagnostics on the listening RPC socket unix:/tmp/dist-test-taskd506i4/test-tmp/rpc-test-803cafc9a6c24be38bc6b7c2907f3d9d.sock every 8 connection(s)
I20260926 19:33:10.774633 7417 acceptor_pool.cc:254] collecting diagnostics on the listening RPC socket unix:/tmp/dist-test-taskd506i4/test-tmp/rpc-test-803cafc9a6c24be38bc6b7c2907f3d9d.sock every 8 connection(s)
W20260926 19:33:10.844614 7418 rpcz_store.cc:267] Call kudu.rpc_test.CalculatorService.Sleep from unix:<unnamed> (request call id 2) took 20 ms (client timeout 20 ms). Trace:
W20260926 19:33:10.844775 7418 rpcz_store.cc:269] 0926 19:33:10.824198 (+ 0us) service_pool.cc:170] Inserting onto call queue
0926 19:33:10.844519 (+ 20321us) service_pool.cc:214] Skipping call since client already timed out
0926 19:33:10.844592 (+ 73us) inbound_call.cc:173] Queueing failure response
Metrics: {}
W20260926 19:33:10.846097 7413 connection.cc:196] Error closing socket: Network error: TlsSocket::Close: Broken pipe
[ OK ] Parameters/TestRpc.TimedOutOnResponseMetricServiceQueue/SSL_UnixSocket (98 ms)
[ RUN ] Parameters/TestRpc.RpcPendingConnectionsMetric/SSL_UnixSocket
I20260926 19:33:10.853464 7439 acceptor_pool.cc:254] collecting diagnostics on the listening RPC socket 0.0.0.0:34731 every 8 connection(s)
I20260926 19:33:10.853662 7440 acceptor_pool.cc:254] collecting diagnostics on the listening RPC socket 0.0.0.0:34731 every 8 connection(s)
W20260926 19:33:10.855562 7435 negotiation.cc:337] Failed RPC negotiation. Trace:
0926 19:33:10.854994 (+ 0us) reactor.cc:625] Submitting negotiation task for server connection from 127.0.0.1:38220 (local address 127.0.0.1:34731)
0926 19:33:10.855124 (+ 130us) server_negotiation.cc:206] Beginning negotiation
0926 19:33:10.855128 (+ 4us) server_negotiation.cc:399] Waiting for connection header
0926 19:33:10.855250 (+ 122us) negotiation.cc:327] Negotiation complete: Network error: Server connection negotiation failed: server connection from 127.0.0.1:38220: BlockingRecv error: recv got EOF from 127.0.0.1:38220 (error 108)
Metrics: {"server-negotiator.queue_time_us":45}
[ OK ] Parameters/TestRpc.RpcPendingConnectionsMetric/SSL_UnixSocket (19 ms)
[ RUN ] Parameters/TestRpc.TestRpcContextClientDeadline/SSL_UnixSocket
I20260926 19:33:10.888299 7455 acceptor_pool.cc:254] collecting diagnostics on the listening RPC socket unix:/tmp/dist-test-taskd506i4/test-tmp/rpc-test-e40671f91d92475cb21d1ec60058d756.sock every 8 connection(s)
I20260926 19:33:10.888494 7456 acceptor_pool.cc:254] collecting diagnostics on the listening RPC socket unix:/tmp/dist-test-taskd506i4/test-tmp/rpc-test-e40671f91d92475cb21d1ec60058d756.sock every 8 connection(s)
[ OK ] Parameters/TestRpc.TestRpcContextClientDeadline/SSL_UnixSocket (75 ms)
[ RUN ] Parameters/TestRpc.TestApplicationFeatureFlagUnsupportedServer/SSL_UnixSocket
I20260926 19:33:10.957998 7480 acceptor_pool.cc:254] collecting diagnostics on the listening RPC socket unix:/tmp/dist-test-taskd506i4/test-tmp/rpc-test-9c04e423be5b4a48bc5b9bb9a1496a7b.sock every 8 connection(s)
I20260926 19:33:10.958257 7481 acceptor_pool.cc:254] collecting diagnostics on the listening RPC socket unix:/tmp/dist-test-taskd506i4/test-tmp/rpc-test-9c04e423be5b4a48bc5b9bb9a1496a7b.sock every 8 connection(s)
W20260926 19:33:10.982095 7477 connection.cc:196] Error closing socket: Network error: TlsSocket::Close: Broken pipe
[ OK ] Parameters/TestRpc.TestApplicationFeatureFlagUnsupportedServer/SSL_UnixSocket (41 ms)
[ RUN ] Parameters/TestRpc.TestCancellationAsync/SSL_UnixSocket
I20260926 19:33:10.998754 7505 acceptor_pool.cc:254] collecting diagnostics on the listening RPC socket unix:/tmp/dist-test-taskd506i4/test-tmp/rpc-test-847f545e0e80490885d0e36dc217d966.sock every 8 connection(s)
I20260926 19:33:10.998986 7506 acceptor_pool.cc:254] collecting diagnostics on the listening RPC socket unix:/tmp/dist-test-taskd506i4/test-tmp/rpc-test-847f545e0e80490885d0e36dc217d966.sock every 8 connection(s)
I20260926 19:33:10.999823 7073 rpc-test.cc:1716] Connecting to unix:/tmp/dist-test-taskd506i4/test-tmp/rpc-test-847f545e0e80490885d0e36dc217d966.sock
I20260926 19:33:11.011359 7073 test_util.cc:268] Using random seed: -415606773
I20260926 19:33:11.044911 7509 rpc-test-base.h:240] got call: sleep_micros: 500 pattern: 4294967295 num_repetitions: 2097152 sidecar_idx: 0
I20260926 19:33:11.072458 7508 rpc-test-base.h:240] got call: sleep_micros: 500 pattern: 4294967295 num_repetitions: 2097152 sidecar_idx: 0
I20260926 19:33:11.100852 7509 rpc-test-base.h:240] got call: sleep_micros: 500 pattern: 4294967295 num_repetitions: 2097152 sidecar_idx: 0
I20260926 19:33:11.129362 7508 rpc-test-base.h:240] got call: sleep_micros: 500 pattern: 4294967295 num_repetitions: 2097152 sidecar_idx: 0
I20260926 19:33:11.158555 7507 rpc-test-base.h:240] got call: sleep_micros: 500 pattern: 4294967295 num_repetitions: 2097152 sidecar_idx: 0
I20260926 19:33:11.191560 7508 rpc-test-base.h:240] got call: sleep_micros: 500 pattern: 4294967295 num_repetitions: 2097152 sidecar_idx: 0
I20260926 19:33:11.225719 7507 rpc-test-base.h:240] got call: sleep_micros: 500 pattern: 4294967295 num_repetitions: 2097152 sidecar_idx: 0
W20260926 19:33:11.228127 7502 connection.cc:196] Error closing socket: Network error: TlsSocket::Close: Broken pipe
W20260926 19:33:11.246994 7502 connection.cc:441] server connection from unix:<unnamed> torn down before Call kudu.rpc.GenericCalculatorService.SleepWithSidecar from unix:<unnamed> (request call id 8) could send its response
W20260926 19:33:11.267536 7502 connection.cc:441] server connection from unix:<unnamed> torn down before Call kudu.rpc.GenericCalculatorService.SleepWithSidecar from unix:<unnamed> (request call id 9) could send its response
[ OK ] Parameters/TestRpc.TestCancellationAsync/SSL_UnixSocket (285 ms)
[ RUN ] Parameters/TestRpc.TestPerformanceBySocketType/SSL_UnixSocket
I20260926 19:33:11.308501 7530 acceptor_pool.cc:254] collecting diagnostics on the listening RPC socket unix:/tmp/dist-test-taskd506i4/test-tmp/rpc-test-9bc2069b1f9549d7af4402a580247457.sock every 8 connection(s)
I20260926 19:33:11.308809 7531 acceptor_pool.cc:254] collecting diagnostics on the listening RPC socket unix:/tmp/dist-test-taskd506i4/test-tmp/rpc-test-9bc2069b1f9549d7af4402a580247457.sock every 8 connection(s)
I20260926 19:33:11.309842 7073 rpc-test.cc:1846] Connecting to unix:/tmp/dist-test-taskd506i4/test-tmp/rpc-test-9bc2069b1f9549d7af4402a580247457.sock
I20260926 19:33:14.497664 7073 rpc-test.cc:1859] Sending 1024MB via ssl-enabled unix socket: real 3.174s user 3.049s sys 2.366s
I20260926 19:33:17.528264 7073 rpc-test.cc:1859] Sending 1024MB via ssl-enabled unix socket: real 3.030s user 2.944s sys 2.170s
I20260926 19:33:20.645067 7073 rpc-test.cc:1859] Sending 1024MB via ssl-enabled unix socket: real 3.117s user 3.038s sys 2.244s
I20260926 19:33:23.751405 7073 rpc-test.cc:1859] Sending 1024MB via ssl-enabled unix socket: real 3.106s user 2.915s sys 2.345s
I20260926 19:33:26.850957 7073 rpc-test.cc:1859] Sending 1024MB via ssl-enabled unix socket: real 3.099s user 2.994s sys 2.262s
W20260926 19:33:26.852236 7527 connection.cc:196] Error closing socket: Network error: TlsSocket::Close: Broken pipe
[ OK ] Parameters/TestRpc.TestPerformanceBySocketType/SSL_UnixSocket (15587 ms)
[----------] 20 tests from Parameters/TestRpc (51175 ms total)
[----------] 1 test from Parameters/TestRpcSocketTxRxQueue
[ RUN ] Parameters/TestRpcSocketTxRxQueue.AcceptorRxQueueSizeMetric/0
I20260926 19:33:26.873459 7555 acceptor_pool.cc:254] collecting diagnostics on the listening RPC socket 0.0.0.0:42263 every 1 connection(s)
I20260926 19:33:26.874310 7556 acceptor_pool.cc:254] collecting diagnostics on the listening RPC socket 0.0.0.0:42263 every 1 connection(s)
W20260926 19:33:26.876087 7551 negotiation.cc:337] Failed RPC negotiation. Trace:
0926 19:33:26.875598 (+ 0us) reactor.cc:625] Submitting negotiation task for server connection from 127.0.0.1:48152 (local address 127.0.0.1:42263)
0926 19:33:26.875793 (+ 195us) server_negotiation.cc:206] Beginning negotiation
0926 19:33:26.875799 (+ 6us) server_negotiation.cc:399] Waiting for connection header
0926 19:33:26.875950 (+ 151us) negotiation.cc:327] Negotiation complete: Network error: Server connection negotiation failed: server connection from 127.0.0.1:48152: BlockingRecv error: recv got EOF from 127.0.0.1:48152 (error 108)
Metrics: {"server-negotiator.queue_time_us":54}
[ OK ] Parameters/TestRpcSocketTxRxQueue.AcceptorRxQueueSizeMetric/0 (21 ms)
[----------] 1 test from Parameters/TestRpcSocketTxRxQueue (21 ms total)
[----------] Global test environment tear-down
[==========] 21 tests from 2 test suites ran. (51197 ms total)
[ PASSED ] 20 tests.
[ FAILED ] 1 test, listed below:
[ FAILED ] Parameters/TestRpc.TestCallWithChainCertAndChainCA/SSL_UnixSocket, where GetParam() = (true, true)
1 FAILED TEST