Diagnosed failure

Parameters/TestRpc.TestCallWithChainCertAndChainCA/SSL_UnixSocket: /data0/somelongdirectorytoavoidrpathissues/src/kudu/src/kudu/rpc/rpc-test.cc:270: Failure
Failed
Bad status: Runtime error: could not verify certificate chain (error with cert: subject=CN = localhost, ST = sadfjas, C = AS, emailAddress = sdflkdsajf, O = lskdfjlsad, OU = sldfkja, issuer=C = AS, ST = ASDfkjdhf, L = lskdjf, O = saldfja, OU = skdjf, CN = localhost, emailAddress = sadjflkadsj): : certificate has expired
Google Test trace:
/data0/somelongdirectorytoavoidrpathissues/src/kudu/src/kudu/rpc/rpc-test.cc:267: Connecting to unix:/tmp/dist-test-task_9cEtK/test-tmp/rpc-test-fbe8039b62f2405db61820767f2818e7.sock
I20260929 19:00:48.317874   383 test_util.cc:175] -----------------------------------------------
I20260929 19:00:48.317938   383 test_util.cc:176] Had fatal failures, leaving test files at /tmp/dist-test-task_9cEtK/test-tmp/rpc-test.6.Parameters_TestRpc.TestCallWithChainCertAndChainCA_SSL_UnixSocket.1790708448253067-383-0

Full log

Note: This is test shard 7 of 8.
[==========] Running 21 tests from 2 test suites.
[----------] Global test environment set-up.
[----------] 20 tests from Parameters/TestRpc
[ RUN      ] Parameters/TestRpc.TestMessengerCreateDestroy/SSL_UnixSocket
WARNING: Logging before InitGoogleLogging() is written to STDERR
I20260929 19:00:48.268427   383 rpc-test.cc:169] started messenger TestCreateDestroy
[       OK ] Parameters/TestRpc.TestMessengerCreateDestroy/SSL_UnixSocket (13 ms)
[ RUN      ] Parameters/TestRpc.TestNegotiationDeadlock/SSL_UnixSocket
I20260929 19:00:48.285221   403 acceptor_pool.cc:254] collecting diagnostics on the listening RPC socket unix:/tmp/dist-test-task_9cEtK/test-tmp/rpc-test-68d89278c642403f9e20b6fe7a453990.sock every 8 connection(s)
I20260929 19:00:48.285221   404 acceptor_pool.cc:254] collecting diagnostics on the listening RPC socket unix:/tmp/dist-test-task_9cEtK/test-tmp/rpc-test-68d89278c642403f9e20b6fe7a453990.sock every 8 connection(s)
[       OK ] Parameters/TestRpc.TestNegotiationDeadlock/SSL_UnixSocket (22 ms)
[ RUN      ] Parameters/TestRpc.TestCallWithChainCertAndChainCA/SSL_UnixSocket
I20260929 19:00:48.313297   419 acceptor_pool.cc:254] collecting diagnostics on the listening RPC socket unix:/tmp/dist-test-task_9cEtK/test-tmp/rpc-test-fbe8039b62f2405db61820767f2818e7.sock every 8 connection(s)
I20260929 19:00:48.313297   420 acceptor_pool.cc:254] collecting diagnostics on the listening RPC socket unix:/tmp/dist-test-task_9cEtK/test-tmp/rpc-test-fbe8039b62f2405db61820767f2818e7.sock every 8 connection(s)
/data0/somelongdirectorytoavoidrpathissues/src/kudu/src/kudu/rpc/rpc-test.cc:270: Failure
Failed
Bad status: Runtime error: could not verify certificate chain (error with cert: subject=CN = localhost, ST = sadfjas, C = AS, emailAddress = sdflkdsajf, O = lskdfjlsad, OU = sldfkja, issuer=C = AS, ST = ASDfkjdhf, L = lskdjf, O = saldfja, OU = skdjf, CN = localhost, emailAddress = sadjflkadsj): : certificate has expired
Google Test trace:
/data0/somelongdirectorytoavoidrpathissues/src/kudu/src/kudu/rpc/rpc-test.cc:267: Connecting to unix:/tmp/dist-test-task_9cEtK/test-tmp/rpc-test-fbe8039b62f2405db61820767f2818e7.sock
I20260929 19:00:48.317874   383 test_util.cc:175] -----------------------------------------------
I20260929 19:00:48.317938   383 test_util.cc:176] Had fatal failures, leaving test files at /tmp/dist-test-task_9cEtK/test-tmp/rpc-test.6.Parameters_TestRpc.TestCallWithChainCertAndChainCA_SSL_UnixSocket.1790708448253067-383-0
[  FAILED  ] Parameters/TestRpc.TestCallWithChainCertAndChainCA/SSL_UnixSocket, where GetParam() = (true, true) (26 ms)
[ RUN      ] Parameters/TestRpc.TestCallWithPasswordProtectedKey/SSL_UnixSocket
I20260929 19:00:48.334856   444 acceptor_pool.cc:254] collecting diagnostics on the listening RPC socket unix:/tmp/dist-test-task_9cEtK/test-tmp/rpc-test-fe6c752e16c54fa5b8cc01d5a225fb20.sock every 8 connection(s)
I20260929 19:00:48.334887   445 acceptor_pool.cc:254] collecting diagnostics on the listening RPC socket unix:/tmp/dist-test-task_9cEtK/test-tmp/rpc-test-fe6c752e16c54fa5b8cc01d5a225fb20.sock every 8 connection(s)
W20260929 19:00:48.345645   441 connection.cc:196] Error closing socket: Network error: TlsSocket::Close: Broken pipe
[       OK ] Parameters/TestRpc.TestCallWithPasswordProtectedKey/SSL_UnixSocket (28 ms)
[ RUN      ] Parameters/TestRpc.TestCallToBadServer/SSL_UnixSocket
I20260929 19:00:48.361649   383 rpc-test.cc:394] Status: Network error: Client connection negotiation failed: client connection to 0.0.0.0:0: connect: Connection refused (error 111)
I20260929 19:00:48.361951   383 rpc-test.cc:394] Status: Network error: Client connection negotiation failed: client connection to 0.0.0.0:0: connect: Connection refused (error 111)
I20260929 19:00:48.362172   383 rpc-test.cc:394] Status: Network error: Client connection negotiation failed: client connection to 0.0.0.0:0: connect: Connection refused (error 111)
I20260929 19:00:48.362402   383 rpc-test.cc:394] Status: Network error: Client connection negotiation failed: client connection to 0.0.0.0:0: connect: Connection refused (error 111)
I20260929 19:00:48.362571   383 rpc-test.cc:394] Status: Network error: Client connection negotiation failed: client connection to 0.0.0.0:0: connect: Connection refused (error 111)
[       OK ] Parameters/TestRpc.TestCallToBadServer/SSL_UnixSocket (16 ms)
[ RUN      ] Parameters/TestRpc.TestWrongService/SSL_UnixSocket
I20260929 19:00:48.381839   479 acceptor_pool.cc:254] collecting diagnostics on the listening RPC socket unix:/tmp/dist-test-task_9cEtK/test-tmp/rpc-test-a0b55df04bcd46b3be5fd23fbea5adfa.sock every 8 connection(s)
I20260929 19:00:48.381878   480 acceptor_pool.cc:254] collecting diagnostics on the listening RPC socket unix:/tmp/dist-test-task_9cEtK/test-tmp/rpc-test-a0b55df04bcd46b3be5fd23fbea5adfa.sock every 8 connection(s)
I20260929 19:00:48.395128   476 messenger.cc:345] service WrongServiceName not registered on TestServer
[       OK ] Parameters/TestRpc.TestWrongService/SSL_UnixSocket (33 ms)
[ RUN      ] Parameters/TestRpc.TestConnectionKeepalive/SSL_UnixSocket
I20260929 19:00:48.408229   502 acceptor_pool.cc:254] collecting diagnostics on the listening RPC socket unix:/tmp/dist-test-task_9cEtK/test-tmp/rpc-test-1ff07c7e0f8643bba96d95ac5f9e8813.sock every 8 connection(s)
I20260929 19:00:48.408277   503 acceptor_pool.cc:254] collecting diagnostics on the listening RPC socket unix:/tmp/dist-test-task_9cEtK/test-tmp/rpc-test-1ff07c7e0f8643bba96d95ac5f9e8813.sock every 8 connection(s)
I20260929 19:00:48.408433   383 rpc-test.cc:488] Connecting to unix:/tmp/dist-test-task_9cEtK/test-tmp/rpc-test-1ff07c7e0f8643bba96d95ac5f9e8813.sock
W20260929 19:00:48.898738   515 connection.cc:196] Error closing socket: Network error: TlsSocket::Close: Broken pipe
[       OK ] Parameters/TestRpc.TestConnectionKeepalive/SSL_UnixSocket (1044 ms)
[ RUN      ] Parameters/TestRpc.TestClientConnectionMetrics/SSL_UnixSocket
I20260929 19:00:49.465299   527 acceptor_pool.cc:254] collecting diagnostics on the listening RPC socket unix:/tmp/dist-test-task_9cEtK/test-tmp/rpc-test-2e806c595ce4463d95bd9fa62d120e3c.sock every 8 connection(s)
I20260929 19:00:49.465349   528 acceptor_pool.cc:254] collecting diagnostics on the listening RPC socket unix:/tmp/dist-test-task_9cEtK/test-tmp/rpc-test-2e806c595ce4463d95bd9fa62d120e3c.sock every 8 connection(s)
I20260929 19:00:49.465521   383 rpc-test.cc:569] Connecting to unix:/tmp/dist-test-task_9cEtK/test-tmp/rpc-test-2e806c595ce4463d95bd9fa62d120e3c.sock
W20260929 19:00:57.925227   524 connection.cc:196] Error closing socket: Network error: TlsSocket::Close: Broken pipe
[       OK ] Parameters/TestRpc.TestClientConnectionMetrics/SSL_UnixSocket (8485 ms)
[ RUN      ] Parameters/TestRpc.TestCredentialsPolicy/SSL_UnixSocket
I20260929 19:00:57.940675   550 acceptor_pool.cc:254] collecting diagnostics on the listening RPC socket unix:/tmp/dist-test-task_9cEtK/test-tmp/rpc-test-421e799a5ffe435f91ec88eb69bf9248.sock every 8 connection(s)
I20260929 19:00:57.940747   551 acceptor_pool.cc:254] collecting diagnostics on the listening RPC socket unix:/tmp/dist-test-task_9cEtK/test-tmp/rpc-test-421e799a5ffe435f91ec88eb69bf9248.sock every 8 connection(s)
I20260929 19:00:57.940940   383 rpc-test.cc:700] Connecting to unix:/tmp/dist-test-task_9cEtK/test-tmp/rpc-test-421e799a5ffe435f91ec88eb69bf9248.sock
W20260929 19:00:57.963726   549 connection.cc:196] Error closing socket: Network error: TlsSocket::Close: Broken pipe
W20260929 19:00:57.967031   549 connection.cc:196] Error closing socket: Network error: TlsSocket::Close: Broken pipe
[       OK ] Parameters/TestRpc.TestCredentialsPolicy/SSL_UnixSocket (41 ms)
[ RUN      ] Parameters/TestRpc.TestCallLongerThanKeepalive/SSL_UnixSocket
I20260929 19:00:57.973791   575 acceptor_pool.cc:254] collecting diagnostics on the listening RPC socket unix:/tmp/dist-test-task_9cEtK/test-tmp/rpc-test-20cd44bb03b046908c0bb5c7c73da721.sock every 8 connection(s)
I20260929 19:00:57.973845   576 acceptor_pool.cc:254] collecting diagnostics on the listening RPC socket unix:/tmp/dist-test-task_9cEtK/test-tmp/rpc-test-20cd44bb03b046908c0bb5c7c73da721.sock every 8 connection(s)
I20260929 19:00:57.986171   579 rpc-test-base.h:222] got call: sleep_micros: 3000000 deferred: true
I20260929 19:01:00.986881   579 rpcz_store.cc:275] Call kudu.rpc.GenericCalculatorService.Sleep from unix:<unnamed> (request call id 0) took 3000 ms. Trace:
I20260929 19:01:00.987040   579 rpcz_store.cc:276] 0929 19:00:57.986119 (+     0us) service_pool.cc:170] Inserting onto call queue
0929 19:00:57.986152 (+    33us) service_pool.cc:227] Handling call
0929 19:01:00.986865 (+3000713us) inbound_call.cc:173] Queueing success response
Metrics: {}
W20260929 19:01:00.988101   572 connection.cc:196] Error closing socket: Network error: TlsSocket::Close: Broken pipe
[       OK ] Parameters/TestRpc.TestCallLongerThanKeepalive/SSL_UnixSocket (3020 ms)
[ RUN      ] Parameters/TestRpc.TestRpcSidecar/SSL_UnixSocket
I20260929 19:01:01.010809   600 acceptor_pool.cc:254] collecting diagnostics on the listening RPC socket unix:/tmp/dist-test-task_9cEtK/test-tmp/rpc-test-49f6fc7fcf1944c58740348c44285cca.sock every 8 connection(s)
I20260929 19:01:01.010843   601 acceptor_pool.cc:254] collecting diagnostics on the listening RPC socket unix:/tmp/dist-test-task_9cEtK/test-tmp/rpc-test-49f6fc7fcf1944c58740348c44285cca.sock every 8 connection(s)
W20260929 19:01:01.049212   597 connection.cc:196] Error closing socket: Network error: TlsSocket::Close: Broken pipe
[       OK ] Parameters/TestRpc.TestRpcSidecar/SSL_UnixSocket (60 ms)
[ RUN      ] Parameters/TestRpc.TestRpcSidecarLimits/SSL_UnixSocket
I20260929 19:01:02.785117   625 acceptor_pool.cc:254] collecting diagnostics on the listening RPC socket unix:/tmp/dist-test-task_9cEtK/test-tmp/rpc-test-78a3c748b8f54f0796aa04ccc6246a32.sock every 8 connection(s)
I20260929 19:01:02.785168   626 acceptor_pool.cc:254] collecting diagnostics on the listening RPC socket unix:/tmp/dist-test-task_9cEtK/test-tmp/rpc-test-78a3c748b8f54f0796aa04ccc6246a32.sock every 8 connection(s)
W20260929 19:01:02.791738   383 serialization.cc:72] Serialized kudu.rpc_test.PushStringsRequestPB (2147483654 bytes) is larger than the maximum configured RPC message size (52428800 bytes). Sending anyway, but peer may reject the data.
W20260929 19:01:02.794445   622 connection.cc:535] server connection from unix:<unnamed> recv error: Network error: RPC frame had a length of 2147483714, but we only support messages up to 52428800 bytes long.
W20260929 19:01:02.794488   622 connection.cc:158] shutting down server connection from unix:<unnamed> with pending inbound data: 4/2147483714 bytes received; last active 0 ns ago: status Network error: RPC frame had a length of 2147483714, but we only support messages up to 52428800 bytes long.
W20260929 19:01:02.794603   638 connection.cc:698] client connection to unix:/tmp/dist-test-task_9cEtK/test-tmp/rpc-test-78a3c748b8f54f0796aa04ccc6246a32.sock send error: Network error: failed to write to TLS socket: Broken pipe
W20260929 19:01:02.794734   638 connection.cc:196] Error closing socket: Network error: TlsSocket::Close: Success
I20260929 19:01:02.802520   651 acceptor_pool.cc:254] collecting diagnostics on the listening RPC socket unix:/tmp/dist-test-task_9cEtK/test-tmp/rpc-test-78a3c748b8f54f0796aa04ccc6246a32.sock every 8 connection(s)
I20260929 19:01:02.802498   650 acceptor_pool.cc:254] collecting diagnostics on the listening RPC socket unix:/tmp/dist-test-task_9cEtK/test-tmp/rpc-test-78a3c748b8f54f0796aa04ccc6246a32.sock every 8 connection(s)
W20260929 19:01:07.096165   647 connection.cc:577] server connection from unix:<unnamed>: received bad data: 'Corruption: Invalid packet: message had a length of 2147483710, but we only support messages up to 2147483647 bytes
'
W20260929 19:01:07.096416   663 connection.cc:196] Error closing socket: Network error: TlsSocket::Close: Broken pipe
[       OK ] Parameters/TestRpc.TestRpcSidecarLimits/SSL_UnixSocket (6048 ms)
[ RUN      ] Parameters/TestRpc.TestCallTimeoutDoesntAffectNegotiation/SSL_UnixSocket
I20260929 19:01:07.127091   676 acceptor_pool.cc:254] collecting diagnostics on the listening RPC socket unix:/tmp/dist-test-task_9cEtK/test-tmp/rpc-test-e8d90b56bb05420c8222b2a01d15090c.sock every 8 connection(s)
I20260929 19:01:07.127230   675 acceptor_pool.cc:254] collecting diagnostics on the listening RPC socket unix:/tmp/dist-test-task_9cEtK/test-tmp/rpc-test-e8d90b56bb05420c8222b2a01d15090c.sock every 8 connection(s)
W20260929 19:01:07.153264   669 negotiation.cc:266] Injecting 500ms delay in negotiation
I20260929 19:01:07.203464   383 rpc-test-base.h:595] status: Timed out: connection negotiation to unix:/tmp/dist-test-task_9cEtK/test-tmp/rpc-test-e8d90b56bb05420c8222b2a01d15090c.sock for RPC Sleep timed out after 0.050s (ON_OUTBOUND_QUEUE), seconds elapsed: 0.0505297
W20260929 19:01:07.657698   672 connection.cc:196] Error closing socket: Network error: TlsSocket::Close: Broken pipe
[       OK ] Parameters/TestRpc.TestCallTimeoutDoesntAffectNegotiation/SSL_UnixSocket (560 ms)
[ RUN      ] Parameters/TestRpc.TestRpcHandlerLatencyMetric/SSL_UnixSocket
I20260929 19:01:07.691144   700 acceptor_pool.cc:254] collecting diagnostics on the listening RPC socket unix:/tmp/dist-test-task_9cEtK/test-tmp/rpc-test-e68abca99ee04bd19b039c682bae9d87.sock every 8 connection(s)
I20260929 19:01:07.691198   701 acceptor_pool.cc:254] collecting diagnostics on the listening RPC socket unix:/tmp/dist-test-task_9cEtK/test-tmp/rpc-test-e68abca99ee04bd19b039c682bae9d87.sock every 8 connection(s)
I20260929 19:01:07.731241   383 rpc-test.cc:1236] Sleep() min lat: 20257
I20260929 19:01:07.731361   383 rpc-test.cc:1237] Sleep() mean lat: 20257
I20260929 19:01:07.731402   383 rpc-test.cc:1238] Sleep() max lat: 20257
I20260929 19:01:07.731436   383 rpc-test.cc:1239] Sleep() #calls: 1
W20260929 19:01:07.732079   697 connection.cc:196] Error closing socket: Network error: TlsSocket::Close: Broken pipe
[       OK ] Parameters/TestRpc.TestRpcHandlerLatencyMetric/SSL_UnixSocket (74 ms)
[ RUN      ] Parameters/TestRpc.TimedOutOnResponseMetricServiceQueue/SSL_UnixSocket
I20260929 19:01:07.738638   726 acceptor_pool.cc:254] collecting diagnostics on the listening RPC socket unix:/tmp/dist-test-task_9cEtK/test-tmp/rpc-test-7689d6237ffb4338b443f5d73f9e8299.sock every 8 connection(s)
I20260929 19:01:07.738690   727 acceptor_pool.cc:254] collecting diagnostics on the listening RPC socket unix:/tmp/dist-test-task_9cEtK/test-tmp/rpc-test-7689d6237ffb4338b443f5d73f9e8299.sock every 8 connection(s)
W20260929 19:01:07.789009   728 rpcz_store.cc:267] Call kudu.rpc_test.CalculatorService.Sleep from unix:<unnamed> (request call id 2) took 20 ms (client timeout 20 ms). Trace:
W20260929 19:01:07.789173   728 rpcz_store.cc:269] 0929 19:01:07.768694 (+     0us) service_pool.cc:170] Inserting onto call queue
0929 19:01:07.788983 (+ 20289us) service_pool.cc:214] Skipping call since client already timed out
0929 19:01:07.788993 (+    10us) inbound_call.cc:173] Queueing failure response
Metrics: {}
[       OK ] Parameters/TestRpc.TimedOutOnResponseMetricServiceQueue/SSL_UnixSocket (57 ms)
[ RUN      ] Parameters/TestRpc.RpcPendingConnectionsMetric/SSL_UnixSocket
I20260929 19:01:07.792434   749 acceptor_pool.cc:254] collecting diagnostics on the listening RPC socket 0.0.0.0:36055 every 8 connection(s)
I20260929 19:01:07.792514   750 acceptor_pool.cc:254] collecting diagnostics on the listening RPC socket 0.0.0.0:36055 every 8 connection(s)
W20260929 19:01:07.800601   745 negotiation.cc:337] Failed RPC negotiation. Trace:
0929 19:01:07.800326 (+     0us) reactor.cc:625] Submitting negotiation task for server connection from 127.0.0.1:41714 (local address 127.0.0.1:36055)
0929 19:01:07.800410 (+    84us) server_negotiation.cc:206] Beginning negotiation
0929 19:01:07.800412 (+     2us) server_negotiation.cc:399] Waiting for connection header
0929 19:01:07.800522 (+   110us) negotiation.cc:327] Negotiation complete: Network error: Server connection negotiation failed: server connection from 127.0.0.1:41714: BlockingRecv error: recv got EOF from 127.0.0.1:41714 (error 108)
Metrics: {"server-negotiator.queue_time_us":42}
[       OK ] Parameters/TestRpc.RpcPendingConnectionsMetric/SSL_UnixSocket (20 ms)
[ RUN      ] Parameters/TestRpc.TestRpcContextClientDeadline/SSL_UnixSocket
I20260929 19:01:07.823870   765 acceptor_pool.cc:254] collecting diagnostics on the listening RPC socket unix:/tmp/dist-test-task_9cEtK/test-tmp/rpc-test-00568cebed0b4d17a6f60043688e8da7.sock every 8 connection(s)
I20260929 19:01:07.823911   766 acceptor_pool.cc:254] collecting diagnostics on the listening RPC socket unix:/tmp/dist-test-task_9cEtK/test-tmp/rpc-test-00568cebed0b4d17a6f60043688e8da7.sock every 8 connection(s)
W20260929 19:01:07.863885   762 connection.cc:196] Error closing socket: Network error: TlsSocket::Close: Broken pipe
[       OK ] Parameters/TestRpc.TestRpcContextClientDeadline/SSL_UnixSocket (53 ms)
[ RUN      ] Parameters/TestRpc.TestApplicationFeatureFlagUnsupportedServer/SSL_UnixSocket
I20260929 19:01:07.879797   790 acceptor_pool.cc:254] collecting diagnostics on the listening RPC socket unix:/tmp/dist-test-task_9cEtK/test-tmp/rpc-test-74161a2ead6048a8889fd8fea8334dc8.sock every 8 connection(s)
I20260929 19:01:07.879844   791 acceptor_pool.cc:254] collecting diagnostics on the listening RPC socket unix:/tmp/dist-test-task_9cEtK/test-tmp/rpc-test-74161a2ead6048a8889fd8fea8334dc8.sock every 8 connection(s)
[       OK ] Parameters/TestRpc.TestApplicationFeatureFlagUnsupportedServer/SSL_UnixSocket (29 ms)
[ RUN      ] Parameters/TestRpc.TestCancellationAsync/SSL_UnixSocket
I20260929 19:01:07.910410   815 acceptor_pool.cc:254] collecting diagnostics on the listening RPC socket unix:/tmp/dist-test-task_9cEtK/test-tmp/rpc-test-e5b82cfa7e414ad9a024f1fa6d91f331.sock every 8 connection(s)
I20260929 19:01:07.910458   816 acceptor_pool.cc:254] collecting diagnostics on the listening RPC socket unix:/tmp/dist-test-task_9cEtK/test-tmp/rpc-test-e5b82cfa7e414ad9a024f1fa6d91f331.sock every 8 connection(s)
I20260929 19:01:07.910630   383 rpc-test.cc:1716] Connecting to unix:/tmp/dist-test-task_9cEtK/test-tmp/rpc-test-e5b82cfa7e414ad9a024f1fa6d91f331.sock
I20260929 19:01:07.919118   383 test_util.cc:268] Using random seed: -836736756
I20260929 19:01:07.932988   819 rpc-test-base.h:240] got call: sleep_micros: 500 pattern: 4294967295 num_repetitions: 2097152 sidecar_idx: 0
I20260929 19:01:07.943480   819 rpc-test-base.h:240] got call: sleep_micros: 500 pattern: 4294967295 num_repetitions: 2097152 sidecar_idx: 0
I20260929 19:01:07.953790   819 rpc-test-base.h:240] got call: sleep_micros: 500 pattern: 4294967295 num_repetitions: 2097152 sidecar_idx: 0
I20260929 19:01:07.964031   819 rpc-test-base.h:240] got call: sleep_micros: 500 pattern: 4294967295 num_repetitions: 2097152 sidecar_idx: 0
I20260929 19:01:07.974213   819 rpc-test-base.h:240] got call: sleep_micros: 500 pattern: 4294967295 num_repetitions: 2097152 sidecar_idx: 0
I20260929 19:01:07.984812   819 rpc-test-base.h:240] got call: sleep_micros: 500 pattern: 4294967295 num_repetitions: 2097152 sidecar_idx: 0
I20260929 19:01:07.994994   819 rpc-test-base.h:240] got call: sleep_micros: 500 pattern: 4294967295 num_repetitions: 2097152 sidecar_idx: 0
I20260929 19:01:08.005270   819 rpc-test-base.h:240] got call: sleep_micros: 500 pattern: 4294967295 num_repetitions: 2097152 sidecar_idx: 0
W20260929 19:01:08.006593   812 connection.cc:196] Error closing socket: Network error: TlsSocket::Close: Broken pipe
W20260929 19:01:08.008460   812 connection.cc:441] server connection from unix:<unnamed> torn down before Call kudu.rpc.GenericCalculatorService.SleepWithSidecar from unix:<unnamed> (request call id 9) could send its response
[       OK ] Parameters/TestRpc.TestCancellationAsync/SSL_UnixSocket (114 ms)
[ RUN      ] Parameters/TestRpc.TestPerformanceBySocketType/SSL_UnixSocket
I20260929 19:01:08.023970   841 acceptor_pool.cc:254] collecting diagnostics on the listening RPC socket unix:/tmp/dist-test-task_9cEtK/test-tmp/rpc-test-d83cafaa98ef463ab70fcbfbfd3039a0.sock every 8 connection(s)
I20260929 19:01:08.023908   840 acceptor_pool.cc:254] collecting diagnostics on the listening RPC socket unix:/tmp/dist-test-task_9cEtK/test-tmp/rpc-test-d83cafaa98ef463ab70fcbfbfd3039a0.sock every 8 connection(s)
I20260929 19:01:08.024219   383 rpc-test.cc:1846] Connecting to unix:/tmp/dist-test-task_9cEtK/test-tmp/rpc-test-d83cafaa98ef463ab70fcbfbfd3039a0.sock
I20260929 19:01:09.307571   383 rpc-test.cc:1859] Sending 1024MB via ssl-enabled unix socket: real 1.273s	user 1.461s	sys 0.841s
I20260929 19:01:10.518638   383 rpc-test.cc:1859] Sending 1024MB via ssl-enabled unix socket: real 1.211s	user 1.321s	sys 0.859s
I20260929 19:01:11.718672   383 rpc-test.cc:1859] Sending 1024MB via ssl-enabled unix socket: real 1.200s	user 1.198s	sys 0.974s
I20260929 19:01:12.932013   383 rpc-test.cc:1859] Sending 1024MB via ssl-enabled unix socket: real 1.213s	user 1.378s	sys 0.804s
I20260929 19:01:14.163916   383 rpc-test.cc:1859] Sending 1024MB via ssl-enabled unix socket: real 1.232s	user 1.292s	sys 0.937s
W20260929 19:01:14.164709   837 connection.cc:196] Error closing socket: Network error: TlsSocket::Close: Broken pipe
[       OK ] Parameters/TestRpc.TestPerformanceBySocketType/SSL_UnixSocket (6156 ms)
[----------] 20 tests from Parameters/TestRpc (25910 ms total)

[----------] 1 test from Parameters/TestRpcSocketTxRxQueue
[ RUN      ] Parameters/TestRpcSocketTxRxQueue.AcceptorRxQueueSizeMetric/0
I20260929 19:01:14.171502   865 acceptor_pool.cc:254] collecting diagnostics on the listening RPC socket 0.0.0.0:44559 every 1 connection(s)
I20260929 19:01:14.171588   866 acceptor_pool.cc:254] collecting diagnostics on the listening RPC socket 0.0.0.0:44559 every 1 connection(s)
W20260929 19:01:14.172111   861 negotiation.cc:337] Failed RPC negotiation. Trace:
0929 19:01:14.171979 (+     0us) reactor.cc:625] Submitting negotiation task for server connection from 127.0.0.1:52640 (local address 127.0.0.1:44559)
0929 19:01:14.172028 (+    49us) server_negotiation.cc:206] Beginning negotiation
0929 19:01:14.172030 (+     2us) server_negotiation.cc:399] Waiting for connection header
0929 19:01:14.172084 (+    54us) negotiation.cc:327] Negotiation complete: Network error: Server connection negotiation failed: server connection from 127.0.0.1:52640: BlockingRecv error: recv got EOF from 127.0.0.1:52640 (error 108)
Metrics: {"server-negotiator.queue_time_us":15}
[       OK ] Parameters/TestRpcSocketTxRxQueue.AcceptorRxQueueSizeMetric/0 (8 ms)
[----------] 1 test from Parameters/TestRpcSocketTxRxQueue (8 ms total)

[----------] Global test environment tear-down
[==========] 21 tests from 2 test suites ran. (25918 ms total)
[  PASSED  ] 20 tests.
[  FAILED  ] 1 test, listed below:
[  FAILED  ] Parameters/TestRpc.TestCallWithChainCertAndChainCA/SSL_UnixSocket, where GetParam() = (true, true)

 1 FAILED TEST