Diagnosed failure

Parameters/TestRpc.TestCallWithChainCertAndChainCA/SSL_TCP: /data0/somelongdirectorytoavoidrpathissues/src/kudu/src/kudu/rpc/rpc-test.cc:270: Failure
Failed
Bad status: Runtime error: could not verify certificate chain (error with cert: subject=CN = localhost, ST = sadfjas, C = AS, emailAddress = sdflkdsajf, O = lskdfjlsad, OU = sldfkja, issuer=C = AS, ST = ASDfkjdhf, L = lskdjf, O = saldfja, OU = skdjf, CN = localhost, emailAddress = sadjflkadsj): : certificate has expired
Google Test trace:
/data0/somelongdirectorytoavoidrpathissues/src/kudu/src/kudu/rpc/rpc-test.cc:267: Connecting to 0.0.0.0:37775
I20260929 19:00:45.501222   383 test_util.cc:175] -----------------------------------------------
I20260929 19:00:45.501266   383 test_util.cc:176] Had fatal failures, leaving test files at /tmp/dist-test-taskibW_Ar/test-tmp/rpc-test.5.Parameters_TestRpc.TestCallWithChainCertAndChainCA_SSL_TCP.1790708445413246-383-0

Full log

Note: This is test shard 6 of 8.
[==========] Running 21 tests from 2 test suites.
[----------] Global test environment set-up.
[----------] 20 tests from Parameters/TestRpc
[ RUN      ] Parameters/TestRpc.TestMessengerCreateDestroy/SSL_TCP
WARNING: Logging before InitGoogleLogging() is written to STDERR
I20260929 19:00:45.459789   383 rpc-test.cc:169] started messenger TestCreateDestroy
[       OK ] Parameters/TestRpc.TestMessengerCreateDestroy/SSL_TCP (45 ms)
[ RUN      ] Parameters/TestRpc.TestNegotiationDeadlock/SSL_TCP
I20260929 19:00:45.478457   403 acceptor_pool.cc:254] collecting diagnostics on the listening RPC socket 0.0.0.0:42887 every 8 connection(s)
I20260929 19:00:45.478507   404 acceptor_pool.cc:254] collecting diagnostics on the listening RPC socket 0.0.0.0:42887 every 8 connection(s)
[       OK ] Parameters/TestRpc.TestNegotiationDeadlock/SSL_TCP (25 ms)
[ RUN      ] Parameters/TestRpc.TestCallWithChainCertAndChainCA/SSL_TCP
I20260929 19:00:45.497689   419 acceptor_pool.cc:254] collecting diagnostics on the listening RPC socket 0.0.0.0:37775 every 8 connection(s)
I20260929 19:00:45.497740   420 acceptor_pool.cc:254] collecting diagnostics on the listening RPC socket 0.0.0.0:37775 every 8 connection(s)
/data0/somelongdirectorytoavoidrpathissues/src/kudu/src/kudu/rpc/rpc-test.cc:270: Failure
Failed
Bad status: Runtime error: could not verify certificate chain (error with cert: subject=CN = localhost, ST = sadfjas, C = AS, emailAddress = sdflkdsajf, O = lskdfjlsad, OU = sldfkja, issuer=C = AS, ST = ASDfkjdhf, L = lskdjf, O = saldfja, OU = skdjf, CN = localhost, emailAddress = sadjflkadsj): : certificate has expired
Google Test trace:
/data0/somelongdirectorytoavoidrpathissues/src/kudu/src/kudu/rpc/rpc-test.cc:267: Connecting to 0.0.0.0:37775
I20260929 19:00:45.501222   383 test_util.cc:175] -----------------------------------------------
I20260929 19:00:45.501266   383 test_util.cc:176] Had fatal failures, leaving test files at /tmp/dist-test-taskibW_Ar/test-tmp/rpc-test.5.Parameters_TestRpc.TestCallWithChainCertAndChainCA_SSL_TCP.1790708445413246-383-0
[  FAILED  ] Parameters/TestRpc.TestCallWithChainCertAndChainCA/SSL_TCP, where GetParam() = (true, false) (15 ms)
[ RUN      ] Parameters/TestRpc.TestCallWithPasswordProtectedKey/SSL_TCP
I20260929 19:00:45.507688   444 acceptor_pool.cc:254] collecting diagnostics on the listening RPC socket 0.0.0.0:41365 every 8 connection(s)
I20260929 19:00:45.507697   445 acceptor_pool.cc:254] collecting diagnostics on the listening RPC socket 0.0.0.0:41365 every 8 connection(s)
[       OK ] Parameters/TestRpc.TestCallWithPasswordProtectedKey/SSL_TCP (18 ms)
[ RUN      ] Parameters/TestRpc.TestCallToBadServer/SSL_TCP
I20260929 19:00:45.532482   383 rpc-test.cc:394] Status: Network error: Client connection negotiation failed: client connection to 0.0.0.0:0: connect: Connection refused (error 111)
I20260929 19:00:45.532758   383 rpc-test.cc:394] Status: Network error: Client connection negotiation failed: client connection to 0.0.0.0:0: connect: Connection refused (error 111)
I20260929 19:00:45.532989   383 rpc-test.cc:394] Status: Network error: Client connection negotiation failed: client connection to 0.0.0.0:0: connect: Connection refused (error 111)
I20260929 19:00:45.533190   383 rpc-test.cc:394] Status: Network error: Client connection negotiation failed: client connection to 0.0.0.0:0: connect: Connection refused (error 111)
I20260929 19:00:45.533386   383 rpc-test.cc:394] Status: Network error: Client connection negotiation failed: client connection to 0.0.0.0:0: connect: Connection refused (error 111)
[       OK ] Parameters/TestRpc.TestCallToBadServer/SSL_TCP (14 ms)
[ RUN      ] Parameters/TestRpc.TestWrongService/SSL_TCP
I20260929 19:00:45.550777   479 acceptor_pool.cc:254] collecting diagnostics on the listening RPC socket 0.0.0.0:45035 every 8 connection(s)
I20260929 19:00:45.550820   480 acceptor_pool.cc:254] collecting diagnostics on the listening RPC socket 0.0.0.0:45035 every 8 connection(s)
I20260929 19:00:45.562000   477 messenger.cc:345] service WrongServiceName not registered on TestServer
[       OK ] Parameters/TestRpc.TestWrongService/SSL_TCP (29 ms)
[ RUN      ] Parameters/TestRpc.TestConnectionKeepalive/SSL_TCP
I20260929 19:00:45.584487   502 acceptor_pool.cc:254] collecting diagnostics on the listening RPC socket 0.0.0.0:45127 every 8 connection(s)
I20260929 19:00:45.584540   503 acceptor_pool.cc:254] collecting diagnostics on the listening RPC socket 0.0.0.0:45127 every 8 connection(s)
I20260929 19:00:45.584697   383 rpc-test.cc:488] Connecting to 0.0.0.0:45127
[       OK ] Parameters/TestRpc.TestConnectionKeepalive/SSL_TCP (1065 ms)
[ RUN      ] Parameters/TestRpc.TestClientConnectionMetrics/SSL_TCP
I20260929 19:00:46.639122   527 acceptor_pool.cc:254] collecting diagnostics on the listening RPC socket 0.0.0.0:40927 every 8 connection(s)
I20260929 19:00:46.639163   528 acceptor_pool.cc:254] collecting diagnostics on the listening RPC socket 0.0.0.0:40927 every 8 connection(s)
I20260929 19:00:46.639338   383 rpc-test.cc:569] Connecting to 0.0.0.0:40927
[       OK ] Parameters/TestRpc.TestClientConnectionMetrics/SSL_TCP (8939 ms)
[ RUN      ] Parameters/TestRpc.TestCredentialsPolicy/SSL_TCP
I20260929 19:00:55.580024   550 acceptor_pool.cc:254] collecting diagnostics on the listening RPC socket 0.0.0.0:41567 every 8 connection(s)
I20260929 19:00:55.580084   551 acceptor_pool.cc:254] collecting diagnostics on the listening RPC socket 0.0.0.0:41567 every 8 connection(s)
I20260929 19:00:55.580243   383 rpc-test.cc:700] Connecting to 0.0.0.0:41567
[       OK ] Parameters/TestRpc.TestCredentialsPolicy/SSL_TCP (40 ms)
[ RUN      ] Parameters/TestRpc.TestCallLongerThanKeepalive/SSL_TCP
I20260929 19:00:55.621258   575 acceptor_pool.cc:254] collecting diagnostics on the listening RPC socket 0.0.0.0:40631 every 8 connection(s)
I20260929 19:00:55.621304   576 acceptor_pool.cc:254] collecting diagnostics on the listening RPC socket 0.0.0.0:40631 every 8 connection(s)
I20260929 19:00:55.631284   577 rpc-test-base.h:222] got call: sleep_micros: 3000000 deferred: true
I20260929 19:00:58.631932   577 rpcz_store.cc:275] Call kudu.rpc.GenericCalculatorService.Sleep from 127.0.0.1:46418 (request call id 0) took 3000 ms. Trace:
I20260929 19:00:58.632027   577 rpcz_store.cc:276] 0929 19:00:55.631223 (+     0us) service_pool.cc:170] Inserting onto call queue
0929 19:00:55.631262 (+    39us) service_pool.cc:227] Handling call
0929 19:00:58.631917 (+3000655us) inbound_call.cc:173] Queueing success response
Metrics: {}
[       OK ] Parameters/TestRpc.TestCallLongerThanKeepalive/SSL_TCP (3025 ms)
[ RUN      ] Parameters/TestRpc.TestRpcSidecar/SSL_TCP
I20260929 19:00:58.647815   600 acceptor_pool.cc:254] collecting diagnostics on the listening RPC socket 0.0.0.0:44753 every 8 connection(s)
I20260929 19:00:58.647940   601 acceptor_pool.cc:254] collecting diagnostics on the listening RPC socket 0.0.0.0:44753 every 8 connection(s)
[       OK ] Parameters/TestRpc.TestRpcSidecar/SSL_TCP (68 ms)
[ RUN      ] Parameters/TestRpc.TestRpcSidecarLimits/SSL_TCP
I20260929 19:01:00.406865   625 acceptor_pool.cc:254] collecting diagnostics on the listening RPC socket 0.0.0.0:34283 every 8 connection(s)
I20260929 19:01:00.406870   626 acceptor_pool.cc:254] collecting diagnostics on the listening RPC socket 0.0.0.0:34283 every 8 connection(s)
W20260929 19:01:00.435249   383 serialization.cc:72] Serialized kudu.rpc_test.PushStringsRequestPB (2147483654 bytes) is larger than the maximum configured RPC message size (52428800 bytes). Sending anyway, but peer may reject the data.
W20260929 19:01:00.438521   624 connection.cc:535] server connection from 127.0.0.1:44294 recv error: Network error: RPC frame had a length of 2147483714, but we only support messages up to 52428800 bytes long.
W20260929 19:01:00.438591   624 connection.cc:158] shutting down server connection from 127.0.0.1:44294 with pending inbound data: 4/2147483714 bytes received; last active 0 ns ago: status Network error: RPC frame had a length of 2147483714, but we only support messages up to 52428800 bytes long.
W20260929 19:01:00.438804   638 connection.cc:196] Error closing socket: Network error: TlsSocket::Close: Connection reset by peer
I20260929 19:01:00.467746   650 acceptor_pool.cc:254] collecting diagnostics on the listening RPC socket 0.0.0.0:42473 every 8 connection(s)
I20260929 19:01:00.467785   651 acceptor_pool.cc:254] collecting diagnostics on the listening RPC socket 0.0.0.0:42473 every 8 connection(s)
W20260929 19:01:04.217768   648 connection.cc:577] server connection from 127.0.0.1:50704: received bad data: 'Corruption: Invalid packet: message had a length of 2147483710, but we only support messages up to 2147483647 bytes
'
[       OK ] Parameters/TestRpc.TestRpcSidecarLimits/SSL_TCP (5516 ms)
[ RUN      ] Parameters/TestRpc.TestCallTimeoutDoesntAffectNegotiation/SSL_TCP
I20260929 19:01:04.239881   675 acceptor_pool.cc:254] collecting diagnostics on the listening RPC socket 0.0.0.0:33527 every 8 connection(s)
I20260929 19:01:04.239939   676 acceptor_pool.cc:254] collecting diagnostics on the listening RPC socket 0.0.0.0:33527 every 8 connection(s)
W20260929 19:01:04.259298   671 negotiation.cc:266] Injecting 500ms delay in negotiation
I20260929 19:01:04.309604   383 rpc-test-base.h:595] status: Timed out: connection negotiation to 0.0.0.0:33527 for RPC Sleep timed out after 0.050s (ON_OUTBOUND_QUEUE), seconds elapsed: 0.0506423
[       OK ] Parameters/TestRpc.TestCallTimeoutDoesntAffectNegotiation/SSL_TCP (544 ms)
[ RUN      ] Parameters/TestRpc.TestRpcHandlerLatencyMetric/SSL_TCP
I20260929 19:01:04.776448   700 acceptor_pool.cc:254] collecting diagnostics on the listening RPC socket 0.0.0.0:33367 every 8 connection(s)
I20260929 19:01:04.776448   701 acceptor_pool.cc:254] collecting diagnostics on the listening RPC socket 0.0.0.0:33367 every 8 connection(s)
I20260929 19:01:04.807927   383 rpc-test.cc:1236] Sleep() min lat: 20229
I20260929 19:01:04.807984   383 rpc-test.cc:1237] Sleep() mean lat: 20229
I20260929 19:01:04.808009   383 rpc-test.cc:1238] Sleep() max lat: 20229
I20260929 19:01:04.808023   383 rpc-test.cc:1239] Sleep() #calls: 1
[       OK ] Parameters/TestRpc.TestRpcHandlerLatencyMetric/SSL_TCP (45 ms)
[ RUN      ] Parameters/TestRpc.TimedOutOnResponseMetricServiceQueue/SSL_TCP
I20260929 19:01:04.819759   726 acceptor_pool.cc:254] collecting diagnostics on the listening RPC socket 0.0.0.0:41367 every 8 connection(s)
I20260929 19:01:04.819813   727 acceptor_pool.cc:254] collecting diagnostics on the listening RPC socket 0.0.0.0:41367 every 8 connection(s)
W20260929 19:01:04.873914   728 rpcz_store.cc:267] Call kudu.rpc_test.CalculatorService.Sleep from 127.0.0.1:42352 (request call id 2) took 20 ms (client timeout 20 ms). Trace:
W20260929 19:01:04.874030   728 rpcz_store.cc:269] 0929 19:01:04.853702 (+     0us) service_pool.cc:170] Inserting onto call queue
0929 19:01:04.873892 (+ 20190us) service_pool.cc:214] Skipping call since client already timed out
0929 19:01:04.873901 (+     9us) inbound_call.cc:173] Queueing failure response
Metrics: {}
[       OK ] Parameters/TestRpc.TimedOutOnResponseMetricServiceQueue/SSL_TCP (66 ms)
[ RUN      ] Parameters/TestRpc.RpcPendingConnectionsMetric/SSL_TCP
I20260929 19:01:04.877393   749 acceptor_pool.cc:254] collecting diagnostics on the listening RPC socket 0.0.0.0:43659 every 8 connection(s)
I20260929 19:01:04.877460   750 acceptor_pool.cc:254] collecting diagnostics on the listening RPC socket 0.0.0.0:43659 every 8 connection(s)
W20260929 19:01:04.885712   745 negotiation.cc:337] Failed RPC negotiation. Trace:
0929 19:01:04.885443 (+     0us) reactor.cc:625] Submitting negotiation task for server connection from 127.0.0.1:50078 (local address 127.0.0.1:43659)
0929 19:01:04.885540 (+    97us) server_negotiation.cc:206] Beginning negotiation
0929 19:01:04.885542 (+     2us) server_negotiation.cc:399] Waiting for connection header
0929 19:01:04.885619 (+    77us) negotiation.cc:327] Negotiation complete: Network error: Server connection negotiation failed: server connection from 127.0.0.1:50078: BlockingRecv error: recv got EOF from 127.0.0.1:50078 (error 108)
Metrics: {"server-negotiator.queue_time_us":60}
[       OK ] Parameters/TestRpc.RpcPendingConnectionsMetric/SSL_TCP (20 ms)
[ RUN      ] Parameters/TestRpc.TestRpcContextClientDeadline/SSL_TCP
I20260929 19:01:04.908434   765 acceptor_pool.cc:254] collecting diagnostics on the listening RPC socket 0.0.0.0:39195 every 8 connection(s)
I20260929 19:01:04.908481   766 acceptor_pool.cc:254] collecting diagnostics on the listening RPC socket 0.0.0.0:39195 every 8 connection(s)
[       OK ] Parameters/TestRpc.TestRpcContextClientDeadline/SSL_TCP (45 ms)
[ RUN      ] Parameters/TestRpc.TestApplicationFeatureFlagUnsupportedServer/SSL_TCP
I20260929 19:01:04.950806   790 acceptor_pool.cc:254] collecting diagnostics on the listening RPC socket 0.0.0.0:33479 every 8 connection(s)
I20260929 19:01:04.950840   791 acceptor_pool.cc:254] collecting diagnostics on the listening RPC socket 0.0.0.0:33479 every 8 connection(s)
[       OK ] Parameters/TestRpc.TestApplicationFeatureFlagUnsupportedServer/SSL_TCP (36 ms)
[ RUN      ] Parameters/TestRpc.TestCancellationAsync/SSL_TCP
I20260929 19:01:05.006304   815 acceptor_pool.cc:254] collecting diagnostics on the listening RPC socket 0.0.0.0:39289 every 8 connection(s)
I20260929 19:01:05.006361   816 acceptor_pool.cc:254] collecting diagnostics on the listening RPC socket 0.0.0.0:39289 every 8 connection(s)
I20260929 19:01:05.006552   383 rpc-test.cc:1716] Connecting to 0.0.0.0:39289
I20260929 19:01:05.010243   383 test_util.cc:268] Using random seed: -839645630
I20260929 19:01:05.029142   819 rpc-test-base.h:240] got call: sleep_micros: 500 pattern: 4294967295 num_repetitions: 2097152 sidecar_idx: 0
I20260929 19:01:05.044190   819 rpc-test-base.h:240] got call: sleep_micros: 500 pattern: 4294967295 num_repetitions: 2097152 sidecar_idx: 0
I20260929 19:01:05.062287   819 rpc-test-base.h:240] got call: sleep_micros: 500 pattern: 4294967295 num_repetitions: 2097152 sidecar_idx: 0
I20260929 19:01:05.081250   819 rpc-test-base.h:240] got call: sleep_micros: 500 pattern: 4294967295 num_repetitions: 2097152 sidecar_idx: 0
I20260929 19:01:05.099099   819 rpc-test-base.h:240] got call: sleep_micros: 500 pattern: 4294967295 num_repetitions: 2097152 sidecar_idx: 0
I20260929 19:01:05.111778   819 rpc-test-base.h:240] got call: sleep_micros: 500 pattern: 4294967295 num_repetitions: 2097152 sidecar_idx: 0
I20260929 19:01:05.124708   819 rpc-test-base.h:240] got call: sleep_micros: 500 pattern: 4294967295 num_repetitions: 2097152 sidecar_idx: 0
I20260929 19:01:05.136529   819 rpc-test-base.h:240] got call: sleep_micros: 500 pattern: 4294967295 num_repetitions: 2097152 sidecar_idx: 0
W20260929 19:01:05.139654   812 connection.cc:441] server connection from 127.0.0.1:46882 torn down before Call kudu.rpc.GenericCalculatorService.SleepWithSidecar from 127.0.0.1:46882 (request call id 9) could send its response
[       OK ] Parameters/TestRpc.TestCancellationAsync/SSL_TCP (161 ms)
[ RUN      ] Parameters/TestRpc.TestPerformanceBySocketType/SSL_TCP
I20260929 19:01:05.153832   840 acceptor_pool.cc:254] collecting diagnostics on the listening RPC socket 0.0.0.0:36907 every 8 connection(s)
I20260929 19:01:05.153884   841 acceptor_pool.cc:254] collecting diagnostics on the listening RPC socket 0.0.0.0:36907 every 8 connection(s)
I20260929 19:01:05.154062   383 rpc-test.cc:1846] Connecting to 0.0.0.0:36907
I20260929 19:01:06.763368   383 rpc-test.cc:1859] Sending 1024MB via ssl-enabled tcp socket: real 1.589s	user 1.506s	sys 1.333s
I20260929 19:01:08.367520   383 rpc-test.cc:1859] Sending 1024MB via ssl-enabled tcp socket: real 1.604s	user 1.385s	sys 1.486s
I20260929 19:01:09.888006   383 rpc-test.cc:1859] Sending 1024MB via ssl-enabled tcp socket: real 1.520s	user 1.316s	sys 1.420s
I20260929 19:01:11.510607   383 rpc-test.cc:1859] Sending 1024MB via ssl-enabled tcp socket: real 1.622s	user 1.463s	sys 1.449s
I20260929 19:01:13.069736   383 rpc-test.cc:1859] Sending 1024MB via ssl-enabled tcp socket: real 1.559s	user 1.383s	sys 1.416s
[       OK ] Parameters/TestRpc.TestPerformanceBySocketType/SSL_TCP (7930 ms)
[----------] 20 tests from Parameters/TestRpc (27655 ms total)

[----------] 1 test from Parameters/TestRpcSocketTxRxQueue
[ RUN      ] Parameters/TestRpcSocketTxRxQueue.OverCapacity/0
W20260929 19:01:13.341379   857 negotiation.cc:337] Failed RPC negotiation. Trace:
0929 19:01:13.077903 (+     0us) reactor.cc:625] Submitting negotiation task for client connection to 0.0.0.0:33325 (local address 127.0.0.1:52756)
0929 19:01:13.077957 (+    54us) negotiation.cc:107] Waiting for socket to connect
0929 19:01:13.077966 (+     9us) client_negotiation.cc:174] Beginning negotiation
0929 19:01:13.078017 (+    51us) client_negotiation.cc:252] Sending NEGOTIATE NegotiatePB request
0929 19:01:13.341232 (+263215us) negotiation.cc:327] Negotiation complete: Network error: Client connection negotiation failed: client connection to 0.0.0.0:33325: BlockingRecv error: recv error from unknown peer: Transport endpoint is not connected (error 107)
Metrics: {"client-negotiator.queue_time_us":28}
W20260929 19:01:13.341645   866 negotiation.cc:337] Failed RPC negotiation. Trace:
0929 19:01:13.078766 (+     0us) reactor.cc:625] Submitting negotiation task for client connection to 0.0.0.0:33325 (local address 127.0.0.1:52768)
0929 19:01:13.078817 (+    51us) negotiation.cc:107] Waiting for socket to connect
0929 19:01:13.078826 (+     9us) client_negotiation.cc:174] Beginning negotiation
0929 19:01:13.078866 (+    40us) client_negotiation.cc:252] Sending NEGOTIATE NegotiatePB request
0929 19:01:13.341582 (+262716us) negotiation.cc:327] Negotiation complete: Network error: Client connection negotiation failed: client connection to 0.0.0.0:33325: BlockingRecv error: recv error from unknown peer: Transport endpoint is not connected (error 107)
Metrics: {"client-negotiator.queue_time_us":31}
W20260929 19:01:13.341724   884 negotiation.cc:337] Failed RPC negotiation. Trace:
0929 19:01:13.080546 (+     0us) reactor.cc:625] Submitting negotiation task for client connection to 0.0.0.0:33325 (local address 127.0.0.1:52782)
0929 19:01:13.080595 (+    49us) negotiation.cc:107] Waiting for socket to connect
0929 19:01:13.080604 (+     9us) client_negotiation.cc:174] Beginning negotiation
0929 19:01:13.080641 (+    37us) client_negotiation.cc:252] Sending NEGOTIATE NegotiatePB request
0929 19:01:13.341681 (+261040us) negotiation.cc:327] Negotiation complete: Network error: Client connection negotiation failed: client connection to 0.0.0.0:33325: BlockingRecv error: recv error from unknown peer: Transport endpoint is not connected (error 107)
Metrics: {"client-negotiator.queue_time_us":29}
W20260929 19:01:13.341866   893 negotiation.cc:337] Failed RPC negotiation. Trace:
0929 19:01:13.081407 (+     0us) reactor.cc:625] Submitting negotiation task for client connection to 0.0.0.0:33325 (local address 127.0.0.1:52786)
0929 19:01:13.081456 (+    49us) negotiation.cc:107] Waiting for socket to connect
0929 19:01:13.081465 (+     9us) client_negotiation.cc:174] Beginning negotiation
0929 19:01:13.081503 (+    38us) client_negotiation.cc:252] Sending NEGOTIATE NegotiatePB request
0929 19:01:13.341812 (+260309us) negotiation.cc:327] Negotiation complete: Network error: Client connection negotiation failed: client connection to 0.0.0.0:33325: BlockingRecv error: recv error from unknown peer: Transport endpoint is not connected (error 107)
Metrics: {"client-negotiator.queue_time_us":30}
W20260929 19:01:13.341971   902 negotiation.cc:337] Failed RPC negotiation. Trace:
0929 19:01:13.082300 (+     0us) reactor.cc:625] Submitting negotiation task for client connection to 0.0.0.0:33325 (local address 127.0.0.1:52798)
0929 19:01:13.082393 (+    93us) negotiation.cc:107] Waiting for socket to connect
0929 19:01:13.082402 (+     9us) client_negotiation.cc:174] Beginning negotiation
0929 19:01:13.082445 (+    43us) client_negotiation.cc:252] Sending NEGOTIATE NegotiatePB request
0929 19:01:13.341937 (+259492us) negotiation.cc:327] Negotiation complete: Network error: Client connection negotiation failed: client connection to 0.0.0.0:33325: BlockingRecv error: recv error from unknown peer: Transport endpoint is not connected (error 107)
Metrics: {"client-negotiator.queue_time_us":75}
W20260929 19:01:13.342113   875 negotiation.cc:337] Failed RPC negotiation. Trace:
0929 19:01:13.079649 (+     0us) reactor.cc:625] Submitting negotiation task for client connection to 0.0.0.0:33325 (local address 127.0.0.1:52770)
0929 19:01:13.079700 (+    51us) negotiation.cc:107] Waiting for socket to connect
0929 19:01:13.079709 (+     9us) client_negotiation.cc:174] Beginning negotiation
0929 19:01:13.079748 (+    39us) client_negotiation.cc:252] Sending NEGOTIATE NegotiatePB request
0929 19:01:13.341648 (+261900us) negotiation.cc:327] Negotiation complete: Network error: Client connection negotiation failed: client connection to 0.0.0.0:33325: BlockingRecv error: recv error from unknown peer: Transport endpoint is not connected (error 107)
Metrics: {"client-negotiator.queue_time_us":31}
[       OK ] Parameters/TestRpcSocketTxRxQueue.OverCapacity/0 (1043 ms)
[----------] 1 test from Parameters/TestRpcSocketTxRxQueue (1043 ms total)

[----------] Global test environment tear-down
[==========] 21 tests from 2 test suites ran. (28698 ms total)
[  PASSED  ] 20 tests.
[  FAILED  ] 1 test, listed below:
[  FAILED  ] Parameters/TestRpc.TestCallWithChainCertAndChainCA/SSL_TCP, where GetParam() = (true, false)

 1 FAILED TEST