Diagnosed failure

Parameters/TestRpc.TestCallWithChainCertAndChainCA/SSL_UnixSocket: /data0/somelongdirectorytoavoidrpathissues/src/kudu/src/kudu/rpc/rpc-test.cc:270: Failure
Failed
Bad status: Runtime error: could not verify certificate chain (error with cert: subject=CN = localhost, ST = sadfjas, C = AS, emailAddress = sdflkdsajf, O = lskdfjlsad, OU = sldfkja, issuer=C = AS, ST = ASDfkjdhf, L = lskdjf, O = saldfja, OU = skdjf, CN = localhost, emailAddress = sadjflkadsj): : certificate has expired
Google Test trace:
/data0/somelongdirectorytoavoidrpathissues/src/kudu/src/kudu/rpc/rpc-test.cc:267: Connecting to unix:/tmp/dist-test-taskw2DnyI/test-tmp/rpc-test-26b2031ff55c4e19bbe5dd31abaf9711.sock
I20260927 01:30:47.981771   383 test_util.cc:175] -----------------------------------------------
I20260927 01:30:47.981842   383 test_util.cc:176] Had fatal failures, leaving test files at /tmp/dist-test-taskw2DnyI/test-tmp/rpc-test.6.Parameters_TestRpc.TestCallWithChainCertAndChainCA_SSL_UnixSocket.1790472647877736-383-0

Full log

Note: This is test shard 7 of 8.
[==========] Running 21 tests from 2 test suites.
[----------] Global test environment set-up.
[----------] 20 tests from Parameters/TestRpc
[ RUN      ] Parameters/TestRpc.TestMessengerCreateDestroy/SSL_UnixSocket
WARNING: Logging before InitGoogleLogging() is written to STDERR
I20260927 01:30:47.923492   383 rpc-test.cc:169] started messenger TestCreateDestroy
[       OK ] Parameters/TestRpc.TestMessengerCreateDestroy/SSL_UnixSocket (40 ms)
[ RUN      ] Parameters/TestRpc.TestNegotiationDeadlock/SSL_UnixSocket
I20260927 01:30:47.959872   403 acceptor_pool.cc:254] collecting diagnostics on the listening RPC socket unix:/tmp/dist-test-taskw2DnyI/test-tmp/rpc-test-eaac4600fb894d519cb21de666b26a46.sock every 8 connection(s)
I20260927 01:30:47.959894   404 acceptor_pool.cc:254] collecting diagnostics on the listening RPC socket unix:/tmp/dist-test-taskw2DnyI/test-tmp/rpc-test-eaac4600fb894d519cb21de666b26a46.sock every 8 connection(s)
[       OK ] Parameters/TestRpc.TestNegotiationDeadlock/SSL_UnixSocket (46 ms)
[ RUN      ] Parameters/TestRpc.TestCallWithChainCertAndChainCA/SSL_UnixSocket
I20260927 01:30:47.976842   419 acceptor_pool.cc:254] collecting diagnostics on the listening RPC socket unix:/tmp/dist-test-taskw2DnyI/test-tmp/rpc-test-26b2031ff55c4e19bbe5dd31abaf9711.sock every 8 connection(s)
I20260927 01:30:47.976894   420 acceptor_pool.cc:254] collecting diagnostics on the listening RPC socket unix:/tmp/dist-test-taskw2DnyI/test-tmp/rpc-test-26b2031ff55c4e19bbe5dd31abaf9711.sock every 8 connection(s)
/data0/somelongdirectorytoavoidrpathissues/src/kudu/src/kudu/rpc/rpc-test.cc:270: Failure
Failed
Bad status: Runtime error: could not verify certificate chain (error with cert: subject=CN = localhost, ST = sadfjas, C = AS, emailAddress = sdflkdsajf, O = lskdfjlsad, OU = sldfkja, issuer=C = AS, ST = ASDfkjdhf, L = lskdjf, O = saldfja, OU = skdjf, CN = localhost, emailAddress = sadjflkadsj): : certificate has expired
Google Test trace:
/data0/somelongdirectorytoavoidrpathissues/src/kudu/src/kudu/rpc/rpc-test.cc:267: Connecting to unix:/tmp/dist-test-taskw2DnyI/test-tmp/rpc-test-26b2031ff55c4e19bbe5dd31abaf9711.sock
I20260927 01:30:47.981771   383 test_util.cc:175] -----------------------------------------------
I20260927 01:30:47.981842   383 test_util.cc:176] Had fatal failures, leaving test files at /tmp/dist-test-taskw2DnyI/test-tmp/rpc-test.6.Parameters_TestRpc.TestCallWithChainCertAndChainCA_SSL_UnixSocket.1790472647877736-383-0
[  FAILED  ] Parameters/TestRpc.TestCallWithChainCertAndChainCA/SSL_UnixSocket, where GetParam() = (true, true) (10 ms)
[ RUN      ] Parameters/TestRpc.TestCallWithPasswordProtectedKey/SSL_UnixSocket
I20260927 01:30:48.017650   444 acceptor_pool.cc:254] collecting diagnostics on the listening RPC socket unix:/tmp/dist-test-taskw2DnyI/test-tmp/rpc-test-13ff1782f3334579b799afaf95b77091.sock every 8 connection(s)
I20260927 01:30:48.017679   445 acceptor_pool.cc:254] collecting diagnostics on the listening RPC socket unix:/tmp/dist-test-taskw2DnyI/test-tmp/rpc-test-13ff1782f3334579b799afaf95b77091.sock every 8 connection(s)
W20260927 01:30:48.031508   441 connection.cc:196] Error closing socket: Network error: TlsSocket::Close: Broken pipe
[       OK ] Parameters/TestRpc.TestCallWithPasswordProtectedKey/SSL_UnixSocket (51 ms)
[ RUN      ] Parameters/TestRpc.TestCallToBadServer/SSL_UnixSocket
I20260927 01:30:48.063040   383 rpc-test.cc:394] Status: Network error: Client connection negotiation failed: client connection to 0.0.0.0:0: connect: Connection refused (error 111)
I20260927 01:30:48.063745   383 rpc-test.cc:394] Status: Network error: Client connection negotiation failed: client connection to 0.0.0.0:0: connect: Connection refused (error 111)
I20260927 01:30:48.064219   383 rpc-test.cc:394] Status: Network error: Client connection negotiation failed: client connection to 0.0.0.0:0: connect: Connection refused (error 111)
I20260927 01:30:48.064824   383 rpc-test.cc:394] Status: Network error: Client connection negotiation failed: client connection to 0.0.0.0:0: connect: Connection refused (error 111)
I20260927 01:30:48.065253   383 rpc-test.cc:394] Status: Network error: Client connection negotiation failed: client connection to 0.0.0.0:0: connect: Connection refused (error 111)
[       OK ] Parameters/TestRpc.TestCallToBadServer/SSL_UnixSocket (32 ms)
[ RUN      ] Parameters/TestRpc.TestWrongService/SSL_UnixSocket
I20260927 01:30:48.094000   479 acceptor_pool.cc:254] collecting diagnostics on the listening RPC socket unix:/tmp/dist-test-taskw2DnyI/test-tmp/rpc-test-b03f28d5caaa4eccad32ea5618f9585f.sock every 8 connection(s)
I20260927 01:30:48.094020   480 acceptor_pool.cc:254] collecting diagnostics on the listening RPC socket unix:/tmp/dist-test-taskw2DnyI/test-tmp/rpc-test-b03f28d5caaa4eccad32ea5618f9585f.sock every 8 connection(s)
I20260927 01:30:48.111299   476 messenger.cc:345] service WrongServiceName not registered on TestServer
[       OK ] Parameters/TestRpc.TestWrongService/SSL_UnixSocket (47 ms)
[ RUN      ] Parameters/TestRpc.TestConnectionKeepalive/SSL_UnixSocket
I20260927 01:30:48.164992   502 acceptor_pool.cc:254] collecting diagnostics on the listening RPC socket unix:/tmp/dist-test-taskw2DnyI/test-tmp/rpc-test-223e2ce3366f42eb9ec4eb38d0865ccd.sock every 8 connection(s)
I20260927 01:30:48.164992   503 acceptor_pool.cc:254] collecting diagnostics on the listening RPC socket unix:/tmp/dist-test-taskw2DnyI/test-tmp/rpc-test-223e2ce3366f42eb9ec4eb38d0865ccd.sock every 8 connection(s)
I20260927 01:30:48.165254   383 rpc-test.cc:488] Connecting to unix:/tmp/dist-test-taskw2DnyI/test-tmp/rpc-test-223e2ce3366f42eb9ec4eb38d0865ccd.sock
W20260927 01:30:48.615806   515 connection.cc:196] Error closing socket: Network error: TlsSocket::Close: Broken pipe
[       OK ] Parameters/TestRpc.TestConnectionKeepalive/SSL_UnixSocket (1078 ms)
[ RUN      ] Parameters/TestRpc.TestClientConnectionMetrics/SSL_UnixSocket
I20260927 01:30:49.202316   527 acceptor_pool.cc:254] collecting diagnostics on the listening RPC socket unix:/tmp/dist-test-taskw2DnyI/test-tmp/rpc-test-ad679f3ce3e449e899db551bb1de15e3.sock every 8 connection(s)
I20260927 01:30:49.202392   528 acceptor_pool.cc:254] collecting diagnostics on the listening RPC socket unix:/tmp/dist-test-taskw2DnyI/test-tmp/rpc-test-ad679f3ce3e449e899db551bb1de15e3.sock every 8 connection(s)
I20260927 01:30:49.202615   383 rpc-test.cc:569] Connecting to unix:/tmp/dist-test-taskw2DnyI/test-tmp/rpc-test-ad679f3ce3e449e899db551bb1de15e3.sock
W20260927 01:30:59.655579   524 connection.cc:196] Error closing socket: Network error: TlsSocket::Close: Broken pipe
[       OK ] Parameters/TestRpc.TestClientConnectionMetrics/SSL_UnixSocket (10464 ms)
[ RUN      ] Parameters/TestRpc.TestCredentialsPolicy/SSL_UnixSocket
I20260927 01:30:59.683459   550 acceptor_pool.cc:254] collecting diagnostics on the listening RPC socket unix:/tmp/dist-test-taskw2DnyI/test-tmp/rpc-test-d9402769ee444c688248825fee16d655.sock every 8 connection(s)
I20260927 01:30:59.683509   551 acceptor_pool.cc:254] collecting diagnostics on the listening RPC socket unix:/tmp/dist-test-taskw2DnyI/test-tmp/rpc-test-d9402769ee444c688248825fee16d655.sock every 8 connection(s)
I20260927 01:30:59.683733   383 rpc-test.cc:700] Connecting to unix:/tmp/dist-test-taskw2DnyI/test-tmp/rpc-test-d9402769ee444c688248825fee16d655.sock
W20260927 01:30:59.708153   549 connection.cc:196] Error closing socket: Network error: TlsSocket::Close: Broken pipe
W20260927 01:30:59.713573   549 connection.cc:196] Error closing socket: Network error: TlsSocket::Close: Broken pipe
[       OK ] Parameters/TestRpc.TestCredentialsPolicy/SSL_UnixSocket (57 ms)
[ RUN      ] Parameters/TestRpc.TestCallLongerThanKeepalive/SSL_UnixSocket
I20260927 01:30:59.739171   576 acceptor_pool.cc:254] collecting diagnostics on the listening RPC socket unix:/tmp/dist-test-taskw2DnyI/test-tmp/rpc-test-910f9c617d6549c9a77faf9951af1e9d.sock every 8 connection(s)
I20260927 01:30:59.739164   575 acceptor_pool.cc:254] collecting diagnostics on the listening RPC socket unix:/tmp/dist-test-taskw2DnyI/test-tmp/rpc-test-910f9c617d6549c9a77faf9951af1e9d.sock every 8 connection(s)
I20260927 01:30:59.757794   579 rpc-test-base.h:222] got call: sleep_micros: 3000000 deferred: true
I20260927 01:31:02.758695   579 rpcz_store.cc:275] Call kudu.rpc.GenericCalculatorService.Sleep from unix:<unnamed> (request call id 0) took 3000 ms. Trace:
I20260927 01:31:02.758832   579 rpcz_store.cc:276] 0927 01:30:59.757726 (+     0us) service_pool.cc:170] Inserting onto call queue
0927 01:30:59.757773 (+    47us) service_pool.cc:227] Handling call
0927 01:31:02.758676 (+3000903us) inbound_call.cc:173] Queueing success response
Metrics: {}
W20260927 01:31:02.760236   572 connection.cc:196] Error closing socket: Network error: TlsSocket::Close: Broken pipe
[       OK ] Parameters/TestRpc.TestCallLongerThanKeepalive/SSL_UnixSocket (3047 ms)
[ RUN      ] Parameters/TestRpc.TestRpcSidecar/SSL_UnixSocket
I20260927 01:31:02.772140   600 acceptor_pool.cc:254] collecting diagnostics on the listening RPC socket unix:/tmp/dist-test-taskw2DnyI/test-tmp/rpc-test-bced0e37650e4773a340afb9d796b15e.sock every 8 connection(s)
I20260927 01:31:02.772207   601 acceptor_pool.cc:254] collecting diagnostics on the listening RPC socket unix:/tmp/dist-test-taskw2DnyI/test-tmp/rpc-test-bced0e37650e4773a340afb9d796b15e.sock every 8 connection(s)
W20260927 01:31:02.841207   597 connection.cc:196] Error closing socket: Network error: TlsSocket::Close: Broken pipe
[       OK ] Parameters/TestRpc.TestRpcSidecar/SSL_UnixSocket (80 ms)
[ RUN      ] Parameters/TestRpc.TestRpcSidecarLimits/SSL_UnixSocket
I20260927 01:31:04.578478   625 acceptor_pool.cc:254] collecting diagnostics on the listening RPC socket unix:/tmp/dist-test-taskw2DnyI/test-tmp/rpc-test-bece214d48bd44aa8bd6a996a7481c54.sock every 8 connection(s)
I20260927 01:31:04.578491   626 acceptor_pool.cc:254] collecting diagnostics on the listening RPC socket unix:/tmp/dist-test-taskw2DnyI/test-tmp/rpc-test-bece214d48bd44aa8bd6a996a7481c54.sock every 8 connection(s)
W20260927 01:31:04.590003   383 serialization.cc:72] Serialized kudu.rpc_test.PushStringsRequestPB (2147483654 bytes) is larger than the maximum configured RPC message size (52428800 bytes). Sending anyway, but peer may reject the data.
W20260927 01:31:04.593999   622 connection.cc:535] server connection from unix:<unnamed> recv error: Network error: RPC frame had a length of 2147483714, but we only support messages up to 52428800 bytes long.
W20260927 01:31:04.594095   622 connection.cc:158] shutting down server connection from unix:<unnamed> with pending inbound data: 4/2147483714 bytes received; last active 0 ns ago: status Network error: RPC frame had a length of 2147483714, but we only support messages up to 52428800 bytes long.
W20260927 01:31:04.594369   638 connection.cc:196] Error closing socket: Network error: TlsSocket::Close: Broken pipe
I20260927 01:31:04.609376   650 acceptor_pool.cc:254] collecting diagnostics on the listening RPC socket unix:/tmp/dist-test-taskw2DnyI/test-tmp/rpc-test-bece214d48bd44aa8bd6a996a7481c54.sock every 8 connection(s)
I20260927 01:31:04.609453   651 acceptor_pool.cc:254] collecting diagnostics on the listening RPC socket unix:/tmp/dist-test-taskw2DnyI/test-tmp/rpc-test-bece214d48bd44aa8bd6a996a7481c54.sock every 8 connection(s)
W20260927 01:31:09.538975   647 connection.cc:577] server connection from unix:<unnamed>: received bad data: 'Corruption: Invalid packet: message had a length of 2147483710, but we only support messages up to 2147483647 bytes
'
W20260927 01:31:09.539350   663 connection.cc:196] Error closing socket: Network error: TlsSocket::Close: Broken pipe
[       OK ] Parameters/TestRpc.TestRpcSidecarLimits/SSL_UnixSocket (6699 ms)
[ RUN      ] Parameters/TestRpc.TestCallTimeoutDoesntAffectNegotiation/SSL_UnixSocket
I20260927 01:31:09.550360   675 acceptor_pool.cc:254] collecting diagnostics on the listening RPC socket unix:/tmp/dist-test-taskw2DnyI/test-tmp/rpc-test-e5a7076d2a664093b3572bccd7cf2ee7.sock every 8 connection(s)
I20260927 01:31:09.550495   676 acceptor_pool.cc:254] collecting diagnostics on the listening RPC socket unix:/tmp/dist-test-taskw2DnyI/test-tmp/rpc-test-e5a7076d2a664093b3572bccd7cf2ee7.sock every 8 connection(s)
W20260927 01:31:09.562022   671 negotiation.cc:266] Injecting 500ms delay in negotiation
I20260927 01:31:09.612385   383 rpc-test-base.h:595] status: Timed out: connection negotiation to unix:/tmp/dist-test-taskw2DnyI/test-tmp/rpc-test-e5a7076d2a664093b3572bccd7cf2ee7.sock for RPC Sleep timed out after 0.050s (ON_OUTBOUND_QUEUE), seconds elapsed: 0.0509062
W20260927 01:31:10.072932   672 connection.cc:196] Error closing socket: Network error: TlsSocket::Close: Broken pipe
[       OK ] Parameters/TestRpc.TestCallTimeoutDoesntAffectNegotiation/SSL_UnixSocket (532 ms)
[ RUN      ] Parameters/TestRpc.TestRpcHandlerLatencyMetric/SSL_UnixSocket
I20260927 01:31:10.094408   700 acceptor_pool.cc:254] collecting diagnostics on the listening RPC socket unix:/tmp/dist-test-taskw2DnyI/test-tmp/rpc-test-078624cc39964d059fc9170cfb358120.sock every 8 connection(s)
I20260927 01:31:10.094527   701 acceptor_pool.cc:254] collecting diagnostics on the listening RPC socket unix:/tmp/dist-test-taskw2DnyI/test-tmp/rpc-test-078624cc39964d059fc9170cfb358120.sock every 8 connection(s)
I20260927 01:31:10.133131   383 rpc-test.cc:1236] Sleep() min lat: 20502
I20260927 01:31:10.133211   383 rpc-test.cc:1237] Sleep() mean lat: 20502
I20260927 01:31:10.133239   383 rpc-test.cc:1238] Sleep() max lat: 20502
I20260927 01:31:10.133251   383 rpc-test.cc:1239] Sleep() #calls: 1
W20260927 01:31:10.134055   697 connection.cc:196] Error closing socket: Network error: TlsSocket::Close: Broken pipe
[       OK ] Parameters/TestRpc.TestRpcHandlerLatencyMetric/SSL_UnixSocket (61 ms)
[ RUN      ] Parameters/TestRpc.TimedOutOnResponseMetricServiceQueue/SSL_UnixSocket
I20260927 01:31:10.152870   726 acceptor_pool.cc:254] collecting diagnostics on the listening RPC socket unix:/tmp/dist-test-taskw2DnyI/test-tmp/rpc-test-3cbc1867114d45488468562f7788c7dd.sock every 8 connection(s)
I20260927 01:31:10.152902   727 acceptor_pool.cc:254] collecting diagnostics on the listening RPC socket unix:/tmp/dist-test-taskw2DnyI/test-tmp/rpc-test-3cbc1867114d45488468562f7788c7dd.sock every 8 connection(s)
W20260927 01:31:10.226490   728 rpcz_store.cc:267] Call kudu.rpc_test.CalculatorService.Sleep from unix:<unnamed> (request call id 2) took 20 ms (client timeout 20 ms). Trace:
W20260927 01:31:10.226629   728 rpcz_store.cc:269] 0927 01:31:10.206024 (+     0us) service_pool.cc:170] Inserting onto call queue
0927 01:31:10.226447 (+ 20423us) service_pool.cc:214] Skipping call since client already timed out
0927 01:31:10.226474 (+    27us) inbound_call.cc:173] Queueing failure response
Metrics: {}
W20260927 01:31:10.227476   723 connection.cc:196] Error closing socket: Network error: TlsSocket::Close: Broken pipe
[       OK ] Parameters/TestRpc.TimedOutOnResponseMetricServiceQueue/SSL_UnixSocket (93 ms)
[ RUN      ] Parameters/TestRpc.RpcPendingConnectionsMetric/SSL_UnixSocket
I20260927 01:31:10.230782   749 acceptor_pool.cc:254] collecting diagnostics on the listening RPC socket 0.0.0.0:34429 every 8 connection(s)
I20260927 01:31:10.230840   750 acceptor_pool.cc:254] collecting diagnostics on the listening RPC socket 0.0.0.0:34429 every 8 connection(s)
W20260927 01:31:10.240561   745 negotiation.cc:337] Failed RPC negotiation. Trace:
0927 01:31:10.239909 (+     0us) reactor.cc:625] Submitting negotiation task for server connection from 127.0.0.1:42984 (local address 127.0.0.1:34429)
0927 01:31:10.240079 (+   170us) server_negotiation.cc:206] Beginning negotiation
0927 01:31:10.240084 (+     5us) server_negotiation.cc:399] Waiting for connection header
0927 01:31:10.240228 (+   144us) negotiation.cc:327] Negotiation complete: Network error: Server connection negotiation failed: server connection from 127.0.0.1:42984: BlockingRecv error: recv got EOF from 127.0.0.1:42984 (error 108)
Metrics: {"server-negotiator.queue_time_us":65}
[       OK ] Parameters/TestRpc.RpcPendingConnectionsMetric/SSL_UnixSocket (22 ms)
[ RUN      ] Parameters/TestRpc.TestRpcContextClientDeadline/SSL_UnixSocket
I20260927 01:31:10.262825   765 acceptor_pool.cc:254] collecting diagnostics on the listening RPC socket unix:/tmp/dist-test-taskw2DnyI/test-tmp/rpc-test-c3f9790d92724bf992a4ded62c9955b6.sock every 8 connection(s)
I20260927 01:31:10.262857   766 acceptor_pool.cc:254] collecting diagnostics on the listening RPC socket unix:/tmp/dist-test-taskw2DnyI/test-tmp/rpc-test-c3f9790d92724bf992a4ded62c9955b6.sock every 8 connection(s)
[       OK ] Parameters/TestRpc.TestRpcContextClientDeadline/SSL_UnixSocket (48 ms)
[ RUN      ] Parameters/TestRpc.TestApplicationFeatureFlagUnsupportedServer/SSL_UnixSocket
I20260927 01:31:10.308223   790 acceptor_pool.cc:254] collecting diagnostics on the listening RPC socket unix:/tmp/dist-test-taskw2DnyI/test-tmp/rpc-test-0f49df83747c4b4a9628e113a18b945f.sock every 8 connection(s)
I20260927 01:31:10.308274   791 acceptor_pool.cc:254] collecting diagnostics on the listening RPC socket unix:/tmp/dist-test-taskw2DnyI/test-tmp/rpc-test-0f49df83747c4b4a9628e113a18b945f.sock every 8 connection(s)
[       OK ] Parameters/TestRpc.TestApplicationFeatureFlagUnsupportedServer/SSL_UnixSocket (21 ms)
[ RUN      ] Parameters/TestRpc.TestCancellationAsync/SSL_UnixSocket
I20260927 01:31:10.329254   815 acceptor_pool.cc:254] collecting diagnostics on the listening RPC socket unix:/tmp/dist-test-taskw2DnyI/test-tmp/rpc-test-841e4758b2f14c0780f7b174881f7c8f.sock every 8 connection(s)
I20260927 01:31:10.329267   816 acceptor_pool.cc:254] collecting diagnostics on the listening RPC socket unix:/tmp/dist-test-taskw2DnyI/test-tmp/rpc-test-841e4758b2f14c0780f7b174881f7c8f.sock every 8 connection(s)
I20260927 01:31:10.329523   383 rpc-test.cc:1716] Connecting to unix:/tmp/dist-test-taskw2DnyI/test-tmp/rpc-test-841e4758b2f14c0780f7b174881f7c8f.sock
I20260927 01:31:10.347374   383 test_util.cc:268] Using random seed: -411107221
I20260927 01:31:10.367484   819 rpc-test-base.h:240] got call: sleep_micros: 500 pattern: 4294967295 num_repetitions: 2097152 sidecar_idx: 0
I20260927 01:31:10.382900   818 rpc-test-base.h:240] got call: sleep_micros: 500 pattern: 4294967295 num_repetitions: 2097152 sidecar_idx: 0
I20260927 01:31:10.397929   819 rpc-test-base.h:240] got call: sleep_micros: 500 pattern: 4294967295 num_repetitions: 2097152 sidecar_idx: 0
I20260927 01:31:10.414018   818 rpc-test-base.h:240] got call: sleep_micros: 500 pattern: 4294967295 num_repetitions: 2097152 sidecar_idx: 0
I20260927 01:31:10.432684   819 rpc-test-base.h:240] got call: sleep_micros: 500 pattern: 4294967295 num_repetitions: 2097152 sidecar_idx: 0
I20260927 01:31:10.450179   818 rpc-test-base.h:240] got call: sleep_micros: 500 pattern: 4294967295 num_repetitions: 2097152 sidecar_idx: 0
I20260927 01:31:10.469902   819 rpc-test-base.h:240] got call: sleep_micros: 500 pattern: 4294967295 num_repetitions: 2097152 sidecar_idx: 0
I20260927 01:31:10.488343   818 rpc-test-base.h:240] got call: sleep_micros: 500 pattern: 4294967295 num_repetitions: 2097152 sidecar_idx: 0
W20260927 01:31:10.490602   812 connection.cc:196] Error closing socket: Network error: TlsSocket::Close: Broken pipe
W20260927 01:31:10.494388   812 connection.cc:441] server connection from unix:<unnamed> torn down before Call kudu.rpc.GenericCalculatorService.SleepWithSidecar from unix:<unnamed> (request call id 8) could send its response
W20260927 01:31:10.506407   812 connection.cc:441] server connection from unix:<unnamed> torn down before Call kudu.rpc.GenericCalculatorService.SleepWithSidecar from unix:<unnamed> (request call id 9) could send its response
[       OK ] Parameters/TestRpc.TestCancellationAsync/SSL_UnixSocket (186 ms)
[ RUN      ] Parameters/TestRpc.TestPerformanceBySocketType/SSL_UnixSocket
I20260927 01:31:10.528810   841 acceptor_pool.cc:254] collecting diagnostics on the listening RPC socket unix:/tmp/dist-test-taskw2DnyI/test-tmp/rpc-test-21466ca4179e48c3bcf550b8cd43d7d5.sock every 8 connection(s)
I20260927 01:31:10.528796   840 acceptor_pool.cc:254] collecting diagnostics on the listening RPC socket unix:/tmp/dist-test-taskw2DnyI/test-tmp/rpc-test-21466ca4179e48c3bcf550b8cd43d7d5.sock every 8 connection(s)
I20260927 01:31:10.529071   383 rpc-test.cc:1846] Connecting to unix:/tmp/dist-test-taskw2DnyI/test-tmp/rpc-test-21466ca4179e48c3bcf550b8cd43d7d5.sock
I20260927 01:31:12.270531   383 rpc-test.cc:1859] Sending 1024MB via ssl-enabled unix socket: real 1.733s	user 2.141s	sys 0.933s
I20260927 01:31:13.956487   383 rpc-test.cc:1859] Sending 1024MB via ssl-enabled unix socket: real 1.686s	user 2.105s	sys 0.887s
I20260927 01:31:15.721376   383 rpc-test.cc:1859] Sending 1024MB via ssl-enabled unix socket: real 1.765s	user 2.084s	sys 1.055s
I20260927 01:31:17.441926   383 rpc-test.cc:1859] Sending 1024MB via ssl-enabled unix socket: real 1.720s	user 2.174s	sys 0.884s
I20260927 01:31:19.180799   383 rpc-test.cc:1859] Sending 1024MB via ssl-enabled unix socket: real 1.739s	user 2.270s	sys 0.826s
W20260927 01:31:19.181574   837 connection.cc:196] Error closing socket: Network error: TlsSocket::Close: Broken pipe
[       OK ] Parameters/TestRpc.TestPerformanceBySocketType/SSL_UnixSocket (8675 ms)
[----------] 20 tests from Parameters/TestRpc (31299 ms total)

[----------] 1 test from Parameters/TestRpcSocketTxRxQueue
[ RUN      ] Parameters/TestRpcSocketTxRxQueue.AcceptorRxQueueSizeMetric/0
I20260927 01:31:19.186146   865 acceptor_pool.cc:254] collecting diagnostics on the listening RPC socket 0.0.0.0:43085 every 1 connection(s)
I20260927 01:31:19.186149   866 acceptor_pool.cc:254] collecting diagnostics on the listening RPC socket 0.0.0.0:43085 every 1 connection(s)
W20260927 01:31:19.187011   861 negotiation.cc:337] Failed RPC negotiation. Trace:
0927 01:31:19.186709 (+     0us) reactor.cc:625] Submitting negotiation task for server connection from 127.0.0.1:50468 (local address 127.0.0.1:43085)
0927 01:31:19.186841 (+   132us) server_negotiation.cc:206] Beginning negotiation
0927 01:31:19.186844 (+     3us) server_negotiation.cc:399] Waiting for connection header
0927 01:31:19.186937 (+    93us) negotiation.cc:327] Negotiation complete: Network error: Server connection negotiation failed: server connection from 127.0.0.1:50468: BlockingRecv error: recv got EOF from 127.0.0.1:50468 (error 108)
Metrics: {"server-negotiator.queue_time_us":53}
[       OK ] Parameters/TestRpcSocketTxRxQueue.AcceptorRxQueueSizeMetric/0 (4 ms)
[----------] 1 test from Parameters/TestRpcSocketTxRxQueue (5 ms total)

[----------] Global test environment tear-down
[==========] 21 tests from 2 test suites ran. (31304 ms total)
[  PASSED  ] 20 tests.
[  FAILED  ] 1 test, listed below:
[  FAILED  ] Parameters/TestRpc.TestCallWithChainCertAndChainCA/SSL_UnixSocket, where GetParam() = (true, true)

 1 FAILED TEST