Diagnosed failure

Parameters/TestRpc.TestCallWithChainCertAndRootCA/SSL_UnixSocket: /data0/somelongdirectorytoavoidrpathissues/src/kudu/src/kudu/rpc/rpc-test.cc:303: Failure
Failed
Bad status: Runtime error: could not verify certificate chain (error with cert: subject=CN = localhost, ST = sadfjas, C = AS, emailAddress = sdflkdsajf, O = lskdfjlsad, OU = sldfkja, issuer=C = AS, ST = ASDfkjdhf, L = lskdjf, O = saldfja, OU = skdjf, CN = localhost, emailAddress = sadjflkadsj): : certificate has expired
Google Test trace:
/data0/somelongdirectorytoavoidrpathissues/src/kudu/src/kudu/rpc/rpc-test.cc:300: Connecting to unix:/tmp/dist-test-task6f5oOL/test-tmp/rpc-test-68710a251169461d96eb2ec76892e38a.sock
I20260924 14:27:18.151274 21784 test_util.cc:175] -----------------------------------------------
I20260924 14:27:18.151454 21784 test_util.cc:176] Had fatal failures, leaving test files at /tmp/dist-test-task6f5oOL/test-tmp/rpc-test.2.Parameters_TestRpc.TestCallWithChainCertAndRootCA_SSL_UnixSocket.1790260034483522-21784-0

Full log

Note: This is test shard 3 of 8.
[==========] Running 21 tests from 2 test suites.
[----------] Global test environment set-up.
[----------] 1 test from TestRpc
[ RUN      ] TestRpc.TestNegotiationTimeout
WARNING: Logging before InitGoogleLogging() is written to STDERR
I20260924 14:27:14.702172 21784 rpc-test-base.h:595] status: Timed out: connection negotiation to 0.0.0.0:40295 for RPC Sleep timed out after 0.100s (ON_OUTBOUND_QUEUE), seconds elapsed: 0.100782
W20260924 14:27:17.784966 21794 negotiation.cc:337] Failed RPC negotiation. Trace:
0924 14:27:14.602321 (+     0us) reactor.cc:625] Submitting negotiation task for client connection to 0.0.0.0:40295 (local address 127.0.0.1:51226)
0924 14:27:14.603035 (+   714us) negotiation.cc:107] Waiting for socket to connect
0924 14:27:14.603088 (+    53us) client_negotiation.cc:174] Beginning negotiation
0924 14:27:14.617033 (+ 13945us) client_negotiation.cc:252] Sending NEGOTIATE NegotiatePB request
0924 14:27:17.783519 (+3166486us) negotiation.cc:327] Negotiation complete: Timed out: Client connection negotiation failed: client connection to 0.0.0.0:40295: received 0 of 4 requested bytes
Metrics: {"client-negotiator.queue_time_us":220}
[       OK ] TestRpc.TestNegotiationTimeout (3251 ms)
[----------] 1 test from TestRpc (3251 ms total)

[----------] 20 tests from Parameters/TestRpc
[ RUN      ] Parameters/TestRpc.TestAcceptorPoolStartStop/SSL_UnixSocket
I20260924 14:27:17.827821 21811 acceptor_pool.cc:254] collecting diagnostics on the listening RPC socket unix:/tmp/dist-test-task6f5oOL/test-tmp/rpc-test-5428680001004558acc1aeba9f799c8d.sock every 8 connection(s)
I20260924 14:27:17.829831 21812 acceptor_pool.cc:254] collecting diagnostics on the listening RPC socket unix:/tmp/dist-test-task6f5oOL/test-tmp/rpc-test-5428680001004558acc1aeba9f799c8d.sock every 8 connection(s)
I20260924 14:27:17.888595 21822 acceptor_pool.cc:254] collecting diagnostics on the listening RPC socket unix:/tmp/dist-test-task6f5oOL/test-tmp/rpc-test-5428680001004558acc1aeba9f799c8d.sock every 8 connection(s)
I20260924 14:27:17.890216 21823 acceptor_pool.cc:254] collecting diagnostics on the listening RPC socket unix:/tmp/dist-test-task6f5oOL/test-tmp/rpc-test-5428680001004558acc1aeba9f799c8d.sock every 8 connection(s)
I20260924 14:27:17.928064 21833 acceptor_pool.cc:254] collecting diagnostics on the listening RPC socket unix:/tmp/dist-test-task6f5oOL/test-tmp/rpc-test-5428680001004558acc1aeba9f799c8d.sock every 8 connection(s)
I20260924 14:27:17.928954 21834 acceptor_pool.cc:254] collecting diagnostics on the listening RPC socket unix:/tmp/dist-test-task6f5oOL/test-tmp/rpc-test-5428680001004558acc1aeba9f799c8d.sock every 8 connection(s)
I20260924 14:27:17.956817 21844 acceptor_pool.cc:254] collecting diagnostics on the listening RPC socket unix:/tmp/dist-test-task6f5oOL/test-tmp/rpc-test-5428680001004558acc1aeba9f799c8d.sock every 8 connection(s)
I20260924 14:27:17.957571 21845 acceptor_pool.cc:254] collecting diagnostics on the listening RPC socket unix:/tmp/dist-test-task6f5oOL/test-tmp/rpc-test-5428680001004558acc1aeba9f799c8d.sock every 8 connection(s)
I20260924 14:27:17.981037 21855 acceptor_pool.cc:254] collecting diagnostics on the listening RPC socket unix:/tmp/dist-test-task6f5oOL/test-tmp/rpc-test-5428680001004558acc1aeba9f799c8d.sock every 8 connection(s)
I20260924 14:27:17.981837 21856 acceptor_pool.cc:254] collecting diagnostics on the listening RPC socket unix:/tmp/dist-test-task6f5oOL/test-tmp/rpc-test-5428680001004558acc1aeba9f799c8d.sock every 8 connection(s)
[       OK ] Parameters/TestRpc.TestAcceptorPoolStartStop/SSL_UnixSocket (197 ms)
[ RUN      ] Parameters/TestRpc.TestCall/SSL_UnixSocket
I20260924 14:27:18.032300 21868 acceptor_pool.cc:254] collecting diagnostics on the listening RPC socket unix:/tmp/dist-test-task6f5oOL/test-tmp/rpc-test-0444d5b1bc8243e6ada42579bd67cfa3.sock every 8 connection(s)
I20260924 14:27:18.034523 21869 acceptor_pool.cc:254] collecting diagnostics on the listening RPC socket unix:/tmp/dist-test-task6f5oOL/test-tmp/rpc-test-0444d5b1bc8243e6ada42579bd67cfa3.sock every 8 connection(s)
I20260924 14:27:18.040431 21784 rpc-test.cc:234] Connecting to unix:/tmp/dist-test-task6f5oOL/test-tmp/rpc-test-0444d5b1bc8243e6ada42579bd67cfa3.sock
[       OK ] Parameters/TestRpc.TestCall/SSL_UnixSocket (117 ms)
[ RUN      ] Parameters/TestRpc.TestCallWithChainCertAndRootCA/SSL_UnixSocket
I20260924 14:27:18.127346 21893 acceptor_pool.cc:254] collecting diagnostics on the listening RPC socket unix:/tmp/dist-test-task6f5oOL/test-tmp/rpc-test-68710a251169461d96eb2ec76892e38a.sock every 8 connection(s)
I20260924 14:27:18.128110 21894 acceptor_pool.cc:254] collecting diagnostics on the listening RPC socket unix:/tmp/dist-test-task6f5oOL/test-tmp/rpc-test-68710a251169461d96eb2ec76892e38a.sock every 8 connection(s)
/data0/somelongdirectorytoavoidrpathissues/src/kudu/src/kudu/rpc/rpc-test.cc:303: Failure
Failed
Bad status: Runtime error: could not verify certificate chain (error with cert: subject=CN = localhost, ST = sadfjas, C = AS, emailAddress = sdflkdsajf, O = lskdfjlsad, OU = sldfkja, issuer=C = AS, ST = ASDfkjdhf, L = lskdjf, O = saldfja, OU = skdjf, CN = localhost, emailAddress = sadjflkadsj): : certificate has expired
Google Test trace:
/data0/somelongdirectorytoavoidrpathissues/src/kudu/src/kudu/rpc/rpc-test.cc:300: Connecting to unix:/tmp/dist-test-task6f5oOL/test-tmp/rpc-test-68710a251169461d96eb2ec76892e38a.sock
I20260924 14:27:18.151274 21784 test_util.cc:175] -----------------------------------------------
I20260924 14:27:18.151454 21784 test_util.cc:176] Had fatal failures, leaving test files at /tmp/dist-test-task6f5oOL/test-tmp/rpc-test.2.Parameters_TestRpc.TestCallWithChainCertAndRootCA_SSL_UnixSocket.1790260034483522-21784-0
[  FAILED  ] Parameters/TestRpc.TestCallWithChainCertAndRootCA/SSL_UnixSocket, where GetParam() = (true, true) (47 ms)
[ RUN      ] Parameters/TestRpc.TestCallWithBadPasswordProtectedKey/SSL_UnixSocket
[       OK ] Parameters/TestRpc.TestCallWithBadPasswordProtectedKey/SSL_UnixSocket (34 ms)
[ RUN      ] Parameters/TestRpc.TestInvalidMethodCall/SSL_UnixSocket
I20260924 14:27:18.208307 21930 acceptor_pool.cc:254] collecting diagnostics on the listening RPC socket unix:/tmp/dist-test-task6f5oOL/test-tmp/rpc-test-bdda0991bd9b4912a4ab4fbb79b3d246.sock every 8 connection(s)
I20260924 14:27:18.209159 21931 acceptor_pool.cc:254] collecting diagnostics on the listening RPC socket unix:/tmp/dist-test-task6f5oOL/test-tmp/rpc-test-bdda0991bd9b4912a4ab4fbb79b3d246.sock every 8 connection(s)
I20260924 14:27:18.212687 21784 rpc-test.cc:406] Connecting to unix:/tmp/dist-test-task6f5oOL/test-tmp/rpc-test-bdda0991bd9b4912a4ab4fbb79b3d246.sock
W20260924 14:27:18.244463 21927 connection.cc:196] Error closing socket: Network error: TlsSocket::Close: Broken pipe
[       OK ] Parameters/TestRpc.TestInvalidMethodCall/SSL_UnixSocket (62 ms)
[ RUN      ] Parameters/TestRpc.TestHighFDs/SSL_UnixSocket
I20260924 14:27:18.478045 21956 acceptor_pool.cc:254] collecting diagnostics on the listening RPC socket unix:/tmp/dist-test-task6f5oOL/test-tmp/rpc-test-686022a39230422ab201e0070885091e.sock every 8 connection(s)
I20260924 14:27:18.478806 21957 acceptor_pool.cc:254] collecting diagnostics on the listening RPC socket unix:/tmp/dist-test-task6f5oOL/test-tmp/rpc-test-686022a39230422ab201e0070885091e.sock every 8 connection(s)
[       OK ] Parameters/TestRpc.TestHighFDs/SSL_UnixSocket (280 ms)
[ RUN      ] Parameters/TestRpc.TestConnectionAlwaysKeepalive/SSL_UnixSocket
I20260924 14:27:18.560413 21979 acceptor_pool.cc:254] collecting diagnostics on the listening RPC socket unix:/tmp/dist-test-task6f5oOL/test-tmp/rpc-test-5e8e1c5f6df4482091c681a236361b03.sock every 8 connection(s)
I20260924 14:27:18.561160 21980 acceptor_pool.cc:254] collecting diagnostics on the listening RPC socket unix:/tmp/dist-test-task6f5oOL/test-tmp/rpc-test-5e8e1c5f6df4482091c681a236361b03.sock every 8 connection(s)
I20260924 14:27:18.564432 21784 rpc-test.cc:532] Connecting to unix:/tmp/dist-test-task6f5oOL/test-tmp/rpc-test-5e8e1c5f6df4482091c681a236361b03.sock
W20260924 14:27:21.596346 21978 connection.cc:196] Error closing socket: Network error: TlsSocket::Close: Broken pipe
[       OK ] Parameters/TestRpc.TestConnectionAlwaysKeepalive/SSL_UnixSocket (3070 ms)
[ RUN      ] Parameters/TestRpc.TestReopenOutboundConnections/SSL_UnixSocket
I20260924 14:27:21.630251 22002 acceptor_pool.cc:254] collecting diagnostics on the listening RPC socket unix:/tmp/dist-test-task6f5oOL/test-tmp/rpc-test-62bd4472b557497fa2b672cdb2c69aba.sock every 8 connection(s)
I20260924 14:27:21.630964 22003 acceptor_pool.cc:254] collecting diagnostics on the listening RPC socket unix:/tmp/dist-test-task6f5oOL/test-tmp/rpc-test-62bd4472b557497fa2b672cdb2c69aba.sock every 8 connection(s)
I20260924 14:27:21.634284 21784 rpc-test.cc:658] Connecting to unix:/tmp/dist-test-task6f5oOL/test-tmp/rpc-test-62bd4472b557497fa2b672cdb2c69aba.sock
W20260924 14:27:21.662082 22001 connection.cc:196] Error closing socket: Network error: TlsSocket::Close: Broken pipe
W20260924 14:27:21.673187 22001 connection.cc:196] Error closing socket: Network error: TlsSocket::Close: Broken pipe
W20260924 14:27:21.683929 22001 connection.cc:196] Error closing socket: Network error: TlsSocket::Close: Broken pipe
W20260924 14:27:21.695345 22001 connection.cc:196] Error closing socket: Network error: TlsSocket::Close: Broken pipe
W20260924 14:27:21.706121 22001 connection.cc:196] Error closing socket: Network error: TlsSocket::Close: Broken pipe
W20260924 14:27:21.716606 22001 connection.cc:196] Error closing socket: Network error: TlsSocket::Close: Broken pipe
W20260924 14:27:21.727311 22001 connection.cc:196] Error closing socket: Network error: TlsSocket::Close: Broken pipe
W20260924 14:27:21.738286 22001 connection.cc:196] Error closing socket: Network error: TlsSocket::Close: Broken pipe
W20260924 14:27:21.749001 22001 connection.cc:196] Error closing socket: Network error: TlsSocket::Close: Broken pipe
W20260924 14:27:21.759291 22001 connection.cc:196] Error closing socket: Network error: TlsSocket::Close: Broken pipe
W20260924 14:27:21.769694 22001 connection.cc:196] Error closing socket: Network error: TlsSocket::Close: Broken pipe
W20260924 14:27:21.780360 22001 connection.cc:196] Error closing socket: Network error: TlsSocket::Close: Broken pipe
W20260924 14:27:21.792168 22001 connection.cc:196] Error closing socket: Network error: TlsSocket::Close: Broken pipe
W20260924 14:27:21.801997 22001 connection.cc:196] Error closing socket: Network error: TlsSocket::Close: Broken pipe
W20260924 14:27:21.802273 22002 acceptor_pool.cc:285] unable to collect diagnostics on RPC socket unix:/tmp/dist-test-task6f5oOL/test-tmp/rpc-test-62bd4472b557497fa2b672cdb2c69aba.sock: Not implemented: netlink diagnostics is currently supported only on IPv4 TCP sockets
W20260924 14:27:21.813019 22001 connection.cc:196] Error closing socket: Network error: TlsSocket::Close: Broken pipe
W20260924 14:27:21.824169 22001 connection.cc:196] Error closing socket: Network error: TlsSocket::Close: Broken pipe
W20260924 14:27:21.835125 22001 connection.cc:196] Error closing socket: Network error: TlsSocket::Close: Broken pipe
W20260924 14:27:21.857813 22001 connection.cc:196] Error closing socket: Network error: TlsSocket::Close: Broken pipe
W20260924 14:27:21.869765 22001 connection.cc:196] Error closing socket: Network error: TlsSocket::Close: Broken pipe
W20260924 14:27:21.881372 22001 connection.cc:196] Error closing socket: Network error: TlsSocket::Close: Broken pipe
W20260924 14:27:21.892562 22001 connection.cc:196] Error closing socket: Network error: TlsSocket::Close: Broken pipe
W20260924 14:27:21.902431 22001 connection.cc:196] Error closing socket: Network error: TlsSocket::Close: Broken pipe
W20260924 14:27:21.914009 22001 connection.cc:196] Error closing socket: Network error: TlsSocket::Close: Broken pipe
W20260924 14:27:21.924445 22001 connection.cc:196] Error closing socket: Network error: TlsSocket::Close: Broken pipe
W20260924 14:27:21.934069 22001 connection.cc:196] Error closing socket: Network error: TlsSocket::Close: Broken pipe
W20260924 14:27:21.944980 22001 connection.cc:196] Error closing socket: Network error: TlsSocket::Close: Broken pipe
W20260924 14:27:21.955258 22001 connection.cc:196] Error closing socket: Network error: TlsSocket::Close: Broken pipe
W20260924 14:27:21.965627 22001 connection.cc:196] Error closing socket: Network error: TlsSocket::Close: Broken pipe
W20260924 14:27:21.975478 22001 connection.cc:196] Error closing socket: Network error: TlsSocket::Close: Broken pipe
W20260924 14:27:21.985857 22001 connection.cc:196] Error closing socket: Network error: TlsSocket::Close: Broken pipe
[       OK ] Parameters/TestRpc.TestReopenOutboundConnections/SSL_UnixSocket (400 ms)
[ RUN      ] Parameters/TestRpc.TestConnectionNetworkPlane/SSL_UnixSocket
I20260924 14:27:22.017807 22025 acceptor_pool.cc:254] collecting diagnostics on the listening RPC socket unix:/tmp/dist-test-task6f5oOL/test-tmp/rpc-test-ed566521438044c3908b3efdecdcbdf0.sock every 8 connection(s)
I20260924 14:27:22.018656 22026 acceptor_pool.cc:254] collecting diagnostics on the listening RPC socket unix:/tmp/dist-test-task6f5oOL/test-tmp/rpc-test-ed566521438044c3908b3efdecdcbdf0.sock every 8 connection(s)
I20260924 14:27:22.022274 21784 rpc-test.cc:772] Connecting to unix:/tmp/dist-test-task6f5oOL/test-tmp/rpc-test-ed566521438044c3908b3efdecdcbdf0.sock
W20260924 14:27:22.094465 22024 connection.cc:196] Error closing socket: Network error: TlsSocket::Close: Broken pipe
W20260924 14:27:22.095307 22024 connection.cc:196] Error closing socket: Network error: TlsSocket::Close: Broken pipe
[       OK ] Parameters/TestRpc.TestConnectionNetworkPlane/SSL_UnixSocket (97 ms)
[ RUN      ] Parameters/TestRpc.TestTCPKeepalive/SSL_UnixSocket
I20260924 14:27:22.121522 22050 acceptor_pool.cc:254] collecting diagnostics on the listening RPC socket unix:/tmp/dist-test-task6f5oOL/test-tmp/rpc-test-2b7beff2cc08480f9cd615245967e06d.sock every 8 connection(s)
I20260924 14:27:22.122377 22051 acceptor_pool.cc:254] collecting diagnostics on the listening RPC socket unix:/tmp/dist-test-task6f5oOL/test-tmp/rpc-test-2b7beff2cc08480f9cd615245967e06d.sock every 8 connection(s)
I20260924 14:27:22.160998 22054 rpc-test-base.h:222] got call: sleep_micros: 8000000 deferred: true
I20260924 14:27:30.165256 22054 rpcz_store.cc:275] Call kudu.rpc.GenericCalculatorService.Sleep from unix:<unnamed> (request call id 0) took 8004 ms. Trace:
I20260924 14:27:30.165773 22054 rpcz_store.cc:276] 0924 14:27:22.160810 (+     0us) service_pool.cc:170] Inserting onto call queue
0924 14:27:22.160937 (+   127us) service_pool.cc:227] Handling call
0924 14:27:30.165055 (+8004118us) inbound_call.cc:173] Queueing success response
Metrics: {}
W20260924 14:27:30.173478 22047 connection.cc:196] Error closing socket: Network error: TlsSocket::Close: Broken pipe
[       OK ] Parameters/TestRpc.TestTCPKeepalive/SSL_UnixSocket (8081 ms)
[ RUN      ] Parameters/TestRpc.TestMaxSmallSidecars/SSL_UnixSocket
I20260924 14:27:30.207077 22076 acceptor_pool.cc:254] collecting diagnostics on the listening RPC socket unix:/tmp/dist-test-task6f5oOL/test-tmp/rpc-test-42a17549fe8e473b8ef6cbfaadf6ee03.sock every 8 connection(s)
I20260924 14:27:30.208006 22077 acceptor_pool.cc:254] collecting diagnostics on the listening RPC socket unix:/tmp/dist-test-task6f5oOL/test-tmp/rpc-test-42a17549fe8e473b8ef6cbfaadf6ee03.sock every 8 connection(s)
W20260924 14:27:30.392812 22073 connection.cc:196] Error closing socket: Network error: TlsSocket::Close: Broken pipe
[       OK ] Parameters/TestRpc.TestMaxSmallSidecars/SSL_UnixSocket (217 ms)
[ RUN      ] Parameters/TestRpc.TestCallTimeout/SSL_UnixSocket
I20260924 14:27:30.429062 22101 acceptor_pool.cc:254] collecting diagnostics on the listening RPC socket unix:/tmp/dist-test-task6f5oOL/test-tmp/rpc-test-e35ec05fc012477aa3cf0367d905e836.sock every 8 connection(s)
I20260924 14:27:30.429787 22102 acceptor_pool.cc:254] collecting diagnostics on the listening RPC socket unix:/tmp/dist-test-task6f5oOL/test-tmp/rpc-test-e35ec05fc012477aa3cf0367d905e836.sock every 8 connection(s)
I20260924 14:27:30.462766 21784 rpc-test-base.h:595] status: Timed out: connection negotiation to unix:/tmp/dist-test-task6f5oOL/test-tmp/rpc-test-e35ec05fc012477aa3cf0367d905e836.sock for RPC Sleep timed out after 0.000s (ON_OUTBOUND_QUEUE), seconds elapsed: 0.00301676
I20260924 14:27:30.469856 22105 rpc-test-base.h:222] got call: sleep_micros: 700000
I20260924 14:27:30.664706 21784 rpc-test-base.h:595] status: Timed out: Sleep RPC to unix:/tmp/dist-test-task6f5oOL/test-tmp/rpc-test-e35ec05fc012477aa3cf0367d905e836.sock timed out after 0.200s (SENT), seconds elapsed: 0.201523
I20260924 14:27:30.666260 22104 rpc-test-base.h:222] got call: sleep_micros: 2000000
W20260924 14:27:31.170548 22105 rpcz_store.cc:267] Call kudu.rpc.GenericCalculatorService.Sleep from unix:<unnamed> (request call id 1) took 700 ms (client timeout 200 ms). Trace:
W20260924 14:27:31.170924 22105 rpcz_store.cc:269] 0924 14:27:30.469706 (+     0us) service_pool.cc:170] Inserting onto call queue
0924 14:27:30.469809 (+   103us) service_pool.cc:227] Handling call
0924 14:27:31.170478 (+700669us) inbound_call.cc:173] Queueing success response
Metrics: {}
I20260924 14:27:32.167512 21784 rpc-test-base.h:595] status: Timed out: Sleep RPC to unix:/tmp/dist-test-task6f5oOL/test-tmp/rpc-test-e35ec05fc012477aa3cf0367d905e836.sock timed out after 1.500s (SENT), seconds elapsed: 1.50241
W20260924 14:27:32.666965 22104 rpcz_store.cc:267] Call kudu.rpc.GenericCalculatorService.Sleep from unix:<unnamed> (request call id 2) took 2001 ms (client timeout 1500 ms). Trace:
W20260924 14:27:32.667286 22104 rpcz_store.cc:269] 0924 14:27:30.666004 (+     0us) service_pool.cc:170] Inserting onto call queue
0924 14:27:30.666163 (+   159us) service_pool.cc:227] Handling call
0924 14:27:32.666903 (+2000740us) inbound_call.cc:173] Queueing success response
Metrics: {}
W20260924 14:27:32.667928 22098 connection.cc:441] server connection from unix:<unnamed> torn down before Call kudu.rpc.GenericCalculatorService.Sleep from unix:<unnamed> (request call id 2) could send its response
[       OK ] Parameters/TestRpc.TestCallTimeout/SSL_UnixSocket (2275 ms)
[ RUN      ] Parameters/TestRpc.TestServerShutsDown/SSL_UnixSocket
I20260924 14:27:32.675491 21784 rpc-test.cc:1125] Connecting to 0.0.0.0:34097
W20260924 14:27:32.685639 22118 negotiation.cc:337] Failed RPC negotiation. Trace:
0924 14:27:32.684168 (+     0us) reactor.cc:625] Submitting negotiation task for client connection to 0.0.0.0:34097 (local address 127.0.0.1:60128)
0924 14:27:32.684639 (+   471us) negotiation.cc:107] Waiting for socket to connect
0924 14:27:32.684671 (+    32us) client_negotiation.cc:174] Beginning negotiation
0924 14:27:32.684892 (+   221us) client_negotiation.cc:252] Sending NEGOTIATE NegotiatePB request
0924 14:27:32.685109 (+   217us) negotiation.cc:327] Negotiation complete: Network error: Client connection negotiation failed: client connection to 0.0.0.0:34097: BlockingWrite error: write error: Broken pipe (error 32)
Metrics: {"client-negotiator.queue_time_us":128}
[       OK ] Parameters/TestRpc.TestServerShutsDown/SSL_UnixSocket (14 ms)
[ RUN      ] Parameters/TestRpc.TimedOutOnResponseMetric/SSL_UnixSocket
I20260924 14:27:32.710597 22135 acceptor_pool.cc:254] collecting diagnostics on the listening RPC socket unix:/tmp/dist-test-task6f5oOL/test-tmp/rpc-test-c7dd4fa2f3ad40b0b23298860c207a48.sock every 8 connection(s)
I20260924 14:27:32.711305 22136 acceptor_pool.cc:254] collecting diagnostics on the listening RPC socket unix:/tmp/dist-test-task6f5oOL/test-tmp/rpc-test-c7dd4fa2f3ad40b0b23298860c207a48.sock every 8 connection(s)
W20260924 14:27:32.951278 22139 rpcz_store.cc:267] Call kudu.rpc_test.CalculatorService.Sleep from unix:<unnamed> (request call id 3) took 50 ms (client timeout 25 ms). Trace:
W20260924 14:27:32.951607 22139 rpcz_store.cc:269] 0924 14:27:32.900635 (+     0us) service_pool.cc:170] Inserting onto call queue
0924 14:27:32.900809 (+   174us) service_pool.cc:227] Handling call
0924 14:27:32.951201 (+ 50392us) inbound_call.cc:173] Queueing success response
Related trace 'test_child':
Metrics: {"test_sleep_us":50000,"child_traces":[["test_child",{"related_trace_metric":1}]]}
W20260924 14:27:33.010527 22139 rpcz_store.cc:267] Call kudu.rpc_test.CalculatorService.Sleep from unix:<unnamed> (request call id 4) took 50 ms (client timeout 50 ms). Trace:
W20260924 14:27:33.010811 22139 rpcz_store.cc:269] 0924 14:27:32.959928 (+     0us) service_pool.cc:170] Inserting onto call queue
0924 14:27:32.960076 (+   148us) service_pool.cc:227] Handling call
0924 14:27:33.010462 (+ 50386us) inbound_call.cc:173] Queueing success response
Related trace 'test_child':
Metrics: {"test_sleep_us":50000,"child_traces":[["test_child",{"related_trace_metric":1}]]}
W20260924 14:27:33.014642 22132 connection.cc:196] Error closing socket: Network error: TlsSocket::Close: Broken pipe
[       OK ] Parameters/TestRpc.TimedOutOnResponseMetric/SSL_UnixSocket (333 ms)
[ RUN      ] Parameters/TestRpc.AcceptorDispatchingTimesMetric/SSL_UnixSocket
I20260924 14:27:33.035224 22160 acceptor_pool.cc:254] collecting diagnostics on the listening RPC socket 0.0.0.0:33553 every 8 connection(s)
I20260924 14:27:33.035954 22161 acceptor_pool.cc:254] collecting diagnostics on the listening RPC socket 0.0.0.0:33553 every 8 connection(s)
W20260924 14:27:33.042865 22156 negotiation.cc:337] Failed RPC negotiation. Trace:
0924 14:27:33.040250 (+     0us) reactor.cc:625] Submitting negotiation task for server connection from 127.0.0.1:38598 (local address 127.0.0.1:33553)
0924 14:27:33.041202 (+   952us) server_negotiation.cc:206] Beginning negotiation
0924 14:27:33.041234 (+    32us) server_negotiation.cc:399] Waiting for connection header
0924 14:27:33.041753 (+   519us) negotiation.cc:327] Negotiation complete: Network error: Server connection negotiation failed: server connection from 127.0.0.1:38598: BlockingRecv error: recv got EOF from 127.0.0.1:38598 (error 108)
Metrics: {"server-negotiator.queue_time_us":280}
[       OK ] Parameters/TestRpc.AcceptorDispatchingTimesMetric/SSL_UnixSocket (23 ms)
[ RUN      ] Parameters/TestRpc.TestRpcCallbackDestroysMessenger/SSL_UnixSocket
[       OK ] Parameters/TestRpc.TestRpcCallbackDestroysMessenger/SSL_UnixSocket (37 ms)
[ RUN      ] Parameters/TestRpc.TestApplicationFeatureFlag/SSL_UnixSocket
I20260924 14:27:33.113780 22185 acceptor_pool.cc:254] collecting diagnostics on the listening RPC socket unix:/tmp/dist-test-task6f5oOL/test-tmp/rpc-test-bd43fea763ee4d0faafe56a0a33ba9c6.sock every 8 connection(s)
I20260924 14:27:33.114621 22186 acceptor_pool.cc:254] collecting diagnostics on the listening RPC socket unix:/tmp/dist-test-task6f5oOL/test-tmp/rpc-test-bd43fea763ee4d0faafe56a0a33ba9c6.sock every 8 connection(s)
W20260924 14:27:33.143859 22182 messenger.cc:357] Unable to handle RPC call: Not implemented: call requires unsupported application feature flags: 99
[       OK ] Parameters/TestRpc.TestApplicationFeatureFlag/SSL_UnixSocket (68 ms)
[ RUN      ] Parameters/TestRpc.TestCancellation/SSL_UnixSocket
I20260924 14:27:33.177604 22210 acceptor_pool.cc:254] collecting diagnostics on the listening RPC socket unix:/tmp/dist-test-task6f5oOL/test-tmp/rpc-test-ddff1512b4004267b043ed9cb4afeaea.sock every 8 connection(s)
I20260924 14:27:33.178368 22211 acceptor_pool.cc:254] collecting diagnostics on the listening RPC socket unix:/tmp/dist-test-task6f5oOL/test-tmp/rpc-test-ddff1512b4004267b043ed9cb4afeaea.sock every 8 connection(s)
I20260924 14:27:33.181697 21784 rpc-test.cc:1648] Connecting to unix:/tmp/dist-test-task6f5oOL/test-tmp/rpc-test-ddff1512b4004267b043ed9cb4afeaea.sock
I20260924 14:27:33.294708 21784 rpc-test-base.h:595] status: Aborted: Sleep RPC to unix:/tmp/dist-test-task6f5oOL/test-tmp/rpc-test-ddff1512b4004267b043ed9cb4afeaea.sock is cancelled in state READY, seconds elapsed: 0.000421102
I20260924 14:27:33.501524 21784 rpc-test-base.h:595] status: Aborted: Sleep RPC to unix:/tmp/dist-test-task6f5oOL/test-tmp/rpc-test-ddff1512b4004267b043ed9cb4afeaea.sock is cancelled in state SENT, seconds elapsed: 0.000691208
I20260924 14:27:33.501863 22213 rpc-test-base.h:222] got call: sleep_micros: 510000
I20260924 14:27:33.677505 21784 rpc-test-base.h:595] status: Aborted: Sleep RPC to unix:/tmp/dist-test-task6f5oOL/test-tmp/rpc-test-ddff1512b4004267b043ed9cb4afeaea.sock is cancelled in state SENT, seconds elapsed: 0.000711876
I20260924 14:27:33.677877 22212 rpc-test-base.h:222] got call: sleep_micros: 510000
I20260924 14:27:33.855988 21784 rpc-test-base.h:595] status: Aborted: Sleep RPC to unix:/tmp/dist-test-task6f5oOL/test-tmp/rpc-test-ddff1512b4004267b043ed9cb4afeaea.sock is cancelled in state SENT, seconds elapsed: 0.000736627
W20260924 14:27:33.867100 22214 rpcz_store.cc:267] Call kudu.rpc.GenericCalculatorService.Sleep from unix:<unnamed> (request call id 11) took 10 ms (client timeout 10 ms). Trace:
W20260924 14:27:33.867378 22214 rpcz_store.cc:269] 0924 14:27:33.856133 (+     0us) service_pool.cc:170] Inserting onto call queue
0924 14:27:33.866784 (+ 10651us) service_pool.cc:214] Skipping call since client already timed out
0924 14:27:33.866916 (+   132us) inbound_call.cc:173] Queueing failure response
Metrics: {}
I20260924 14:27:33.867928 22214 rpc-test-base.h:222] got call: sleep_micros: 1500000
W20260924 14:27:34.012498 22213 rpcz_store.cc:267] Call kudu.rpc.GenericCalculatorService.Sleep from unix:<unnamed> (request call id 3) took 510 ms (client timeout 10 ms). Trace:
W20260924 14:27:34.012852 22213 rpcz_store.cc:269] 0924 14:27:33.501698 (+     0us) service_pool.cc:170] Inserting onto call queue
0924 14:27:33.501809 (+   111us) service_pool.cc:227] Handling call
0924 14:27:34.012416 (+510607us) inbound_call.cc:173] Queueing success response
Metrics: {}
W20260924 14:27:34.188493 22212 rpcz_store.cc:267] Call kudu.rpc.GenericCalculatorService.Sleep from unix:<unnamed> (request call id 7) took 510 ms (client timeout 10 ms). Trace:
W20260924 14:27:34.188858 22212 rpcz_store.cc:269] 0924 14:27:33.677673 (+     0us) service_pool.cc:170] Inserting onto call queue
0924 14:27:33.677821 (+   148us) service_pool.cc:227] Handling call
0924 14:27:34.188416 (+510595us) inbound_call.cc:173] Queueing success response
Metrics: {}
I20260924 14:27:34.858093 21784 rpc-test-base.h:595] status: Timed out: Sleep RPC to unix:/tmp/dist-test-task6f5oOL/test-tmp/rpc-test-ddff1512b4004267b043ed9cb4afeaea.sock timed out after 1.000s (SENT), seconds elapsed: 1.00165
I20260924 14:27:34.860164 22212 rpc-test-base.h:222] got call: sleep_micros: 1500000
W20260924 14:27:35.368639 22214 rpcz_store.cc:267] Call kudu.rpc.GenericCalculatorService.Sleep from unix:<unnamed> (request call id 12) took 1511 ms (client timeout 1000 ms). Trace:
W20260924 14:27:35.368989 22214 rpcz_store.cc:269] 0924 14:27:33.857082 (+     0us) service_pool.cc:170] Inserting onto call queue
0924 14:27:33.867888 (+ 10806us) service_pool.cc:227] Handling call
0924 14:27:35.368476 (+1500588us) inbound_call.cc:173] Queueing success response
Metrics: {}
I20260924 14:27:35.860766 21784 rpc-test-base.h:595] status: Timed out: Sleep RPC to unix:/tmp/dist-test-task6f5oOL/test-tmp/rpc-test-ddff1512b4004267b043ed9cb4afeaea.sock timed out after 1.000s (SENT), seconds elapsed: 1.0022
W20260924 14:27:35.862391 22207 messenger.cc:357] Unable to handle RPC call: Not implemented: call requires unsupported application feature flags: 99, 1
W20260924 14:27:35.863965 22207 messenger.cc:357] Unable to handle RPC call: Not implemented: call requires unsupported application feature flags: 99, 1
W20260924 14:27:36.081751 22207 connection.cc:196] Error closing socket: Network error: TlsSocket::Close: Broken pipe
W20260924 14:27:36.360818 22212 rpcz_store.cc:267] Call kudu.rpc.GenericCalculatorService.Sleep from unix:<unnamed> (request call id 13) took 1501 ms (client timeout 1000 ms). Trace:
W20260924 14:27:36.361128 22212 rpcz_store.cc:269] 0924 14:27:34.859832 (+     0us) service_pool.cc:170] Inserting onto call queue
0924 14:27:34.860044 (+   212us) service_pool.cc:227] Handling call
0924 14:27:36.360760 (+1500716us) inbound_call.cc:173] Queueing success response
Metrics: {}
W20260924 14:27:36.361747 22207 connection.cc:441] server connection from unix:<unnamed> torn down before Call kudu.rpc.GenericCalculatorService.Sleep from unix:<unnamed> (request call id 13) could send its response
[       OK ] Parameters/TestRpc.TestCancellation/SSL_UnixSocket (3218 ms)
[ RUN      ] Parameters/TestRpc.TestCancellationMultiThreads/SSL_UnixSocket
I20260924 14:27:36.402274 22236 acceptor_pool.cc:254] collecting diagnostics on the listening RPC socket unix:/tmp/dist-test-task6f5oOL/test-tmp/rpc-test-9d99f7efc16a469ebe5fa8f8e0707452.sock every 8 connection(s)
I20260924 14:27:36.403180 22237 acceptor_pool.cc:254] collecting diagnostics on the listening RPC socket unix:/tmp/dist-test-task6f5oOL/test-tmp/rpc-test-9d99f7efc16a469ebe5fa8f8e0707452.sock every 8 connection(s)
I20260924 14:27:36.406356 21784 rpc-test.cc:1808] Connecting to unix:/tmp/dist-test-task6f5oOL/test-tmp/rpc-test-9d99f7efc16a469ebe5fa8f8e0707452.sock
I20260924 14:27:36.562417 22250 test_util.cc:268] Using random seed: 1723472516
I20260924 14:27:36.563541 22251 test_util.cc:268] Using random seed: 1723473724
I20260924 14:27:36.565225 22252 test_util.cc:268] Using random seed: 1723475286
I20260924 14:27:36.566563 22253 test_util.cc:268] Using random seed: 1723476724
I20260924 14:27:36.568308 22254 test_util.cc:268] Using random seed: 1723478331
I20260924 14:27:36.570127 22255 test_util.cc:268] Using random seed: 1723480145
I20260924 14:27:36.572378 22256 test_util.cc:268] Using random seed: 1723482388
I20260924 14:27:36.574899 22257 test_util.cc:268] Using random seed: 1723484914
I20260924 14:27:36.578215 22258 test_util.cc:268] Using random seed: 1723488283
I20260924 14:27:36.580013 22259 test_util.cc:268] Using random seed: 1723490024
I20260924 14:27:36.582944 22260 test_util.cc:268] Using random seed: 1723492964
I20260924 14:27:36.584815 22261 test_util.cc:268] Using random seed: 1723494838
I20260924 14:27:36.587025 22262 test_util.cc:268] Using random seed: 1723497011
I20260924 14:27:36.589591 22263 test_util.cc:268] Using random seed: 1723499589
I20260924 14:27:36.591394 22264 test_util.cc:268] Using random seed: 1723501437
I20260924 14:27:36.593740 22265 test_util.cc:268] Using random seed: 1723503707
I20260924 14:27:36.597072 22266 test_util.cc:268] Using random seed: 1723507022
I20260924 14:27:36.599380 22267 test_util.cc:268] Using random seed: 1723509419
I20260924 14:27:36.601703 22268 test_util.cc:268] Using random seed: 1723511656
I20260924 14:27:36.604552 22269 test_util.cc:268] Using random seed: 1723513998
I20260924 14:27:36.605952 22270 test_util.cc:268] Using random seed: 1723515951
I20260924 14:27:36.612949 22271 test_util.cc:268] Using random seed: 1723522970
I20260924 14:27:36.615484 22272 test_util.cc:268] Using random seed: 1723525518
I20260924 14:27:36.618009 22273 test_util.cc:268] Using random seed: 1723527943
I20260924 14:27:36.620121 22274 test_util.cc:268] Using random seed: 1723530148
I20260924 14:27:36.627416 22275 test_util.cc:268] Using random seed: 1723537379
I20260924 14:27:36.631021 22276 test_util.cc:268] Using random seed: 1723540723
I20260924 14:27:36.635007 22277 test_util.cc:268] Using random seed: 1723544540
I20260924 14:27:36.636324 22278 test_util.cc:268] Using random seed: 1723546061
I20260924 14:27:36.638674 22279 test_util.cc:268] Using random seed: 1723548739
W20260924 14:27:56.640604 22233 connection.cc:196] Error closing socket: Network error: TlsSocket::Close: Broken pipe
[       OK ] Parameters/TestRpc.TestCancellationMultiThreads/SSL_UnixSocket (20290 ms)
[ RUN      ] Parameters/TestRpc.TestCallId/SSL_UnixSocket
I20260924 14:27:56.694038 22293 acceptor_pool.cc:254] collecting diagnostics on the listening RPC socket unix:/tmp/dist-test-task6f5oOL/test-tmp/rpc-test-2d9b1e8ac82544679424f507040e1ab0.sock every 8 connection(s)
I20260924 14:27:56.695096 22294 acceptor_pool.cc:254] collecting diagnostics on the listening RPC socket unix:/tmp/dist-test-task6f5oOL/test-tmp/rpc-test-2d9b1e8ac82544679424f507040e1ab0.sock every 8 connection(s)
W20260924 14:27:56.749924 22290 connection.cc:196] Error closing socket: Network error: TlsSocket::Close: Broken pipe
[       OK ] Parameters/TestRpc.TestCallId/SSL_UnixSocket (96 ms)
[----------] 20 tests from Parameters/TestRpc (38969 ms total)

[----------] Global test environment tear-down
[==========] 21 tests from 2 test suites ran. (42221 ms total)
[  PASSED  ] 20 tests.
[  FAILED  ] 1 test, listed below:
[  FAILED  ] Parameters/TestRpc.TestCallWithChainCertAndRootCA/SSL_UnixSocket, where GetParam() = (true, true)

 1 FAILED TEST
I20260924 14:27:56.777196 21784 logging.cc:424] LogThrottler /data0/somelongdirectorytoavoidrpathissues/src/kudu/src/kudu/rpc/acceptor_pool.cc:285: suppressed but not reported on 3 messages since previous log ~34 seconds ago