Diagnosed failure

Parameters/TestRpc.TestCallWithChainCertAndChainCA/SSL_UnixSocket: /data0/somelongdirectorytoavoidrpathissues/src/kudu/src/kudu/rpc/rpc-test.cc:270: Failure
Failed
Bad status: Runtime error: could not verify certificate chain (error with cert: subject=CN = localhost, ST = sadfjas, C = AS, emailAddress = sdflkdsajf, O = lskdfjlsad, OU = sldfkja, issuer=C = AS, ST = ASDfkjdhf, L = lskdjf, O = saldfja, OU = skdjf, CN = localhost, emailAddress = sadjflkadsj): : certificate has expired
Google Test trace:
/data0/somelongdirectorytoavoidrpathissues/src/kudu/src/kudu/rpc/rpc-test.cc:267: Connecting to unix:/tmp/dist-test-task4sSzmK/test-tmp/rpc-test-9278b836297b4cd5b5b0f20f90e5ae97.sock
I20260926 07:29:31.363267 21092 test_util.cc:175] -----------------------------------------------
I20260926 07:29:31.363389 21092 test_util.cc:176] Had fatal failures, leaving test files at /tmp/dist-test-task4sSzmK/test-tmp/rpc-test.6.Parameters_TestRpc.TestCallWithChainCertAndChainCA_SSL_UnixSocket.1790407771235465-21092-0

Full log

Note: This is test shard 7 of 8.
[==========] Running 21 tests from 2 test suites.
[----------] Global test environment set-up.
[----------] 20 tests from Parameters/TestRpc
[ RUN      ] Parameters/TestRpc.TestMessengerCreateDestroy/SSL_UnixSocket
WARNING: Logging before InitGoogleLogging() is written to STDERR
I20260926 07:29:31.285105 21092 rpc-test.cc:169] started messenger TestCreateDestroy
[       OK ] Parameters/TestRpc.TestMessengerCreateDestroy/SSL_UnixSocket (33 ms)
[ RUN      ] Parameters/TestRpc.TestNegotiationDeadlock/SSL_UnixSocket
I20260926 07:29:31.304469 21112 acceptor_pool.cc:254] collecting diagnostics on the listening RPC socket unix:/tmp/dist-test-task4sSzmK/test-tmp/rpc-test-5d561780f74d453ca8c08ff2b1f91be2.sock every 8 connection(s)
I20260926 07:29:31.304734 21113 acceptor_pool.cc:254] collecting diagnostics on the listening RPC socket unix:/tmp/dist-test-task4sSzmK/test-tmp/rpc-test-5d561780f74d453ca8c08ff2b1f91be2.sock every 8 connection(s)
[       OK ] Parameters/TestRpc.TestNegotiationDeadlock/SSL_UnixSocket (35 ms)
[ RUN      ] Parameters/TestRpc.TestCallWithChainCertAndChainCA/SSL_UnixSocket
I20260926 07:29:31.351207 21128 acceptor_pool.cc:254] collecting diagnostics on the listening RPC socket unix:/tmp/dist-test-task4sSzmK/test-tmp/rpc-test-9278b836297b4cd5b5b0f20f90e5ae97.sock every 8 connection(s)
I20260926 07:29:31.351537 21129 acceptor_pool.cc:254] collecting diagnostics on the listening RPC socket unix:/tmp/dist-test-task4sSzmK/test-tmp/rpc-test-9278b836297b4cd5b5b0f20f90e5ae97.sock every 8 connection(s)
/data0/somelongdirectorytoavoidrpathissues/src/kudu/src/kudu/rpc/rpc-test.cc:270: Failure
Failed
Bad status: Runtime error: could not verify certificate chain (error with cert: subject=CN = localhost, ST = sadfjas, C = AS, emailAddress = sdflkdsajf, O = lskdfjlsad, OU = sldfkja, issuer=C = AS, ST = ASDfkjdhf, L = lskdjf, O = saldfja, OU = skdjf, CN = localhost, emailAddress = sadjflkadsj): : certificate has expired
Google Test trace:
/data0/somelongdirectorytoavoidrpathissues/src/kudu/src/kudu/rpc/rpc-test.cc:267: Connecting to unix:/tmp/dist-test-task4sSzmK/test-tmp/rpc-test-9278b836297b4cd5b5b0f20f90e5ae97.sock
I20260926 07:29:31.363267 21092 test_util.cc:175] -----------------------------------------------
I20260926 07:29:31.363389 21092 test_util.cc:176] Had fatal failures, leaving test files at /tmp/dist-test-task4sSzmK/test-tmp/rpc-test.6.Parameters_TestRpc.TestCallWithChainCertAndChainCA_SSL_UnixSocket.1790407771235465-21092-0
[  FAILED  ] Parameters/TestRpc.TestCallWithChainCertAndChainCA/SSL_UnixSocket, where GetParam() = (true, true) (39 ms)
[ RUN      ] Parameters/TestRpc.TestCallWithPasswordProtectedKey/SSL_UnixSocket
I20260926 07:29:31.373884 21153 acceptor_pool.cc:254] collecting diagnostics on the listening RPC socket unix:/tmp/dist-test-task4sSzmK/test-tmp/rpc-test-1a6244618a024907b6240a81fcb865e8.sock every 8 connection(s)
I20260926 07:29:31.374217 21154 acceptor_pool.cc:254] collecting diagnostics on the listening RPC socket unix:/tmp/dist-test-task4sSzmK/test-tmp/rpc-test-1a6244618a024907b6240a81fcb865e8.sock every 8 connection(s)
W20260926 07:29:31.405575 21150 connection.cc:196] Error closing socket: Network error: TlsSocket::Close: Broken pipe
[       OK ] Parameters/TestRpc.TestCallWithPasswordProtectedKey/SSL_UnixSocket (46 ms)
[ RUN      ] Parameters/TestRpc.TestCallToBadServer/SSL_UnixSocket
I20260926 07:29:31.425315 21092 rpc-test.cc:394] Status: Network error: Client connection negotiation failed: client connection to 0.0.0.0:0: connect: Connection refused (error 111)
I20260926 07:29:31.426081 21092 rpc-test.cc:394] Status: Network error: Client connection negotiation failed: client connection to 0.0.0.0:0: connect: Connection refused (error 111)
I20260926 07:29:31.426753 21092 rpc-test.cc:394] Status: Network error: Client connection negotiation failed: client connection to 0.0.0.0:0: connect: Connection refused (error 111)
I20260926 07:29:31.427385 21092 rpc-test.cc:394] Status: Network error: Client connection negotiation failed: client connection to 0.0.0.0:0: connect: Connection refused (error 111)
I20260926 07:29:31.427939 21092 rpc-test.cc:394] Status: Network error: Client connection negotiation failed: client connection to 0.0.0.0:0: connect: Connection refused (error 111)
[       OK ] Parameters/TestRpc.TestCallToBadServer/SSL_UnixSocket (20 ms)
[ RUN      ] Parameters/TestRpc.TestWrongService/SSL_UnixSocket
I20260926 07:29:31.453187 21188 acceptor_pool.cc:254] collecting diagnostics on the listening RPC socket unix:/tmp/dist-test-task4sSzmK/test-tmp/rpc-test-c1b17945fa2843539dee8c78fe741ddb.sock every 8 connection(s)
I20260926 07:29:31.453451 21189 acceptor_pool.cc:254] collecting diagnostics on the listening RPC socket unix:/tmp/dist-test-task4sSzmK/test-tmp/rpc-test-c1b17945fa2843539dee8c78fe741ddb.sock every 8 connection(s)
I20260926 07:29:31.472113 21185 messenger.cc:345] service WrongServiceName not registered on TestServer
[       OK ] Parameters/TestRpc.TestWrongService/SSL_UnixSocket (47 ms)
[ RUN      ] Parameters/TestRpc.TestConnectionKeepalive/SSL_UnixSocket
I20260926 07:29:31.492200 21211 acceptor_pool.cc:254] collecting diagnostics on the listening RPC socket unix:/tmp/dist-test-task4sSzmK/test-tmp/rpc-test-9617b4a1edcd470fbe325cd472c91e17.sock every 8 connection(s)
I20260926 07:29:31.492487 21212 acceptor_pool.cc:254] collecting diagnostics on the listening RPC socket unix:/tmp/dist-test-task4sSzmK/test-tmp/rpc-test-9617b4a1edcd470fbe325cd472c91e17.sock every 8 connection(s)
I20260926 07:29:31.493484 21092 rpc-test.cc:488] Connecting to unix:/tmp/dist-test-task4sSzmK/test-tmp/rpc-test-9617b4a1edcd470fbe325cd472c91e17.sock
W20260926 07:29:31.979935 21224 connection.cc:196] Error closing socket: Network error: TlsSocket::Close: Broken pipe
[       OK ] Parameters/TestRpc.TestConnectionKeepalive/SSL_UnixSocket (1050 ms)
[ RUN      ] Parameters/TestRpc.TestClientConnectionMetrics/SSL_UnixSocket
I20260926 07:29:32.559458 21236 acceptor_pool.cc:254] collecting diagnostics on the listening RPC socket unix:/tmp/dist-test-task4sSzmK/test-tmp/rpc-test-acd9364c6d73454abd9bf15e30142007.sock every 8 connection(s)
I20260926 07:29:32.559712 21237 acceptor_pool.cc:254] collecting diagnostics on the listening RPC socket unix:/tmp/dist-test-task4sSzmK/test-tmp/rpc-test-acd9364c6d73454abd9bf15e30142007.sock every 8 connection(s)
I20260926 07:29:32.560755 21092 rpc-test.cc:569] Connecting to unix:/tmp/dist-test-task4sSzmK/test-tmp/rpc-test-acd9364c6d73454abd9bf15e30142007.sock
W20260926 07:29:54.450405 21233 connection.cc:196] Error closing socket: Network error: TlsSocket::Close: Broken pipe
[       OK ] Parameters/TestRpc.TestClientConnectionMetrics/SSL_UnixSocket (21931 ms)
[ RUN      ] Parameters/TestRpc.TestCredentialsPolicy/SSL_UnixSocket
I20260926 07:29:54.483693 21259 acceptor_pool.cc:254] collecting diagnostics on the listening RPC socket unix:/tmp/dist-test-task4sSzmK/test-tmp/rpc-test-7b0bcc63b4184d5d834efdb732e2297d.sock every 8 connection(s)
I20260926 07:29:54.483918 21260 acceptor_pool.cc:254] collecting diagnostics on the listening RPC socket unix:/tmp/dist-test-task4sSzmK/test-tmp/rpc-test-7b0bcc63b4184d5d834efdb732e2297d.sock every 8 connection(s)
I20260926 07:29:54.484905 21092 rpc-test.cc:700] Connecting to unix:/tmp/dist-test-task4sSzmK/test-tmp/rpc-test-7b0bcc63b4184d5d834efdb732e2297d.sock
W20260926 07:29:54.516104 21258 connection.cc:196] Error closing socket: Network error: TlsSocket::Close: Broken pipe
W20260926 07:29:54.524309 21258 connection.cc:196] Error closing socket: Network error: TlsSocket::Close: Broken pipe
[       OK ] Parameters/TestRpc.TestCredentialsPolicy/SSL_UnixSocket (68 ms)
[ RUN      ] Parameters/TestRpc.TestCallLongerThanKeepalive/SSL_UnixSocket
I20260926 07:29:54.553692 21284 acceptor_pool.cc:254] collecting diagnostics on the listening RPC socket unix:/tmp/dist-test-task4sSzmK/test-tmp/rpc-test-65ddd9550fe840ada648bc861f6ef3d3.sock every 8 connection(s)
I20260926 07:29:54.553931 21285 acceptor_pool.cc:254] collecting diagnostics on the listening RPC socket unix:/tmp/dist-test-task4sSzmK/test-tmp/rpc-test-65ddd9550fe840ada648bc861f6ef3d3.sock every 8 connection(s)
I20260926 07:29:54.572031 21288 rpc-test-base.h:222] got call: sleep_micros: 3000000 deferred: true
I20260926 07:29:57.574105 21288 rpcz_store.cc:275] Call kudu.rpc.GenericCalculatorService.Sleep from unix:<unnamed> (request call id 0) took 3002 ms. Trace:
I20260926 07:29:57.574263 21288 rpcz_store.cc:276] 0926 07:29:54.571880 (+     0us) service_pool.cc:170] Inserting onto call queue
0926 07:29:54.571974 (+    94us) service_pool.cc:227] Handling call
0926 07:29:57.574047 (+3002073us) inbound_call.cc:173] Queueing success response
Metrics: {}
W20260926 07:29:57.577629 21281 connection.cc:196] Error closing socket: Network error: TlsSocket::Close: Broken pipe
[       OK ] Parameters/TestRpc.TestCallLongerThanKeepalive/SSL_UnixSocket (3053 ms)
[ RUN      ] Parameters/TestRpc.TestRpcSidecar/SSL_UnixSocket
I20260926 07:29:57.634991 21309 acceptor_pool.cc:254] collecting diagnostics on the listening RPC socket unix:/tmp/dist-test-task4sSzmK/test-tmp/rpc-test-b0e2e1e1a0d34a3cb31a04517a81a116.sock every 8 connection(s)
I20260926 07:29:57.635205 21310 acceptor_pool.cc:254] collecting diagnostics on the listening RPC socket unix:/tmp/dist-test-task4sSzmK/test-tmp/rpc-test-b0e2e1e1a0d34a3cb31a04517a81a116.sock every 8 connection(s)
W20260926 07:29:57.723778 21306 connection.cc:196] Error closing socket: Network error: TlsSocket::Close: Broken pipe
[       OK ] Parameters/TestRpc.TestRpcSidecar/SSL_UnixSocket (145 ms)
[ RUN      ] Parameters/TestRpc.TestRpcSidecarLimits/SSL_UnixSocket
I20260926 07:29:59.837664 21334 acceptor_pool.cc:254] collecting diagnostics on the listening RPC socket unix:/tmp/dist-test-task4sSzmK/test-tmp/rpc-test-95c76bfbca014ef6819ddda386aa1675.sock every 8 connection(s)
I20260926 07:29:59.837920 21335 acceptor_pool.cc:254] collecting diagnostics on the listening RPC socket unix:/tmp/dist-test-task4sSzmK/test-tmp/rpc-test-95c76bfbca014ef6819ddda386aa1675.sock every 8 connection(s)
W20260926 07:29:59.850827 21092 serialization.cc:72] Serialized kudu.rpc_test.PushStringsRequestPB (2147483654 bytes) is larger than the maximum configured RPC message size (52428800 bytes). Sending anyway, but peer may reject the data.
W20260926 07:29:59.857152 21331 connection.cc:535] server connection from unix:<unnamed> recv error: Network error: RPC frame had a length of 2147483714, but we only support messages up to 52428800 bytes long.
W20260926 07:29:59.857277 21331 connection.cc:158] shutting down server connection from unix:<unnamed> with pending inbound data: 4/2147483714 bytes received; last active 0 ns ago: status Network error: RPC frame had a length of 2147483714, but we only support messages up to 52428800 bytes long.
W20260926 07:29:59.857795 21347 connection.cc:196] Error closing socket: Network error: TlsSocket::Close: Broken pipe
I20260926 07:29:59.872519 21359 acceptor_pool.cc:254] collecting diagnostics on the listening RPC socket unix:/tmp/dist-test-task4sSzmK/test-tmp/rpc-test-95c76bfbca014ef6819ddda386aa1675.sock every 8 connection(s)
I20260926 07:29:59.872856 21360 acceptor_pool.cc:254] collecting diagnostics on the listening RPC socket unix:/tmp/dist-test-task4sSzmK/test-tmp/rpc-test-95c76bfbca014ef6819ddda386aa1675.sock every 8 connection(s)
W20260926 07:30:05.733456 21356 connection.cc:577] server connection from unix:<unnamed>: received bad data: 'Corruption: Invalid packet: message had a length of 2147483710, but we only support messages up to 2147483647 bytes
'
W20260926 07:30:05.734162 21372 connection.cc:196] Error closing socket: Network error: TlsSocket::Close: Broken pipe
[       OK ] Parameters/TestRpc.TestRpcSidecarLimits/SSL_UnixSocket (8477 ms)
[ RUN      ] Parameters/TestRpc.TestCallTimeoutDoesntAffectNegotiation/SSL_UnixSocket
I20260926 07:30:06.228448 21384 acceptor_pool.cc:254] collecting diagnostics on the listening RPC socket unix:/tmp/dist-test-task4sSzmK/test-tmp/rpc-test-85c64b9a20dd452c9763ba52eb487c1d.sock every 8 connection(s)
I20260926 07:30:06.228765 21385 acceptor_pool.cc:254] collecting diagnostics on the listening RPC socket unix:/tmp/dist-test-task4sSzmK/test-tmp/rpc-test-85c64b9a20dd452c9763ba52eb487c1d.sock every 8 connection(s)
W20260926 07:30:06.240242 21380 negotiation.cc:266] Injecting 500ms delay in negotiation
I20260926 07:30:06.290750 21092 rpc-test-base.h:595] status: Timed out: connection negotiation to unix:/tmp/dist-test-task4sSzmK/test-tmp/rpc-test-85c64b9a20dd452c9763ba52eb487c1d.sock for RPC Sleep timed out after 0.050s (ON_OUTBOUND_QUEUE), seconds elapsed: 0.0511739
W20260926 07:30:06.747623 21381 connection.cc:196] Error closing socket: Network error: TlsSocket::Close: Broken pipe
[       OK ] Parameters/TestRpc.TestCallTimeoutDoesntAffectNegotiation/SSL_UnixSocket (546 ms)
[ RUN      ] Parameters/TestRpc.TestRpcHandlerLatencyMetric/SSL_UnixSocket
I20260926 07:30:06.768044 21409 acceptor_pool.cc:254] collecting diagnostics on the listening RPC socket unix:/tmp/dist-test-task4sSzmK/test-tmp/rpc-test-7a68204e48f344e1bc5c3b033c9b2a5b.sock every 8 connection(s)
I20260926 07:30:06.768299 21410 acceptor_pool.cc:254] collecting diagnostics on the listening RPC socket unix:/tmp/dist-test-task4sSzmK/test-tmp/rpc-test-7a68204e48f344e1bc5c3b033c9b2a5b.sock every 8 connection(s)
I20260926 07:30:06.811182 21092 rpc-test.cc:1236] Sleep() min lat: 20934
I20260926 07:30:06.811291 21092 rpc-test.cc:1237] Sleep() mean lat: 20934
I20260926 07:30:06.811333 21092 rpc-test.cc:1238] Sleep() max lat: 20934
I20260926 07:30:06.811357 21092 rpc-test.cc:1239] Sleep() #calls: 1
W20260926 07:30:06.812799 21406 connection.cc:196] Error closing socket: Network error: TlsSocket::Close: Broken pipe
[       OK ] Parameters/TestRpc.TestRpcHandlerLatencyMetric/SSL_UnixSocket (66 ms)
[ RUN      ] Parameters/TestRpc.TimedOutOnResponseMetricServiceQueue/SSL_UnixSocket
I20260926 07:30:06.850908 21435 acceptor_pool.cc:254] collecting diagnostics on the listening RPC socket unix:/tmp/dist-test-task4sSzmK/test-tmp/rpc-test-79368efb54244cd29b98b4da1674a670.sock every 8 connection(s)
I20260926 07:30:06.851168 21436 acceptor_pool.cc:254] collecting diagnostics on the listening RPC socket unix:/tmp/dist-test-task4sSzmK/test-tmp/rpc-test-79368efb54244cd29b98b4da1674a670.sock every 8 connection(s)
W20260926 07:30:06.927485 21437 rpcz_store.cc:267] Call kudu.rpc_test.CalculatorService.Sleep from unix:<unnamed> (request call id 2) took 20 ms (client timeout 20 ms). Trace:
W20260926 07:30:06.927721 21437 rpcz_store.cc:269] 0926 07:30:06.907070 (+     0us) service_pool.cc:170] Inserting onto call queue
0926 07:30:06.927403 (+ 20333us) service_pool.cc:214] Skipping call since client already timed out
0926 07:30:06.927467 (+    64us) inbound_call.cc:173] Queueing failure response
Metrics: {}
[       OK ] Parameters/TestRpc.TimedOutOnResponseMetricServiceQueue/SSL_UnixSocket (115 ms)
[ RUN      ] Parameters/TestRpc.RpcPendingConnectionsMetric/SSL_UnixSocket
I20260926 07:30:06.937994 21458 acceptor_pool.cc:254] collecting diagnostics on the listening RPC socket 0.0.0.0:46003 every 8 connection(s)
I20260926 07:30:06.938211 21459 acceptor_pool.cc:254] collecting diagnostics on the listening RPC socket 0.0.0.0:46003 every 8 connection(s)
W20260926 07:30:06.940346 21454 negotiation.cc:337] Failed RPC negotiation. Trace:
0926 07:30:06.939736 (+     0us) reactor.cc:625] Submitting negotiation task for server connection from 127.0.0.1:41442 (local address 127.0.0.1:46003)
0926 07:30:06.939901 (+   165us) server_negotiation.cc:206] Beginning negotiation
0926 07:30:06.939905 (+     4us) server_negotiation.cc:399] Waiting for connection header
0926 07:30:06.940042 (+   137us) negotiation.cc:327] Negotiation complete: Network error: Server connection negotiation failed: server connection from 127.0.0.1:41442: BlockingRecv error: recv got EOF from 127.0.0.1:41442 (error 108)
Metrics: {"server-negotiator.queue_time_us":56}
[       OK ] Parameters/TestRpc.RpcPendingConnectionsMetric/SSL_UnixSocket (20 ms)
[ RUN      ] Parameters/TestRpc.TestRpcContextClientDeadline/SSL_UnixSocket
I20260926 07:30:06.976501 21474 acceptor_pool.cc:254] collecting diagnostics on the listening RPC socket unix:/tmp/dist-test-task4sSzmK/test-tmp/rpc-test-86be50b30dd8489ab4427c1649e1dea7.sock every 8 connection(s)
I20260926 07:30:06.976761 21475 acceptor_pool.cc:254] collecting diagnostics on the listening RPC socket unix:/tmp/dist-test-task4sSzmK/test-tmp/rpc-test-86be50b30dd8489ab4427c1649e1dea7.sock every 8 connection(s)
[       OK ] Parameters/TestRpc.TestRpcContextClientDeadline/SSL_UnixSocket (80 ms)
[ RUN      ] Parameters/TestRpc.TestApplicationFeatureFlagUnsupportedServer/SSL_UnixSocket
I20260926 07:30:07.051726 21499 acceptor_pool.cc:254] collecting diagnostics on the listening RPC socket unix:/tmp/dist-test-task4sSzmK/test-tmp/rpc-test-ee0f814b011341eca12d6e9af93b08bb.sock every 8 connection(s)
I20260926 07:30:07.051986 21500 acceptor_pool.cc:254] collecting diagnostics on the listening RPC socket unix:/tmp/dist-test-task4sSzmK/test-tmp/rpc-test-ee0f814b011341eca12d6e9af93b08bb.sock every 8 connection(s)
W20260926 07:30:07.067516 21496 connection.cc:196] Error closing socket: Network error: TlsSocket::Close: Broken pipe
[       OK ] Parameters/TestRpc.TestApplicationFeatureFlagUnsupportedServer/SSL_UnixSocket (37 ms)
[ RUN      ] Parameters/TestRpc.TestCancellationAsync/SSL_UnixSocket
I20260926 07:30:07.093259 21524 acceptor_pool.cc:254] collecting diagnostics on the listening RPC socket unix:/tmp/dist-test-task4sSzmK/test-tmp/rpc-test-2cfc0a2498d648c8aeb1a89daee9326a.sock every 8 connection(s)
I20260926 07:30:07.093482 21525 acceptor_pool.cc:254] collecting diagnostics on the listening RPC socket unix:/tmp/dist-test-task4sSzmK/test-tmp/rpc-test-2cfc0a2498d648c8aeb1a89daee9326a.sock every 8 connection(s)
I20260926 07:30:07.094383 21092 rpc-test.cc:1716] Connecting to unix:/tmp/dist-test-task4sSzmK/test-tmp/rpc-test-2cfc0a2498d648c8aeb1a89daee9326a.sock
I20260926 07:30:07.109592 21092 test_util.cc:268] Using random seed: -849835580
I20260926 07:30:07.145071 21528 rpc-test-base.h:240] got call: sleep_micros: 500 pattern: 4294967295 num_repetitions: 2097152 sidecar_idx: 0
I20260926 07:30:07.167034 21527 rpc-test-base.h:240] got call: sleep_micros: 500 pattern: 4294967295 num_repetitions: 2097152 sidecar_idx: 0
I20260926 07:30:07.200856 21528 rpc-test-base.h:240] got call: sleep_micros: 500 pattern: 4294967295 num_repetitions: 2097152 sidecar_idx: 0
I20260926 07:30:07.229177 21527 rpc-test-base.h:240] got call: sleep_micros: 500 pattern: 4294967295 num_repetitions: 2097152 sidecar_idx: 0
I20260926 07:30:07.258111 21526 rpc-test-base.h:240] got call: sleep_micros: 500 pattern: 4294967295 num_repetitions: 2097152 sidecar_idx: 0
I20260926 07:30:07.286576 21527 rpc-test-base.h:240] got call: sleep_micros: 500 pattern: 4294967295 num_repetitions: 2097152 sidecar_idx: 0
I20260926 07:30:07.315984 21526 rpc-test-base.h:240] got call: sleep_micros: 500 pattern: 4294967295 num_repetitions: 2097152 sidecar_idx: 0
W20260926 07:30:07.318121 21521 connection.cc:196] Error closing socket: Network error: TlsSocket::Close: Broken pipe
W20260926 07:30:07.333421 21521 connection.cc:441] server connection from unix:<unnamed> torn down before Call kudu.rpc.GenericCalculatorService.SleepWithSidecar from unix:<unnamed> (request call id 8) could send its response
W20260926 07:30:07.349713 21521 connection.cc:441] server connection from unix:<unnamed> torn down before Call kudu.rpc.GenericCalculatorService.SleepWithSidecar from unix:<unnamed> (request call id 9) could send its response
[       OK ] Parameters/TestRpc.TestCancellationAsync/SSL_UnixSocket (281 ms)
[ RUN      ] Parameters/TestRpc.TestPerformanceBySocketType/SSL_UnixSocket
I20260926 07:30:07.372845 21549 acceptor_pool.cc:254] collecting diagnostics on the listening RPC socket unix:/tmp/dist-test-task4sSzmK/test-tmp/rpc-test-743d0b89c7df46e8bee386d955b9a439.sock every 8 connection(s)
I20260926 07:30:07.373055 21550 acceptor_pool.cc:254] collecting diagnostics on the listening RPC socket unix:/tmp/dist-test-task4sSzmK/test-tmp/rpc-test-743d0b89c7df46e8bee386d955b9a439.sock every 8 connection(s)
I20260926 07:30:07.373966 21092 rpc-test.cc:1846] Connecting to unix:/tmp/dist-test-task4sSzmK/test-tmp/rpc-test-743d0b89c7df46e8bee386d955b9a439.sock
I20260926 07:30:10.661396 21092 rpc-test.cc:1859] Sending 1024MB via ssl-enabled unix socket: real 3.280s	user 3.119s	sys 2.431s
I20260926 07:30:14.011889 21092 rpc-test.cc:1859] Sending 1024MB via ssl-enabled unix socket: real 3.350s	user 3.352s	sys 2.355s
I20260926 07:30:17.256052 21092 rpc-test.cc:1859] Sending 1024MB via ssl-enabled unix socket: real 3.244s	user 3.127s	sys 2.352s
I20260926 07:30:20.537177 21092 rpc-test.cc:1859] Sending 1024MB via ssl-enabled unix socket: real 3.281s	user 3.120s	sys 2.397s
I20260926 07:30:23.814209 21092 rpc-test.cc:1859] Sending 1024MB via ssl-enabled unix socket: real 3.277s	user 3.219s	sys 2.332s
W20260926 07:30:23.815358 21546 connection.cc:196] Error closing socket: Network error: TlsSocket::Close: Broken pipe
[       OK ] Parameters/TestRpc.TestPerformanceBySocketType/SSL_UnixSocket (16469 ms)
[----------] 20 tests from Parameters/TestRpc (52567 ms total)

[----------] 1 test from Parameters/TestRpcSocketTxRxQueue
[ RUN      ] Parameters/TestRpcSocketTxRxQueue.AcceptorRxQueueSizeMetric/0
I20260926 07:30:23.835319 21574 acceptor_pool.cc:254] collecting diagnostics on the listening RPC socket 0.0.0.0:35655 every 1 connection(s)
I20260926 07:30:23.835623 21575 acceptor_pool.cc:254] collecting diagnostics on the listening RPC socket 0.0.0.0:35655 every 1 connection(s)
W20260926 07:30:23.837384 21570 negotiation.cc:337] Failed RPC negotiation. Trace:
0926 07:30:23.836974 (+     0us) reactor.cc:625] Submitting negotiation task for server connection from 127.0.0.1:59440 (local address 127.0.0.1:35655)
0926 07:30:23.837126 (+   152us) server_negotiation.cc:206] Beginning negotiation
0926 07:30:23.837131 (+     5us) server_negotiation.cc:399] Waiting for connection header
0926 07:30:23.837264 (+   133us) negotiation.cc:327] Negotiation complete: Network error: Server connection negotiation failed: server connection from 127.0.0.1:59440: BlockingRecv error: recv got EOF from 127.0.0.1:59440 (error 108)
Metrics: {"server-negotiator.queue_time_us":51}
[       OK ] Parameters/TestRpcSocketTxRxQueue.AcceptorRxQueueSizeMetric/0 (18 ms)
[----------] 1 test from Parameters/TestRpcSocketTxRxQueue (18 ms total)

[----------] Global test environment tear-down
[==========] 21 tests from 2 test suites ran. (52586 ms total)
[  PASSED  ] 20 tests.
[  FAILED  ] 1 test, listed below:
[  FAILED  ] Parameters/TestRpc.TestCallWithChainCertAndChainCA/SSL_UnixSocket, where GetParam() = (true, true)

 1 FAILED TEST