Diagnosed failure
Parameters/TestRpc.TestCallWithChainCertAndChainCA/SSL_UnixSocket: /data0/somelongdirectorytoavoidrpathissues/src/kudu/src/kudu/rpc/rpc-test.cc:270: Failure
Failed
Bad status: Runtime error: could not verify certificate chain (error with cert: subject=CN = localhost, ST = sadfjas, C = AS, emailAddress = sdflkdsajf, O = lskdfjlsad, OU = sldfkja, issuer=C = AS, ST = ASDfkjdhf, L = lskdjf, O = saldfja, OU = skdjf, CN = localhost, emailAddress = sadjflkadsj): : certificate has expired
Google Test trace:
/data0/somelongdirectorytoavoidrpathissues/src/kudu/src/kudu/rpc/rpc-test.cc:267: Connecting to unix:/tmp/dist-test-taskKC2Tri/test-tmp/rpc-test-7dda85ffdbac4636a9e7ffb6938cc02c.sock
I20260925 19:30:04.909554 390 test_util.cc:175] -----------------------------------------------
I20260925 19:30:04.909725 390 test_util.cc:176] Had fatal failures, leaving test files at /tmp/dist-test-taskKC2Tri/test-tmp/rpc-test.6.Parameters_TestRpc.TestCallWithChainCertAndChainCA_SSL_UnixSocket.1790364603515742-390-0
Full log
Note: This is test shard 7 of 8.
[==========] Running 21 tests from 2 test suites.
[----------] Global test environment set-up.
[----------] 20 tests from Parameters/TestRpc
[ RUN ] Parameters/TestRpc.TestMessengerCreateDestroy/SSL_UnixSocket
WARNING: Logging before InitGoogleLogging() is written to STDERR
I20260925 19:30:03.613219 390 rpc-test.cc:169] started messenger TestCreateDestroy
[ OK ] Parameters/TestRpc.TestMessengerCreateDestroy/SSL_UnixSocket (1204 ms)
[ RUN ] Parameters/TestRpc.TestNegotiationDeadlock/SSL_UnixSocket
I20260925 19:30:04.795681 412 acceptor_pool.cc:254] collecting diagnostics on the listening RPC socket unix:/tmp/dist-test-taskKC2Tri/test-tmp/rpc-test-e5cf7e7f11564a8893108256cfd6d539.sock every 8 connection(s)
I20260925 19:30:04.797070 413 acceptor_pool.cc:254] collecting diagnostics on the listening RPC socket unix:/tmp/dist-test-taskKC2Tri/test-tmp/rpc-test-e5cf7e7f11564a8893108256cfd6d539.sock every 8 connection(s)
[ OK ] Parameters/TestRpc.TestNegotiationDeadlock/SSL_UnixSocket (76 ms)
[ RUN ] Parameters/TestRpc.TestCallWithChainCertAndChainCA/SSL_UnixSocket
I20260925 19:30:04.876998 428 acceptor_pool.cc:254] collecting diagnostics on the listening RPC socket unix:/tmp/dist-test-taskKC2Tri/test-tmp/rpc-test-7dda85ffdbac4636a9e7ffb6938cc02c.sock every 8 connection(s)
I20260925 19:30:04.879498 429 acceptor_pool.cc:254] collecting diagnostics on the listening RPC socket unix:/tmp/dist-test-taskKC2Tri/test-tmp/rpc-test-7dda85ffdbac4636a9e7ffb6938cc02c.sock every 8 connection(s)
/data0/somelongdirectorytoavoidrpathissues/src/kudu/src/kudu/rpc/rpc-test.cc:270: Failure
Failed
Bad status: Runtime error: could not verify certificate chain (error with cert: subject=CN = localhost, ST = sadfjas, C = AS, emailAddress = sdflkdsajf, O = lskdfjlsad, OU = sldfkja, issuer=C = AS, ST = ASDfkjdhf, L = lskdjf, O = saldfja, OU = skdjf, CN = localhost, emailAddress = sadjflkadsj): : certificate has expired
Google Test trace:
/data0/somelongdirectorytoavoidrpathissues/src/kudu/src/kudu/rpc/rpc-test.cc:267: Connecting to unix:/tmp/dist-test-taskKC2Tri/test-tmp/rpc-test-7dda85ffdbac4636a9e7ffb6938cc02c.sock
I20260925 19:30:04.909554 390 test_util.cc:175] -----------------------------------------------
I20260925 19:30:04.909725 390 test_util.cc:176] Had fatal failures, leaving test files at /tmp/dist-test-taskKC2Tri/test-tmp/rpc-test.6.Parameters_TestRpc.TestCallWithChainCertAndChainCA_SSL_UnixSocket.1790364603515742-390-0
[ FAILED ] Parameters/TestRpc.TestCallWithChainCertAndChainCA/SSL_UnixSocket, where GetParam() = (true, true) (62 ms)
[ RUN ] Parameters/TestRpc.TestCallWithPasswordProtectedKey/SSL_UnixSocket
I20260925 19:30:04.948916 453 acceptor_pool.cc:254] collecting diagnostics on the listening RPC socket unix:/tmp/dist-test-taskKC2Tri/test-tmp/rpc-test-64acaf5bc4cb42eeaae70dfa28323562.sock every 8 connection(s)
I20260925 19:30:04.949652 454 acceptor_pool.cc:254] collecting diagnostics on the listening RPC socket unix:/tmp/dist-test-taskKC2Tri/test-tmp/rpc-test-64acaf5bc4cb42eeaae70dfa28323562.sock every 8 connection(s)
W20260925 19:30:04.996640 450 connection.cc:196] Error closing socket: Network error: TlsSocket::Close: Broken pipe
[ OK ] Parameters/TestRpc.TestCallWithPasswordProtectedKey/SSL_UnixSocket (93 ms)
[ RUN ] Parameters/TestRpc.TestCallToBadServer/SSL_UnixSocket
I20260925 19:30:05.027693 390 rpc-test.cc:394] Status: Network error: Client connection negotiation failed: client connection to 0.0.0.0:0: connect: Connection refused (error 111)
I20260925 19:30:05.029053 390 rpc-test.cc:394] Status: Network error: Client connection negotiation failed: client connection to 0.0.0.0:0: connect: Connection refused (error 111)
I20260925 19:30:05.030470 390 rpc-test.cc:394] Status: Network error: Client connection negotiation failed: client connection to 0.0.0.0:0: connect: Connection refused (error 111)
I20260925 19:30:05.031662 390 rpc-test.cc:394] Status: Network error: Client connection negotiation failed: client connection to 0.0.0.0:0: connect: Connection refused (error 111)
I20260925 19:30:05.032869 390 rpc-test.cc:394] Status: Network error: Client connection negotiation failed: client connection to 0.0.0.0:0: connect: Connection refused (error 111)
[ OK ] Parameters/TestRpc.TestCallToBadServer/SSL_UnixSocket (32 ms)
[ RUN ] Parameters/TestRpc.TestWrongService/SSL_UnixSocket
I20260925 19:30:05.063967 488 acceptor_pool.cc:254] collecting diagnostics on the listening RPC socket unix:/tmp/dist-test-taskKC2Tri/test-tmp/rpc-test-831dee79685b4eb3b2acb796ad06729a.sock every 8 connection(s)
I20260925 19:30:05.064847 489 acceptor_pool.cc:254] collecting diagnostics on the listening RPC socket unix:/tmp/dist-test-taskKC2Tri/test-tmp/rpc-test-831dee79685b4eb3b2acb796ad06729a.sock every 8 connection(s)
I20260925 19:30:05.121004 485 messenger.cc:345] service WrongServiceName not registered on TestServer
W20260925 19:30:05.124099 485 connection.cc:196] Error closing socket: Network error: TlsSocket::Close: Broken pipe
[ OK ] Parameters/TestRpc.TestWrongService/SSL_UnixSocket (93 ms)
[ RUN ] Parameters/TestRpc.TestConnectionKeepalive/SSL_UnixSocket
I20260925 19:30:05.145339 511 acceptor_pool.cc:254] collecting diagnostics on the listening RPC socket unix:/tmp/dist-test-taskKC2Tri/test-tmp/rpc-test-d0f88662cff545c7b25b2bd0cdb6f62a.sock every 8 connection(s)
I20260925 19:30:05.146078 512 acceptor_pool.cc:254] collecting diagnostics on the listening RPC socket unix:/tmp/dist-test-taskKC2Tri/test-tmp/rpc-test-d0f88662cff545c7b25b2bd0cdb6f62a.sock every 8 connection(s)
I20260925 19:30:05.149221 390 rpc-test.cc:488] Connecting to unix:/tmp/dist-test-taskKC2Tri/test-tmp/rpc-test-d0f88662cff545c7b25b2bd0cdb6f62a.sock
W20260925 19:30:05.632105 524 connection.cc:196] Error closing socket: Network error: TlsSocket::Close: Broken pipe
[ OK ] Parameters/TestRpc.TestConnectionKeepalive/SSL_UnixSocket (1064 ms)
[ RUN ] Parameters/TestRpc.TestClientConnectionMetrics/SSL_UnixSocket
I20260925 19:30:06.249147 536 acceptor_pool.cc:254] collecting diagnostics on the listening RPC socket unix:/tmp/dist-test-taskKC2Tri/test-tmp/rpc-test-e577825952bb4433941eb85af1c7fd78.sock every 8 connection(s)
I20260925 19:30:06.249922 537 acceptor_pool.cc:254] collecting diagnostics on the listening RPC socket unix:/tmp/dist-test-taskKC2Tri/test-tmp/rpc-test-e577825952bb4433941eb85af1c7fd78.sock every 8 connection(s)
I20260925 19:30:06.253010 390 rpc-test.cc:569] Connecting to unix:/tmp/dist-test-taskKC2Tri/test-tmp/rpc-test-e577825952bb4433941eb85af1c7fd78.sock
W20260925 19:32:22.433611 533 connection.cc:196] Error closing socket: Network error: TlsSocket::Close: Broken pipe
[ OK ] Parameters/TestRpc.TestClientConnectionMetrics/SSL_UnixSocket (136248 ms)
[ RUN ] Parameters/TestRpc.TestCredentialsPolicy/SSL_UnixSocket
I20260925 19:32:22.468748 572 acceptor_pool.cc:254] collecting diagnostics on the listening RPC socket unix:/tmp/dist-test-taskKC2Tri/test-tmp/rpc-test-a2572b693a0b4d7ba85f17e7426221fd.sock every 8 connection(s)
I20260925 19:32:22.469637 573 acceptor_pool.cc:254] collecting diagnostics on the listening RPC socket unix:/tmp/dist-test-taskKC2Tri/test-tmp/rpc-test-a2572b693a0b4d7ba85f17e7426221fd.sock every 8 connection(s)
I20260925 19:32:22.472841 390 rpc-test.cc:700] Connecting to unix:/tmp/dist-test-taskKC2Tri/test-tmp/rpc-test-a2572b693a0b4d7ba85f17e7426221fd.sock
W20260925 19:32:22.509815 571 connection.cc:196] Error closing socket: Network error: TlsSocket::Close: Broken pipe
W20260925 19:32:22.524164 571 connection.cc:196] Error closing socket: Network error: TlsSocket::Close: Broken pipe
[ OK ] Parameters/TestRpc.TestCredentialsPolicy/SSL_UnixSocket (90 ms)
[ RUN ] Parameters/TestRpc.TestCallLongerThanKeepalive/SSL_UnixSocket
I20260925 19:32:22.556263 597 acceptor_pool.cc:254] collecting diagnostics on the listening RPC socket unix:/tmp/dist-test-taskKC2Tri/test-tmp/rpc-test-d7266992f4794a4684d66823ea74578b.sock every 8 connection(s)
I20260925 19:32:22.557093 598 acceptor_pool.cc:254] collecting diagnostics on the listening RPC socket unix:/tmp/dist-test-taskKC2Tri/test-tmp/rpc-test-d7266992f4794a4684d66823ea74578b.sock every 8 connection(s)
I20260925 19:32:22.595824 601 rpc-test-base.h:222] got call: sleep_micros: 3000000 deferred: true
I20260925 19:32:25.600209 601 rpcz_store.cc:275] Call kudu.rpc.GenericCalculatorService.Sleep from unix:<unnamed> (request call id 0) took 3004 ms. Trace:
I20260925 19:32:25.600674 601 rpcz_store.cc:276] 0925 19:32:22.595648 (+ 0us) service_pool.cc:170] Inserting onto call queue
0925 19:32:22.595764 (+ 116us) service_pool.cc:227] Handling call
0925 19:32:25.600034 (+3004270us) inbound_call.cc:173] Queueing success response
Metrics: {}
[ OK ] Parameters/TestRpc.TestCallLongerThanKeepalive/SSL_UnixSocket (3080 ms)
[ RUN ] Parameters/TestRpc.TestRpcSidecar/SSL_UnixSocket
I20260925 19:32:25.629510 623 acceptor_pool.cc:254] collecting diagnostics on the listening RPC socket unix:/tmp/dist-test-taskKC2Tri/test-tmp/rpc-test-068b5bad92e347e28f2b93e43880711e.sock every 8 connection(s)
I20260925 19:32:25.630330 624 acceptor_pool.cc:254] collecting diagnostics on the listening RPC socket unix:/tmp/dist-test-taskKC2Tri/test-tmp/rpc-test-068b5bad92e347e28f2b93e43880711e.sock every 8 connection(s)
W20260925 19:32:26.153779 620 connection.cc:196] Error closing socket: Network error: TlsSocket::Close: Broken pipe
[ OK ] Parameters/TestRpc.TestRpcSidecar/SSL_UnixSocket (546 ms)
[ RUN ] Parameters/TestRpc.TestRpcSidecarLimits/SSL_UnixSocket
I20260925 19:32:42.733029 649 acceptor_pool.cc:254] collecting diagnostics on the listening RPC socket unix:/tmp/dist-test-taskKC2Tri/test-tmp/rpc-test-b577af3928ec4ff7a45211b93596d1ed.sock every 8 connection(s)
I20260925 19:32:42.733786 650 acceptor_pool.cc:254] collecting diagnostics on the listening RPC socket unix:/tmp/dist-test-taskKC2Tri/test-tmp/rpc-test-b577af3928ec4ff7a45211b93596d1ed.sock every 8 connection(s)
W20260925 19:32:42.762910 390 serialization.cc:72] Serialized kudu.rpc_test.PushStringsRequestPB (2147483654 bytes) is larger than the maximum configured RPC message size (52428800 bytes). Sending anyway, but peer may reject the data.
W20260925 19:32:42.773447 646 connection.cc:535] server connection from unix:<unnamed> recv error: Network error: RPC frame had a length of 2147483714, but we only support messages up to 52428800 bytes long.
W20260925 19:32:42.773768 646 connection.cc:158] shutting down server connection from unix:<unnamed> with pending inbound data: 4/2147483714 bytes received; last active 0 ns ago: status Network error: RPC frame had a length of 2147483714, but we only support messages up to 52428800 bytes long.
W20260925 19:32:42.774636 662 connection.cc:698] client connection to unix:/tmp/dist-test-taskKC2Tri/test-tmp/rpc-test-b577af3928ec4ff7a45211b93596d1ed.sock send error: Network error: failed to write to TLS socket: Broken pipe
W20260925 19:32:42.775271 662 connection.cc:196] Error closing socket: Network error: TlsSocket::Close: Success
[ OK ] Parameters/TestRpc.TestRpcSidecarLimits/SSL_UnixSocket (17432 ms)
[ RUN ] Parameters/TestRpc.TestCallTimeoutDoesntAffectNegotiation/SSL_UnixSocket
I20260925 19:32:43.617506 674 acceptor_pool.cc:254] collecting diagnostics on the listening RPC socket unix:/tmp/dist-test-taskKC2Tri/test-tmp/rpc-test-12d951e9d8774617a4794ac1134f152f.sock every 8 connection(s)
I20260925 19:32:43.618242 675 acceptor_pool.cc:254] collecting diagnostics on the listening RPC socket unix:/tmp/dist-test-taskKC2Tri/test-tmp/rpc-test-12d951e9d8774617a4794ac1134f152f.sock every 8 connection(s)
W20260925 19:32:43.642671 670 negotiation.cc:266] Injecting 500ms delay in negotiation
I20260925 19:32:43.693212 390 rpc-test-base.h:595] status: Timed out: connection negotiation to unix:/tmp/dist-test-taskKC2Tri/test-tmp/rpc-test-12d951e9d8774617a4794ac1134f152f.sock for RPC Sleep timed out after 0.050s (ON_OUTBOUND_QUEUE), seconds elapsed: 0.0514836
[ OK ] Parameters/TestRpc.TestCallTimeoutDoesntAffectNegotiation/SSL_UnixSocket (571 ms)
[ RUN ] Parameters/TestRpc.TestRpcHandlerLatencyMetric/SSL_UnixSocket
I20260925 19:32:44.201650 700 acceptor_pool.cc:254] collecting diagnostics on the listening RPC socket unix:/tmp/dist-test-taskKC2Tri/test-tmp/rpc-test-9e49dcd9dd7244b9ac7cbfc28085c498.sock every 8 connection(s)
I20260925 19:32:44.202414 701 acceptor_pool.cc:254] collecting diagnostics on the listening RPC socket unix:/tmp/dist-test-taskKC2Tri/test-tmp/rpc-test-9e49dcd9dd7244b9ac7cbfc28085c498.sock every 8 connection(s)
I20260925 19:32:44.258659 390 rpc-test.cc:1236] Sleep() min lat: 21579
I20260925 19:32:44.258868 390 rpc-test.cc:1237] Sleep() mean lat: 21579
I20260925 19:32:44.259063 390 rpc-test.cc:1238] Sleep() max lat: 21579
I20260925 19:32:44.259233 390 rpc-test.cc:1239] Sleep() #calls: 1
W20260925 19:32:44.265981 697 connection.cc:196] Error closing socket: Network error: TlsSocket::Close: Broken pipe
[ OK ] Parameters/TestRpc.TestRpcHandlerLatencyMetric/SSL_UnixSocket (106 ms)
[ RUN ] Parameters/TestRpc.TimedOutOnResponseMetricServiceQueue/SSL_UnixSocket
I20260925 19:32:44.307160 726 acceptor_pool.cc:254] collecting diagnostics on the listening RPC socket unix:/tmp/dist-test-taskKC2Tri/test-tmp/rpc-test-b6dbd660f45f434898e767329a588fd9.sock every 8 connection(s)
I20260925 19:32:44.307857 727 acceptor_pool.cc:254] collecting diagnostics on the listening RPC socket unix:/tmp/dist-test-taskKC2Tri/test-tmp/rpc-test-b6dbd660f45f434898e767329a588fd9.sock every 8 connection(s)
W20260925 19:32:44.405027 728 rpcz_store.cc:267] Call kudu.rpc_test.CalculatorService.Sleep from unix:<unnamed> (request call id 2) took 20 ms (client timeout 20 ms). Trace:
W20260925 19:32:44.405429 728 rpcz_store.cc:269] 0925 19:32:44.384554 (+ 0us) service_pool.cc:170] Inserting onto call queue
0925 19:32:44.404902 (+ 20348us) service_pool.cc:214] Skipping call since client already timed out
0925 19:32:44.404981 (+ 79us) inbound_call.cc:173] Queueing failure response
Metrics: {}
[ OK ] Parameters/TestRpc.TimedOutOnResponseMetricServiceQueue/SSL_UnixSocket (140 ms)
[ RUN ] Parameters/TestRpc.RpcPendingConnectionsMetric/SSL_UnixSocket
I20260925 19:32:44.421430 749 acceptor_pool.cc:254] collecting diagnostics on the listening RPC socket 0.0.0.0:46645 every 8 connection(s)
I20260925 19:32:44.422170 750 acceptor_pool.cc:254] collecting diagnostics on the listening RPC socket 0.0.0.0:46645 every 8 connection(s)
W20260925 19:32:44.435616 745 negotiation.cc:337] Failed RPC negotiation. Trace:
0925 19:32:44.433974 (+ 0us) reactor.cc:625] Submitting negotiation task for server connection from 127.0.0.1:54402 (local address 127.0.0.1:46645)
0925 19:32:44.434719 (+ 745us) server_negotiation.cc:206] Beginning negotiation
0925 19:32:44.434766 (+ 47us) server_negotiation.cc:399] Waiting for connection header
0925 19:32:44.435057 (+ 291us) negotiation.cc:327] Negotiation complete: Network error: Server connection negotiation failed: server connection from 127.0.0.1:54402: BlockingRecv error: recv got EOF from 127.0.0.1:54402 (error 108)
Metrics: {"server-negotiator.queue_time_us":141}
[ OK ] Parameters/TestRpc.RpcPendingConnectionsMetric/SSL_UnixSocket (36 ms)
[ RUN ] Parameters/TestRpc.TestRpcContextClientDeadline/SSL_UnixSocket
I20260925 19:32:44.472199 765 acceptor_pool.cc:254] collecting diagnostics on the listening RPC socket unix:/tmp/dist-test-taskKC2Tri/test-tmp/rpc-test-734f403c2b224dfaa2c62145cd4a10d9.sock every 8 connection(s)
I20260925 19:32:44.472980 766 acceptor_pool.cc:254] collecting diagnostics on the listening RPC socket unix:/tmp/dist-test-taskKC2Tri/test-tmp/rpc-test-734f403c2b224dfaa2c62145cd4a10d9.sock every 8 connection(s)
[ OK ] Parameters/TestRpc.TestRpcContextClientDeadline/SSL_UnixSocket (98 ms)
[ RUN ] Parameters/TestRpc.TestApplicationFeatureFlagUnsupportedServer/SSL_UnixSocket
I20260925 19:32:44.565269 790 acceptor_pool.cc:254] collecting diagnostics on the listening RPC socket unix:/tmp/dist-test-taskKC2Tri/test-tmp/rpc-test-fdc51a4fc5484e5a9a537e5eca530a78.sock every 8 connection(s)
I20260925 19:32:44.565985 791 acceptor_pool.cc:254] collecting diagnostics on the listening RPC socket unix:/tmp/dist-test-taskKC2Tri/test-tmp/rpc-test-fdc51a4fc5484e5a9a537e5eca530a78.sock every 8 connection(s)
W20260925 19:32:44.600016 787 connection.cc:196] Error closing socket: Network error: TlsSocket::Close: Broken pipe
[ OK ] Parameters/TestRpc.TestApplicationFeatureFlagUnsupportedServer/SSL_UnixSocket (57 ms)
[ RUN ] Parameters/TestRpc.TestCancellationAsync/SSL_UnixSocket
I20260925 19:32:44.623786 815 acceptor_pool.cc:254] collecting diagnostics on the listening RPC socket unix:/tmp/dist-test-taskKC2Tri/test-tmp/rpc-test-d76e5cec48964f458851641b2cf7b22c.sock every 8 connection(s)
I20260925 19:32:44.624487 816 acceptor_pool.cc:254] collecting diagnostics on the listening RPC socket unix:/tmp/dist-test-taskKC2Tri/test-tmp/rpc-test-d76e5cec48964f458851641b2cf7b22c.sock every 8 connection(s)
I20260925 19:32:44.627707 390 rpc-test.cc:1716] Connecting to unix:/tmp/dist-test-taskKC2Tri/test-tmp/rpc-test-d76e5cec48964f458851641b2cf7b22c.sock
I20260925 19:32:44.658058 390 test_util.cc:268] Using random seed: -942614156
I20260925 19:32:44.889192 819 rpc-test-base.h:240] got call: sleep_micros: 500 pattern: 4294967295 num_repetitions: 2097152 sidecar_idx: 0
I20260925 19:32:45.102205 819 rpc-test-base.h:240] got call: sleep_micros: 500 pattern: 4294967295 num_repetitions: 2097152 sidecar_idx: 0
I20260925 19:32:45.314491 819 rpc-test-base.h:240] got call: sleep_micros: 500 pattern: 4294967295 num_repetitions: 2097152 sidecar_idx: 0
I20260925 19:32:45.525789 819 rpc-test-base.h:240] got call: sleep_micros: 500 pattern: 4294967295 num_repetitions: 2097152 sidecar_idx: 0
I20260925 19:32:45.734035 818 rpc-test-base.h:240] got call: sleep_micros: 500 pattern: 4294967295 num_repetitions: 2097152 sidecar_idx: 0
I20260925 19:32:45.961333 819 rpc-test-base.h:240] got call: sleep_micros: 500 pattern: 4294967295 num_repetitions: 2097152 sidecar_idx: 0
I20260925 19:32:46.180267 819 rpc-test-base.h:240] got call: sleep_micros: 500 pattern: 4294967295 num_repetitions: 2097152 sidecar_idx: 0
I20260925 19:32:46.399761 819 rpc-test-base.h:240] got call: sleep_micros: 500 pattern: 4294967295 num_repetitions: 2097152 sidecar_idx: 0
I20260925 19:32:46.604770 819 rpc-test-base.h:240] got call: sleep_micros: 500 pattern: 4294967295 num_repetitions: 2097152 sidecar_idx: 0
W20260925 19:32:46.619328 812 connection.cc:196] Error closing socket: Network error: TlsSocket::Close: Broken pipe
W20260925 19:32:46.739769 812 connection.cc:441] server connection from unix:<unnamed> torn down before Call kudu.rpc.GenericCalculatorService.SleepWithSidecar from unix:<unnamed> (request call id 9) could send its response
[ OK ] Parameters/TestRpc.TestCancellationAsync/SSL_UnixSocket (2144 ms)
[ RUN ] Parameters/TestRpc.TestPerformanceBySocketType/SSL_UnixSocket
I20260925 19:32:46.852250 840 acceptor_pool.cc:254] collecting diagnostics on the listening RPC socket unix:/tmp/dist-test-taskKC2Tri/test-tmp/rpc-test-db562375db9241948fe25eee368442ec.sock every 8 connection(s)
I20260925 19:32:46.852965 841 acceptor_pool.cc:254] collecting diagnostics on the listening RPC socket unix:/tmp/dist-test-taskKC2Tri/test-tmp/rpc-test-db562375db9241948fe25eee368442ec.sock every 8 connection(s)
I20260925 19:32:46.856037 390 rpc-test.cc:1846] Connecting to unix:/tmp/dist-test-taskKC2Tri/test-tmp/rpc-test-db562375db9241948fe25eee368442ec.sock
I20260925 19:33:08.107467 390 rpc-test.cc:1859] Sending 1024MB via ssl-enabled unix socket: real 21.230s user 18.758s sys 12.991s
I20260925 19:33:29.532002 390 rpc-test.cc:1859] Sending 1024MB via ssl-enabled unix socket: real 21.424s user 18.972s sys 13.087s
I20260925 19:33:50.740954 390 rpc-test.cc:1859] Sending 1024MB via ssl-enabled unix socket: real 21.208s user 19.002s sys 12.687s
I20260925 19:34:11.775017 390 rpc-test.cc:1859] Sending 1024MB via ssl-enabled unix socket: real 21.034s user 18.602s sys 12.751s
I20260925 19:34:32.789101 390 rpc-test.cc:1859] Sending 1024MB via ssl-enabled unix socket: real 21.014s user 18.620s sys 12.696s
W20260925 19:34:32.795295 837 connection.cc:196] Error closing socket: Network error: TlsSocket::Close: Broken pipe
[ OK ] Parameters/TestRpc.TestPerformanceBySocketType/SSL_UnixSocket (106057 ms)
[----------] 20 tests from Parameters/TestRpc (269240 ms total)
[----------] 1 test from Parameters/TestRpcSocketTxRxQueue
[ RUN ] Parameters/TestRpcSocketTxRxQueue.AcceptorRxQueueSizeMetric/0
I20260925 19:34:32.822794 875 acceptor_pool.cc:254] collecting diagnostics on the listening RPC socket 0.0.0.0:40003 every 1 connection(s)
I20260925 19:34:32.823678 876 acceptor_pool.cc:254] collecting diagnostics on the listening RPC socket 0.0.0.0:40003 every 1 connection(s)
W20260925 19:34:32.829098 871 negotiation.cc:337] Failed RPC negotiation. Trace:
0925 19:34:32.827385 (+ 0us) reactor.cc:625] Submitting negotiation task for server connection from 127.0.0.1:35872 (local address 127.0.0.1:40003)
0925 19:34:32.827849 (+ 464us) server_negotiation.cc:206] Beginning negotiation
0925 19:34:32.827872 (+ 23us) server_negotiation.cc:399] Waiting for connection header
0925 19:34:32.828080 (+ 208us) negotiation.cc:327] Negotiation complete: Network error: Server connection negotiation failed: server connection from 127.0.0.1:35872: BlockingRecv error: recv got EOF from 127.0.0.1:35872 (error 108)
Metrics: {"server-negotiator.queue_time_us":118}
[ OK ] Parameters/TestRpcSocketTxRxQueue.AcceptorRxQueueSizeMetric/0 (29 ms)
[----------] 1 test from Parameters/TestRpcSocketTxRxQueue (29 ms total)
[----------] Global test environment tear-down
[==========] 21 tests from 2 test suites ran. (269270 ms total)
[ PASSED ] 20 tests.
[ FAILED ] 1 test, listed below:
[ FAILED ] Parameters/TestRpc.TestCallWithChainCertAndChainCA/SSL_UnixSocket, where GetParam() = (true, true)
1 FAILED TEST