Parameters/TestRpc.TestCallWithChainCertAndRootCA/SSL_UnixSocket: /data0/somelongdirectorytoavoidrpathissues/src/kudu/src/kudu/rpc/rpc-test.cc:303: Failure
Failed
Bad status: Runtime error: could not verify certificate chain (error with cert: subject=CN = localhost, ST = sadfjas, C = AS, emailAddress = sdflkdsajf, O = lskdfjlsad, OU = sldfkja, issuer=C = AS, ST = ASDfkjdhf, L = lskdjf, O = saldfja, OU = skdjf, CN = localhost, emailAddress = sadjflkadsj): : certificate has expired
Google Test trace:
/data0/somelongdirectorytoavoidrpathissues/src/kudu/src/kudu/rpc/rpc-test.cc:300: Connecting to unix:/tmp/dist-test-task7SuTCk/test-tmp/rpc-test-369cbe529a39471797ef36695db7ba90.sock
I20260925 16:42:04.881575 794 test_util.cc:175] -----------------------------------------------
I20260925 16:42:04.881755 794 test_util.cc:176] Had fatal failures, leaving test files at /tmp/dist-test-task7SuTCk/test-tmp/rpc-test.2.Parameters_TestRpc.TestCallWithChainCertAndRootCA_SSL_UnixSocket.1790354521407700-794-0
Note: This is test shard 3 of 8.
[==========] Running 21 tests from 2 test suites.
[----------] Global test environment set-up.
[----------] 1 test from TestRpc
[ RUN ] TestRpc.TestNegotiationTimeout
WARNING: Logging before InitGoogleLogging() is written to STDERR
I20260925 16:42:01.597666 794 rpc-test-base.h:595] status: Timed out: connection negotiation to 0.0.0.0:46783 for RPC Sleep timed out after 0.100s (ON_OUTBOUND_QUEUE), seconds elapsed: 0.101006
W20260925 16:42:04.567098 804 negotiation.cc:337] Failed RPC negotiation. Trace:
0925 16:42:01.497660 (+ 0us) reactor.cc:625] Submitting negotiation task for client connection to 0.0.0.0:46783 (local address 127.0.0.1:36222)
0925 16:42:01.498504 (+ 844us) negotiation.cc:107] Waiting for socket to connect
0925 16:42:01.498551 (+ 47us) client_negotiation.cc:174] Beginning negotiation
0925 16:42:01.511598 (+ 13047us) client_negotiation.cc:252] Sending NEGOTIATE NegotiatePB request
0925 16:42:04.565974 (+3054376us) negotiation.cc:327] Negotiation complete: Timed out: Client connection negotiation failed: client connection to 0.0.0.0:46783: received 0 of 4 requested bytes
Metrics: {"client-negotiator.queue_time_us":239}
[ OK ] TestRpc.TestNegotiationTimeout (3111 ms)
[----------] 1 test from TestRpc (3111 ms total)
[----------] 20 tests from Parameters/TestRpc
[ RUN ] Parameters/TestRpc.TestAcceptorPoolStartStop/SSL_UnixSocket
I20260925 16:42:04.617455 820 acceptor_pool.cc:254] collecting diagnostics on the listening RPC socket unix:/tmp/dist-test-task7SuTCk/test-tmp/rpc-test-ceb2be6b70984c24b61d042e67a22e02.sock every 8 connection(s)
I20260925 16:42:04.619547 821 acceptor_pool.cc:254] collecting diagnostics on the listening RPC socket unix:/tmp/dist-test-task7SuTCk/test-tmp/rpc-test-ceb2be6b70984c24b61d042e67a22e02.sock every 8 connection(s)
I20260925 16:42:04.656020 831 acceptor_pool.cc:254] collecting diagnostics on the listening RPC socket unix:/tmp/dist-test-task7SuTCk/test-tmp/rpc-test-ceb2be6b70984c24b61d042e67a22e02.sock every 8 connection(s)
I20260925 16:42:04.657439 832 acceptor_pool.cc:254] collecting diagnostics on the listening RPC socket unix:/tmp/dist-test-task7SuTCk/test-tmp/rpc-test-ceb2be6b70984c24b61d042e67a22e02.sock every 8 connection(s)
I20260925 16:42:04.679632 842 acceptor_pool.cc:254] collecting diagnostics on the listening RPC socket unix:/tmp/dist-test-task7SuTCk/test-tmp/rpc-test-ceb2be6b70984c24b61d042e67a22e02.sock every 8 connection(s)
I20260925 16:42:04.680330 843 acceptor_pool.cc:254] collecting diagnostics on the listening RPC socket unix:/tmp/dist-test-task7SuTCk/test-tmp/rpc-test-ceb2be6b70984c24b61d042e67a22e02.sock every 8 connection(s)
I20260925 16:42:04.704516 853 acceptor_pool.cc:254] collecting diagnostics on the listening RPC socket unix:/tmp/dist-test-task7SuTCk/test-tmp/rpc-test-ceb2be6b70984c24b61d042e67a22e02.sock every 8 connection(s)
I20260925 16:42:04.705233 854 acceptor_pool.cc:254] collecting diagnostics on the listening RPC socket unix:/tmp/dist-test-task7SuTCk/test-tmp/rpc-test-ceb2be6b70984c24b61d042e67a22e02.sock every 8 connection(s)
I20260925 16:42:04.727785 864 acceptor_pool.cc:254] collecting diagnostics on the listening RPC socket unix:/tmp/dist-test-task7SuTCk/test-tmp/rpc-test-ceb2be6b70984c24b61d042e67a22e02.sock every 8 connection(s)
I20260925 16:42:04.728816 865 acceptor_pool.cc:254] collecting diagnostics on the listening RPC socket unix:/tmp/dist-test-task7SuTCk/test-tmp/rpc-test-ceb2be6b70984c24b61d042e67a22e02.sock every 8 connection(s)
[ OK ] Parameters/TestRpc.TestAcceptorPoolStartStop/SSL_UnixSocket (161 ms)
[ RUN ] Parameters/TestRpc.TestCall/SSL_UnixSocket
I20260925 16:42:04.758740 877 acceptor_pool.cc:254] collecting diagnostics on the listening RPC socket unix:/tmp/dist-test-task7SuTCk/test-tmp/rpc-test-ec2373f0d5844b789decb4df1e9e28d6.sock every 8 connection(s)
I20260925 16:42:04.761381 878 acceptor_pool.cc:254] collecting diagnostics on the listening RPC socket unix:/tmp/dist-test-task7SuTCk/test-tmp/rpc-test-ec2373f0d5844b789decb4df1e9e28d6.sock every 8 connection(s)
I20260925 16:42:04.766405 794 rpc-test.cc:234] Connecting to unix:/tmp/dist-test-task7SuTCk/test-tmp/rpc-test-ec2373f0d5844b789decb4df1e9e28d6.sock
W20260925 16:42:04.825542 874 connection.cc:196] Error closing socket: Network error: TlsSocket::Close: Broken pipe
[ OK ] Parameters/TestRpc.TestCall/SSL_UnixSocket (97 ms)
[ RUN ] Parameters/TestRpc.TestCallWithChainCertAndRootCA/SSL_UnixSocket
I20260925 16:42:04.860245 902 acceptor_pool.cc:254] collecting diagnostics on the listening RPC socket unix:/tmp/dist-test-task7SuTCk/test-tmp/rpc-test-369cbe529a39471797ef36695db7ba90.sock every 8 connection(s)
I20260925 16:42:04.861001 903 acceptor_pool.cc:254] collecting diagnostics on the listening RPC socket unix:/tmp/dist-test-task7SuTCk/test-tmp/rpc-test-369cbe529a39471797ef36695db7ba90.sock every 8 connection(s)
/data0/somelongdirectorytoavoidrpathissues/src/kudu/src/kudu/rpc/rpc-test.cc:303: Failure
Failed
Bad status: Runtime error: could not verify certificate chain (error with cert: subject=CN = localhost, ST = sadfjas, C = AS, emailAddress = sdflkdsajf, O = lskdfjlsad, OU = sldfkja, issuer=C = AS, ST = ASDfkjdhf, L = lskdjf, O = saldfja, OU = skdjf, CN = localhost, emailAddress = sadjflkadsj): : certificate has expired
Google Test trace:
/data0/somelongdirectorytoavoidrpathissues/src/kudu/src/kudu/rpc/rpc-test.cc:300: Connecting to unix:/tmp/dist-test-task7SuTCk/test-tmp/rpc-test-369cbe529a39471797ef36695db7ba90.sock
I20260925 16:42:04.881575 794 test_util.cc:175] -----------------------------------------------
I20260925 16:42:04.881755 794 test_util.cc:176] Had fatal failures, leaving test files at /tmp/dist-test-task7SuTCk/test-tmp/rpc-test.2.Parameters_TestRpc.TestCallWithChainCertAndRootCA_SSL_UnixSocket.1790354521407700-794-0
[ FAILED ] Parameters/TestRpc.TestCallWithChainCertAndRootCA/SSL_UnixSocket, where GetParam() = (true, true) (51 ms)
[ RUN ] Parameters/TestRpc.TestCallWithBadPasswordProtectedKey/SSL_UnixSocket
[ OK ] Parameters/TestRpc.TestCallWithBadPasswordProtectedKey/SSL_UnixSocket (30 ms)
[ RUN ] Parameters/TestRpc.TestInvalidMethodCall/SSL_UnixSocket
I20260925 16:42:04.956938 939 acceptor_pool.cc:254] collecting diagnostics on the listening RPC socket unix:/tmp/dist-test-task7SuTCk/test-tmp/rpc-test-9ae602918beb498ea93db639a085e9ee.sock every 8 connection(s)
I20260925 16:42:04.957798 940 acceptor_pool.cc:254] collecting diagnostics on the listening RPC socket unix:/tmp/dist-test-task7SuTCk/test-tmp/rpc-test-9ae602918beb498ea93db639a085e9ee.sock every 8 connection(s)
I20260925 16:42:04.961473 794 rpc-test.cc:406] Connecting to unix:/tmp/dist-test-task7SuTCk/test-tmp/rpc-test-9ae602918beb498ea93db639a085e9ee.sock
[ OK ] Parameters/TestRpc.TestInvalidMethodCall/SSL_UnixSocket (89 ms)
[ RUN ] Parameters/TestRpc.TestHighFDs/SSL_UnixSocket
I20260925 16:42:05.246590 964 acceptor_pool.cc:254] collecting diagnostics on the listening RPC socket unix:/tmp/dist-test-task7SuTCk/test-tmp/rpc-test-e8fe9bd7c11244169895a230c1649fbe.sock every 8 connection(s)
I20260925 16:42:05.247291 965 acceptor_pool.cc:254] collecting diagnostics on the listening RPC socket unix:/tmp/dist-test-task7SuTCk/test-tmp/rpc-test-e8fe9bd7c11244169895a230c1649fbe.sock every 8 connection(s)
W20260925 16:42:05.293391 961 connection.cc:196] Error closing socket: Network error: TlsSocket::Close: Broken pipe
[ OK ] Parameters/TestRpc.TestHighFDs/SSL_UnixSocket (303 ms)
[ RUN ] Parameters/TestRpc.TestConnectionAlwaysKeepalive/SSL_UnixSocket
I20260925 16:42:05.327983 987 acceptor_pool.cc:254] collecting diagnostics on the listening RPC socket unix:/tmp/dist-test-task7SuTCk/test-tmp/rpc-test-968a0a067e8e4af6aa34d0e11c9c9bfb.sock every 8 connection(s)
I20260925 16:42:05.328733 988 acceptor_pool.cc:254] collecting diagnostics on the listening RPC socket unix:/tmp/dist-test-task7SuTCk/test-tmp/rpc-test-968a0a067e8e4af6aa34d0e11c9c9bfb.sock every 8 connection(s)
I20260925 16:42:05.331979 794 rpc-test.cc:532] Connecting to unix:/tmp/dist-test-task7SuTCk/test-tmp/rpc-test-968a0a067e8e4af6aa34d0e11c9c9bfb.sock
W20260925 16:42:08.370425 986 connection.cc:196] Error closing socket: Network error: TlsSocket::Close: Broken pipe
[ OK ] Parameters/TestRpc.TestConnectionAlwaysKeepalive/SSL_UnixSocket (3069 ms)
[ RUN ] Parameters/TestRpc.TestReopenOutboundConnections/SSL_UnixSocket
I20260925 16:42:08.402649 1010 acceptor_pool.cc:254] collecting diagnostics on the listening RPC socket unix:/tmp/dist-test-task7SuTCk/test-tmp/rpc-test-16dd94478afe4ffda11c4dd1c6ca34ed.sock every 8 connection(s)
I20260925 16:42:08.403376 1011 acceptor_pool.cc:254] collecting diagnostics on the listening RPC socket unix:/tmp/dist-test-task7SuTCk/test-tmp/rpc-test-16dd94478afe4ffda11c4dd1c6ca34ed.sock every 8 connection(s)
I20260925 16:42:08.406685 794 rpc-test.cc:658] Connecting to unix:/tmp/dist-test-task7SuTCk/test-tmp/rpc-test-16dd94478afe4ffda11c4dd1c6ca34ed.sock
W20260925 16:42:08.451448 1009 connection.cc:196] Error closing socket: Network error: TlsSocket::Close: Broken pipe
W20260925 16:42:08.461853 1009 connection.cc:196] Error closing socket: Network error: TlsSocket::Close: Broken pipe
W20260925 16:42:08.472012 1009 connection.cc:196] Error closing socket: Network error: TlsSocket::Close: Broken pipe
W20260925 16:42:08.482158 1009 connection.cc:196] Error closing socket: Network error: TlsSocket::Close: Broken pipe
W20260925 16:42:08.493360 1009 connection.cc:196] Error closing socket: Network error: TlsSocket::Close: Broken pipe
W20260925 16:42:08.503726 1009 connection.cc:196] Error closing socket: Network error: TlsSocket::Close: Broken pipe
W20260925 16:42:08.513434 1009 connection.cc:196] Error closing socket: Network error: TlsSocket::Close: Broken pipe
W20260925 16:42:08.523774 1009 connection.cc:196] Error closing socket: Network error: TlsSocket::Close: Broken pipe
W20260925 16:42:08.533952 1009 connection.cc:196] Error closing socket: Network error: TlsSocket::Close: Broken pipe
W20260925 16:42:08.543903 1009 connection.cc:196] Error closing socket: Network error: TlsSocket::Close: Broken pipe
W20260925 16:42:08.554415 1009 connection.cc:196] Error closing socket: Network error: TlsSocket::Close: Broken pipe
W20260925 16:42:08.565346 1009 connection.cc:196] Error closing socket: Network error: TlsSocket::Close: Broken pipe
W20260925 16:42:08.576503 1009 connection.cc:196] Error closing socket: Network error: TlsSocket::Close: Broken pipe
W20260925 16:42:08.586465 1009 connection.cc:196] Error closing socket: Network error: TlsSocket::Close: Broken pipe
W20260925 16:42:08.586486 1010 acceptor_pool.cc:285] unable to collect diagnostics on RPC socket unix:/tmp/dist-test-task7SuTCk/test-tmp/rpc-test-16dd94478afe4ffda11c4dd1c6ca34ed.sock: Not implemented: netlink diagnostics is currently supported only on IPv4 TCP sockets
W20260925 16:42:08.596720 1009 connection.cc:196] Error closing socket: Network error: TlsSocket::Close: Broken pipe
W20260925 16:42:08.606853 1009 connection.cc:196] Error closing socket: Network error: TlsSocket::Close: Broken pipe
W20260925 16:42:08.617846 1009 connection.cc:196] Error closing socket: Network error: TlsSocket::Close: Broken pipe
W20260925 16:42:08.634148 1009 connection.cc:196] Error closing socket: Network error: TlsSocket::Close: Broken pipe
W20260925 16:42:08.646554 1009 connection.cc:196] Error closing socket: Network error: TlsSocket::Close: Broken pipe
W20260925 16:42:08.657104 1009 connection.cc:196] Error closing socket: Network error: TlsSocket::Close: Broken pipe
W20260925 16:42:08.667049 1009 connection.cc:196] Error closing socket: Network error: TlsSocket::Close: Broken pipe
W20260925 16:42:08.676725 1009 connection.cc:196] Error closing socket: Network error: TlsSocket::Close: Broken pipe
W20260925 16:42:08.686834 1009 connection.cc:196] Error closing socket: Network error: TlsSocket::Close: Broken pipe
W20260925 16:42:08.696880 1009 connection.cc:196] Error closing socket: Network error: TlsSocket::Close: Broken pipe
W20260925 16:42:08.706848 1009 connection.cc:196] Error closing socket: Network error: TlsSocket::Close: Broken pipe
W20260925 16:42:08.718147 1009 connection.cc:196] Error closing socket: Network error: TlsSocket::Close: Broken pipe
W20260925 16:42:08.728386 1009 connection.cc:196] Error closing socket: Network error: TlsSocket::Close: Broken pipe
W20260925 16:42:08.738864 1009 connection.cc:196] Error closing socket: Network error: TlsSocket::Close: Broken pipe
W20260925 16:42:08.749284 1009 connection.cc:196] Error closing socket: Network error: TlsSocket::Close: Broken pipe
W20260925 16:42:08.760196 1009 connection.cc:196] Error closing socket: Network error: TlsSocket::Close: Broken pipe
W20260925 16:42:08.770363 1009 connection.cc:196] Error closing socket: Network error: TlsSocket::Close: Broken pipe
W20260925 16:42:08.781822 1009 connection.cc:196] Error closing socket: Network error: TlsSocket::Close: Broken pipe
[ OK ] Parameters/TestRpc.TestReopenOutboundConnections/SSL_UnixSocket (410 ms)
[ RUN ] Parameters/TestRpc.TestConnectionNetworkPlane/SSL_UnixSocket
I20260925 16:42:08.816495 1033 acceptor_pool.cc:254] collecting diagnostics on the listening RPC socket unix:/tmp/dist-test-task7SuTCk/test-tmp/rpc-test-488ed5fee82c46bbb09d59be83682dbf.sock every 8 connection(s)
I20260925 16:42:08.817354 1034 acceptor_pool.cc:254] collecting diagnostics on the listening RPC socket unix:/tmp/dist-test-task7SuTCk/test-tmp/rpc-test-488ed5fee82c46bbb09d59be83682dbf.sock every 8 connection(s)
I20260925 16:42:08.820542 794 rpc-test.cc:772] Connecting to unix:/tmp/dist-test-task7SuTCk/test-tmp/rpc-test-488ed5fee82c46bbb09d59be83682dbf.sock
W20260925 16:42:08.859822 1032 connection.cc:196] Error closing socket: Network error: TlsSocket::Close: Broken pipe
W20260925 16:42:08.860816 1032 connection.cc:196] Error closing socket: Network error: TlsSocket::Close: Broken pipe
[ OK ] Parameters/TestRpc.TestConnectionNetworkPlane/SSL_UnixSocket (79 ms)
[ RUN ] Parameters/TestRpc.TestTCPKeepalive/SSL_UnixSocket
I20260925 16:42:08.892926 1058 acceptor_pool.cc:254] collecting diagnostics on the listening RPC socket unix:/tmp/dist-test-task7SuTCk/test-tmp/rpc-test-943aa19bf2aa4b50ba28813eab3b6474.sock every 8 connection(s)
I20260925 16:42:08.893697 1059 acceptor_pool.cc:254] collecting diagnostics on the listening RPC socket unix:/tmp/dist-test-task7SuTCk/test-tmp/rpc-test-943aa19bf2aa4b50ba28813eab3b6474.sock every 8 connection(s)
I20260925 16:42:08.941758 1062 rpc-test-base.h:222] got call: sleep_micros: 8000000 deferred: true
I20260925 16:42:16.945940 1062 rpcz_store.cc:275] Call kudu.rpc.GenericCalculatorService.Sleep from unix:<unnamed> (request call id 0) took 8004 ms. Trace:
I20260925 16:42:16.946455 1062 rpcz_store.cc:276] 0925 16:42:08.941608 (+ 0us) service_pool.cc:170] Inserting onto call queue
0925 16:42:08.941706 (+ 98us) service_pool.cc:227] Handling call
0925 16:42:16.945767 (+8004061us) inbound_call.cc:173] Queueing success response
Metrics: {}
W20260925 16:42:16.953670 1055 connection.cc:196] Error closing socket: Network error: TlsSocket::Close: Broken pipe
[ OK ] Parameters/TestRpc.TestTCPKeepalive/SSL_UnixSocket (8095 ms)
[ RUN ] Parameters/TestRpc.TestMaxSmallSidecars/SSL_UnixSocket
I20260925 16:42:16.989460 1084 acceptor_pool.cc:254] collecting diagnostics on the listening RPC socket unix:/tmp/dist-test-task7SuTCk/test-tmp/rpc-test-d887a3107bec4f87b6305437a90f4445.sock every 8 connection(s)
I20260925 16:42:16.990370 1085 acceptor_pool.cc:254] collecting diagnostics on the listening RPC socket unix:/tmp/dist-test-task7SuTCk/test-tmp/rpc-test-d887a3107bec4f87b6305437a90f4445.sock every 8 connection(s)
W20260925 16:42:17.167428 1081 connection.cc:196] Error closing socket: Network error: TlsSocket::Close: Broken pipe
[ OK ] Parameters/TestRpc.TestMaxSmallSidecars/SSL_UnixSocket (210 ms)
[ RUN ] Parameters/TestRpc.TestCallTimeout/SSL_UnixSocket
I20260925 16:42:17.199599 1109 acceptor_pool.cc:254] collecting diagnostics on the listening RPC socket unix:/tmp/dist-test-task7SuTCk/test-tmp/rpc-test-6a29174cbb244dbc9c7c46bde964bbeb.sock every 8 connection(s)
I20260925 16:42:17.200348 1110 acceptor_pool.cc:254] collecting diagnostics on the listening RPC socket unix:/tmp/dist-test-task7SuTCk/test-tmp/rpc-test-6a29174cbb244dbc9c7c46bde964bbeb.sock every 8 connection(s)
I20260925 16:42:17.223873 794 rpc-test-base.h:595] status: Timed out: connection negotiation to unix:/tmp/dist-test-task7SuTCk/test-tmp/rpc-test-6a29174cbb244dbc9c7c46bde964bbeb.sock for RPC Sleep timed out after 0.000s (ON_OUTBOUND_QUEUE), seconds elapsed: 0.00243478
I20260925 16:42:17.232084 1113 rpc-test-base.h:222] got call: sleep_micros: 700000
I20260925 16:42:17.425000 794 rpc-test-base.h:595] status: Timed out: Sleep RPC to unix:/tmp/dist-test-task7SuTCk/test-tmp/rpc-test-6a29174cbb244dbc9c7c46bde964bbeb.sock timed out after 0.200s (SENT), seconds elapsed: 0.200738
I20260925 16:42:17.426522 1112 rpc-test-base.h:222] got call: sleep_micros: 2000000
W20260925 16:42:17.932801 1113 rpcz_store.cc:267] Call kudu.rpc.GenericCalculatorService.Sleep from unix:<unnamed> (request call id 1) took 700 ms (client timeout 200 ms). Trace:
W20260925 16:42:17.933142 1113 rpcz_store.cc:269] 0925 16:42:17.231914 (+ 0us) service_pool.cc:170] Inserting onto call queue
0925 16:42:17.232029 (+ 115us) service_pool.cc:227] Handling call
0925 16:42:17.932745 (+700716us) inbound_call.cc:173] Queueing success response
Metrics: {}
I20260925 16:42:18.926690 794 rpc-test-base.h:595] status: Timed out: Sleep RPC to unix:/tmp/dist-test-task7SuTCk/test-tmp/rpc-test-6a29174cbb244dbc9c7c46bde964bbeb.sock timed out after 1.500s (SENT), seconds elapsed: 1.50126
W20260925 16:42:19.427076 1112 rpcz_store.cc:267] Call kudu.rpc.GenericCalculatorService.Sleep from unix:<unnamed> (request call id 2) took 2000 ms (client timeout 1500 ms). Trace:
W20260925 16:42:19.427388 1112 rpcz_store.cc:269] 0925 16:42:17.426254 (+ 0us) service_pool.cc:170] Inserting onto call queue
0925 16:42:17.426378 (+ 124us) service_pool.cc:227] Handling call
0925 16:42:19.427014 (+2000636us) inbound_call.cc:173] Queueing success response
Metrics: {}
W20260925 16:42:19.427891 1106 connection.cc:441] server connection from unix:<unnamed> torn down before Call kudu.rpc.GenericCalculatorService.Sleep from unix:<unnamed> (request call id 2) could send its response
[ OK ] Parameters/TestRpc.TestCallTimeout/SSL_UnixSocket (2262 ms)
[ RUN ] Parameters/TestRpc.TestServerShutsDown/SSL_UnixSocket
I20260925 16:42:19.436409 794 rpc-test.cc:1125] Connecting to 0.0.0.0:35017
W20260925 16:42:19.445910 1126 negotiation.cc:337] Failed RPC negotiation. Trace:
0925 16:42:19.444333 (+ 0us) reactor.cc:625] Submitting negotiation task for client connection to 0.0.0.0:35017 (local address 127.0.0.1:55758)
0925 16:42:19.444799 (+ 466us) negotiation.cc:107] Waiting for socket to connect
0925 16:42:19.444831 (+ 32us) client_negotiation.cc:174] Beginning negotiation
0925 16:42:19.445064 (+ 233us) client_negotiation.cc:252] Sending NEGOTIATE NegotiatePB request
0925 16:42:19.445383 (+ 319us) negotiation.cc:327] Negotiation complete: Network error: Client connection negotiation failed: client connection to 0.0.0.0:35017: BlockingWrite error: write error: Broken pipe (error 32)
Metrics: {"client-negotiator.queue_time_us":131}
[ OK ] Parameters/TestRpc.TestServerShutsDown/SSL_UnixSocket (14 ms)
[ RUN ] Parameters/TestRpc.TimedOutOnResponseMetric/SSL_UnixSocket
I20260925 16:42:19.472615 1143 acceptor_pool.cc:254] collecting diagnostics on the listening RPC socket unix:/tmp/dist-test-task7SuTCk/test-tmp/rpc-test-f9a9b36ac5ce42aebc4e5ac2434974f8.sock every 8 connection(s)
I20260925 16:42:19.473357 1144 acceptor_pool.cc:254] collecting diagnostics on the listening RPC socket unix:/tmp/dist-test-task7SuTCk/test-tmp/rpc-test-f9a9b36ac5ce42aebc4e5ac2434974f8.sock every 8 connection(s)
W20260925 16:42:19.715880 1147 rpcz_store.cc:267] Call kudu.rpc_test.CalculatorService.Sleep from unix:<unnamed> (request call id 3) took 50 ms (client timeout 25 ms). Trace:
W20260925 16:42:19.716185 1147 rpcz_store.cc:269] 0925 16:42:19.665159 (+ 0us) service_pool.cc:170] Inserting onto call queue
0925 16:42:19.665348 (+ 189us) service_pool.cc:227] Handling call
0925 16:42:19.715797 (+ 50449us) inbound_call.cc:173] Queueing success response
Related trace 'test_child':
Metrics: {"test_sleep_us":50000,"child_traces":[["test_child",{"related_trace_metric":1}]]}
W20260925 16:42:19.775734 1147 rpcz_store.cc:267] Call kudu.rpc_test.CalculatorService.Sleep from unix:<unnamed> (request call id 4) took 50 ms (client timeout 50 ms). Trace:
W20260925 16:42:19.775988 1147 rpcz_store.cc:269] 0925 16:42:19.725054 (+ 0us) service_pool.cc:170] Inserting onto call queue
0925 16:42:19.725240 (+ 186us) service_pool.cc:227] Handling call
0925 16:42:19.775679 (+ 50439us) inbound_call.cc:173] Queueing success response
Related trace 'test_child':
Metrics: {"test_sleep_us":50000,"child_traces":[["test_child",{"related_trace_metric":1}]]}
[ OK ] Parameters/TestRpc.TimedOutOnResponseMetric/SSL_UnixSocket (336 ms)
[ RUN ] Parameters/TestRpc.AcceptorDispatchingTimesMetric/SSL_UnixSocket
I20260925 16:42:19.797777 1168 acceptor_pool.cc:254] collecting diagnostics on the listening RPC socket 0.0.0.0:45199 every 8 connection(s)
I20260925 16:42:19.798517 1169 acceptor_pool.cc:254] collecting diagnostics on the listening RPC socket 0.0.0.0:45199 every 8 connection(s)
W20260925 16:42:19.803804 1164 negotiation.cc:337] Failed RPC negotiation. Trace:
0925 16:42:19.802650 (+ 0us) reactor.cc:625] Submitting negotiation task for server connection from 127.0.0.1:51874 (local address 127.0.0.1:45199)
0925 16:42:19.803113 (+ 463us) server_negotiation.cc:206] Beginning negotiation
0925 16:42:19.803131 (+ 18us) server_negotiation.cc:399] Waiting for connection header
0925 16:42:19.803365 (+ 234us) negotiation.cc:327] Negotiation complete: Network error: Server connection negotiation failed: server connection from 127.0.0.1:51874: BlockingRecv error: recv got EOF from 127.0.0.1:51874 (error 108)
Metrics: {"server-negotiator.queue_time_us":154}
[ OK ] Parameters/TestRpc.AcceptorDispatchingTimesMetric/SSL_UnixSocket (24 ms)
[ RUN ] Parameters/TestRpc.TestRpcCallbackDestroysMessenger/SSL_UnixSocket
[ OK ] Parameters/TestRpc.TestRpcCallbackDestroysMessenger/SSL_UnixSocket (34 ms)
[ RUN ] Parameters/TestRpc.TestApplicationFeatureFlag/SSL_UnixSocket
I20260925 16:42:19.867648 1193 acceptor_pool.cc:254] collecting diagnostics on the listening RPC socket unix:/tmp/dist-test-task7SuTCk/test-tmp/rpc-test-38e1642c37f445ea8a698b6f3fb0236f.sock every 8 connection(s)
I20260925 16:42:19.868345 1194 acceptor_pool.cc:254] collecting diagnostics on the listening RPC socket unix:/tmp/dist-test-task7SuTCk/test-tmp/rpc-test-38e1642c37f445ea8a698b6f3fb0236f.sock every 8 connection(s)
W20260925 16:42:19.899914 1190 messenger.cc:357] Unable to handle RPC call: Not implemented: call requires unsupported application feature flags: 99
[ OK ] Parameters/TestRpc.TestApplicationFeatureFlag/SSL_UnixSocket (63 ms)
[ RUN ] Parameters/TestRpc.TestCancellation/SSL_UnixSocket
I20260925 16:42:19.936024 1218 acceptor_pool.cc:254] collecting diagnostics on the listening RPC socket unix:/tmp/dist-test-task7SuTCk/test-tmp/rpc-test-77b2e6905fb64d458f43a03e0bc9dfa4.sock every 8 connection(s)
I20260925 16:42:19.936748 1219 acceptor_pool.cc:254] collecting diagnostics on the listening RPC socket unix:/tmp/dist-test-task7SuTCk/test-tmp/rpc-test-77b2e6905fb64d458f43a03e0bc9dfa4.sock every 8 connection(s)
I20260925 16:42:19.940635 794 rpc-test.cc:1648] Connecting to unix:/tmp/dist-test-task7SuTCk/test-tmp/rpc-test-77b2e6905fb64d458f43a03e0bc9dfa4.sock
I20260925 16:42:20.055394 794 rpc-test-base.h:595] status: Aborted: Sleep RPC to unix:/tmp/dist-test-task7SuTCk/test-tmp/rpc-test-77b2e6905fb64d458f43a03e0bc9dfa4.sock is cancelled in state READY, seconds elapsed: 0.000481672
I20260925 16:42:20.250358 794 rpc-test-base.h:595] status: Aborted: Sleep RPC to unix:/tmp/dist-test-task7SuTCk/test-tmp/rpc-test-77b2e6905fb64d458f43a03e0bc9dfa4.sock is cancelled in state SENT, seconds elapsed: 0.000937411
I20260925 16:42:20.250576 1221 rpc-test-base.h:222] got call: sleep_micros: 510000
I20260925 16:42:20.434502 794 rpc-test-base.h:595] status: Aborted: Sleep RPC to unix:/tmp/dist-test-task7SuTCk/test-tmp/rpc-test-77b2e6905fb64d458f43a03e0bc9dfa4.sock is cancelled in state SENT, seconds elapsed: 0.00100109
I20260925 16:42:20.434567 1220 rpc-test-base.h:222] got call: sleep_micros: 510000
I20260925 16:42:20.610224 794 rpc-test-base.h:595] status: Aborted: Sleep RPC to unix:/tmp/dist-test-task7SuTCk/test-tmp/rpc-test-77b2e6905fb64d458f43a03e0bc9dfa4.sock is cancelled in state SENT, seconds elapsed: 0.000918012
W20260925 16:42:20.621064 1222 rpcz_store.cc:267] Call kudu.rpc.GenericCalculatorService.Sleep from unix:<unnamed> (request call id 11) took 10 ms (client timeout 10 ms). Trace:
W20260925 16:42:20.621446 1222 rpcz_store.cc:269] 0925 16:42:20.610166 (+ 0us) service_pool.cc:170] Inserting onto call queue
0925 16:42:20.620799 (+ 10633us) service_pool.cc:214] Skipping call since client already timed out
0925 16:42:20.620881 (+ 82us) inbound_call.cc:173] Queueing failure response
Metrics: {}
I20260925 16:42:20.621941 1222 rpc-test-base.h:222] got call: sleep_micros: 1500000
W20260925 16:42:20.761432 1221 rpcz_store.cc:267] Call kudu.rpc.GenericCalculatorService.Sleep from unix:<unnamed> (request call id 3) took 511 ms (client timeout 10 ms). Trace:
W20260925 16:42:20.761746 1221 rpcz_store.cc:269] 0925 16:42:20.250384 (+ 0us) service_pool.cc:170] Inserting onto call queue
0925 16:42:20.250522 (+ 138us) service_pool.cc:227] Handling call
0925 16:42:20.761376 (+510854us) inbound_call.cc:173] Queueing success response
Metrics: {}
W20260925 16:42:20.945147 1220 rpcz_store.cc:267] Call kudu.rpc.GenericCalculatorService.Sleep from unix:<unnamed> (request call id 7) took 510 ms (client timeout 10 ms). Trace:
W20260925 16:42:20.945490 1220 rpcz_store.cc:269] 0925 16:42:20.434378 (+ 0us) service_pool.cc:170] Inserting onto call queue
0925 16:42:20.434521 (+ 143us) service_pool.cc:227] Handling call
0925 16:42:20.945091 (+510570us) inbound_call.cc:173] Queueing success response
Metrics: {}
I20260925 16:42:21.612344 794 rpc-test-base.h:595] status: Timed out: Sleep RPC to unix:/tmp/dist-test-task7SuTCk/test-tmp/rpc-test-77b2e6905fb64d458f43a03e0bc9dfa4.sock timed out after 1.000s (SENT), seconds elapsed: 1.0017
I20260925 16:42:21.614264 1220 rpc-test-base.h:222] got call: sleep_micros: 1500000
W20260925 16:42:22.122610 1222 rpcz_store.cc:267] Call kudu.rpc.GenericCalculatorService.Sleep from unix:<unnamed> (request call id 12) took 1511 ms (client timeout 1000 ms). Trace:
W20260925 16:42:22.122943 1222 rpcz_store.cc:269] 0925 16:42:20.611258 (+ 0us) service_pool.cc:170] Inserting onto call queue
0925 16:42:20.621906 (+ 10648us) service_pool.cc:227] Handling call
0925 16:42:22.122472 (+1500566us) inbound_call.cc:173] Queueing success response
Metrics: {}
I20260925 16:42:22.614699 794 rpc-test-base.h:595] status: Timed out: Sleep RPC to unix:/tmp/dist-test-task7SuTCk/test-tmp/rpc-test-77b2e6905fb64d458f43a03e0bc9dfa4.sock timed out after 1.000s (SENT), seconds elapsed: 1.00182
W20260925 16:42:22.616181 1215 messenger.cc:357] Unable to handle RPC call: Not implemented: call requires unsupported application feature flags: 99, 1
W20260925 16:42:22.617647 1215 messenger.cc:357] Unable to handle RPC call: Not implemented: call requires unsupported application feature flags: 99, 1
W20260925 16:42:23.114830 1220 rpcz_store.cc:267] Call kudu.rpc.GenericCalculatorService.Sleep from unix:<unnamed> (request call id 13) took 1501 ms (client timeout 1000 ms). Trace:
W20260925 16:42:23.115149 1220 rpcz_store.cc:269] 0925 16:42:21.613939 (+ 0us) service_pool.cc:170] Inserting onto call queue
0925 16:42:21.614151 (+ 212us) service_pool.cc:227] Handling call
0925 16:42:23.114779 (+1500628us) inbound_call.cc:173] Queueing success response
Metrics: {}
W20260925 16:42:23.115676 1215 connection.cc:441] server connection from unix:<unnamed> torn down before Call kudu.rpc.GenericCalculatorService.Sleep from unix:<unnamed> (request call id 13) could send its response
[ OK ] Parameters/TestRpc.TestCancellation/SSL_UnixSocket (3215 ms)
[ RUN ] Parameters/TestRpc.TestCancellationMultiThreads/SSL_UnixSocket
I20260925 16:42:23.151237 1244 acceptor_pool.cc:254] collecting diagnostics on the listening RPC socket unix:/tmp/dist-test-task7SuTCk/test-tmp/rpc-test-c47311cd04494799826ee19ba3b9301c.sock every 8 connection(s)
I20260925 16:42:23.152081 1245 acceptor_pool.cc:254] collecting diagnostics on the listening RPC socket unix:/tmp/dist-test-task7SuTCk/test-tmp/rpc-test-c47311cd04494799826ee19ba3b9301c.sock every 8 connection(s)
I20260925 16:42:23.155766 794 rpc-test.cc:1808] Connecting to unix:/tmp/dist-test-task7SuTCk/test-tmp/rpc-test-c47311cd04494799826ee19ba3b9301c.sock
I20260925 16:42:23.314898 1258 test_util.cc:268] Using random seed: 1720944492
I20260925 16:42:23.316191 1259 test_util.cc:268] Using random seed: 1720945866
I20260925 16:42:23.318276 1260 test_util.cc:268] Using random seed: 1720947836
I20260925 16:42:23.319654 1261 test_util.cc:268] Using random seed: 1720949303
I20260925 16:42:23.321467 1262 test_util.cc:268] Using random seed: 1720950964
I20260925 16:42:23.323297 1263 test_util.cc:268] Using random seed: 1720952845
I20260925 16:42:23.325443 1264 test_util.cc:268] Using random seed: 1720954934
I20260925 16:42:23.327301 1265 test_util.cc:268] Using random seed: 1720956397
I20260925 16:42:23.328770 1266 test_util.cc:268] Using random seed: 1720958304
I20260925 16:42:23.330590 1267 test_util.cc:268] Using random seed: 1720960125
I20260925 16:42:23.332603 1268 test_util.cc:268] Using random seed: 1720962133
I20260925 16:42:23.336764 1270 test_util.cc:268] Using random seed: 1720965592
I20260925 16:42:23.337625 1269 test_util.cc:268] Using random seed: 1720964141
I20260925 16:42:23.338748 1271 test_util.cc:268] Using random seed: 1720968245
I20260925 16:42:23.340685 1272 test_util.cc:268] Using random seed: 1720970240
I20260925 16:42:23.342741 1273 test_util.cc:268] Using random seed: 1720972245
I20260925 16:42:23.345176 1274 test_util.cc:268] Using random seed: 1720974657
I20260925 16:42:23.347271 1275 test_util.cc:268] Using random seed: 1720976307
I20260925 16:42:23.349232 1276 test_util.cc:268] Using random seed: 1720978751
I20260925 16:42:23.351454 1277 test_util.cc:268] Using random seed: 1720981006
I20260925 16:42:23.353286 1278 test_util.cc:268] Using random seed: 1720982770
I20260925 16:42:23.355334 1279 test_util.cc:268] Using random seed: 1720984878
I20260925 16:42:23.357746 1280 test_util.cc:268] Using random seed: 1720987290
I20260925 16:42:23.359972 1281 test_util.cc:268] Using random seed: 1720989484
I20260925 16:42:23.362093 1282 test_util.cc:268] Using random seed: 1720991180
I20260925 16:42:23.363636 1283 test_util.cc:268] Using random seed: 1720993173
I20260925 16:42:23.365338 1284 test_util.cc:268] Using random seed: 1720994836
I20260925 16:42:23.367444 1285 test_util.cc:268] Using random seed: 1720996909
I20260925 16:42:23.369360 1286 test_util.cc:268] Using random seed: 1720998883
I20260925 16:42:23.371351 1287 test_util.cc:268] Using random seed: 1721000413
W20260925 16:42:43.702014 1241 connection.cc:196] Error closing socket: Network error: TlsSocket::Close: Broken pipe
[ OK ] Parameters/TestRpc.TestCancellationMultiThreads/SSL_UnixSocket (20596 ms)
[ RUN ] Parameters/TestRpc.TestCallId/SSL_UnixSocket
I20260925 16:42:43.743145 1301 acceptor_pool.cc:254] collecting diagnostics on the listening RPC socket unix:/tmp/dist-test-task7SuTCk/test-tmp/rpc-test-33dbfc8605d74fc381cefeadc29e3a64.sock every 8 connection(s)
I20260925 16:42:43.744017 1302 acceptor_pool.cc:254] collecting diagnostics on the listening RPC socket unix:/tmp/dist-test-task7SuTCk/test-tmp/rpc-test-33dbfc8605d74fc381cefeadc29e3a64.sock every 8 connection(s)
[ OK ] Parameters/TestRpc.TestCallId/SSL_UnixSocket (82 ms)
[----------] 20 tests from Parameters/TestRpc (39232 ms total)
[----------] Global test environment tear-down
[==========] 21 tests from 2 test suites ran. (42345 ms total)
[ PASSED ] 20 tests.
[ FAILED ] 1 test, listed below:
[ FAILED ] Parameters/TestRpc.TestCallWithChainCertAndRootCA/SSL_UnixSocket, where GetParam() = (true, true)
1 FAILED TEST
I20260925 16:42:43.821712 794 logging.cc:424] LogThrottler /data0/somelongdirectorytoavoidrpathissues/src/kudu/src/kudu/rpc/acceptor_pool.cc:285: suppressed but not reported on 3 messages since previous log ~35 seconds ago